You are viewing a plain text version of this content. The canonical link for it is here.
Posted to builds@beam.apache.org by Apache Jenkins Server <je...@builds.apache.org> on 2022/02/17 00:49:21 UTC

Build failed in Jenkins: beam_PostCommit_XVR_Flink #5055

See <https://ci-beam.apache.org/job/beam_PostCommit_XVR_Flink/5055/display/redirect?page=changes>

Changes:

[Jeff Tapper] Update Java LTS roadmap info on website for Java 17

[Kyle Weaver] [BEAM-13106] Support Flink 1.14.

[Kyle Weaver] [BEAM-13106] Reuse executor instead of shutting it down mid-test.

[Kyle Weaver] [BEAM-13106] Prevent infinite wait in Flink savepoint test.

[Kyle Weaver] [BEAM-13106] A couple additional fixes to FlinkSavepointTest.

[noreply] Bump dataflow.fnapi_container_version (#16874)


------------------------------------------
[...truncated 809.78 KB...]
        type_urn: "beam:artifact:type:file:v1"
        type_payload: "\nr/tmp/artifacts/beam-sdks-java-io-expansion-service-2.38.0-SNAPSHOT-xcsWLXjSklhIQFmqjf1UfdNx-C9yW7oDd_LPQ1JKj2c.jar\022@c5cb162d78d29258484059aa8dfd547dd371f82f725bba0377f2cf43524a8f67"
        role_urn: "beam:artifact:role:staging_to:v1"
        role_payload: "\ncbeam-sdks-java-io-expansion-service-2.38.0-SNAPSHOT-xcsWLXjSklhIQFmqjf1UfdNx-C9yW7oDd_LPQ1JKj2c.jar"
      >
    >
  >
>
root_transform_ids: "e4"
root_transform_ids: "e5"
root_transform_ids: "s1"
root_transform_ids: "s3"
requirements: "beam:requirement:pardo:splittable_dofn:v1"
2022/02/17 00:38:07 Cross-compiling <https://ci-beam.apache.org/job/beam_PostCommit_XVR_Flink/ws/src/sdks/go/test/integration/io/xlang/kafka/kafka_test.go> as /tmp/worker-2-1645058287152963376
2022/02/17 00:38:09 Prepared job with id: go-testkafkaio_basicreadwrite_15a70200-3855-4dae-93be-4e187bdb96ea and staging token: go-testkafkaio_basicreadwrite_15a70200-3855-4dae-93be-4e187bdb96ea
2022/02/17 00:38:10 Staged binary artifact with token: 
2022/02/17 00:38:10 Submitted job: go0testkafkaio0basicreadwrite-jenkins-0217003810-9a394a7f_278bd011-0e68-4feb-b576-3a1bfd110c87
2022/02/17 00:38:10 Job state: STOPPED
2022/02/17 00:38:10 Job state: STARTING
2022/02/17 00:38:10 Job state: RUNNING
2022/02/17 00:39:17 Job state: DONE
2022/02/17 00:39:17 Warning: 6 errors during metrics processing: [failed to deduce Step from MonitoringInfo: urn:"beam:metric:element_count:v1"  type:"beam:metrics:sum_int64:v1"  payload:"\x01"  labels:{key:"PCOLLECTION"  value:"wcCCBghWcbExternal/KafkaIO.Read/KafkaIO.Read.ReadFromKafkaViaUnbounded/Read(KafkaUnboundedSource)/Create/Read(CreateSource)/ParDo(OutputSingleSource)/ParMultiDo(OutputSingleSource).output/PairWithRestriction0"} failed to deduce Step from MonitoringInfo: urn:"beam:metric:element_count:v1"  type:"beam:metrics:sum_int64:v1"  payload:"\x01"  labels:{key:"PCOLLECTION"  value:"wcCCBghWcbExternal/KafkaIO.Read/KafkaIO.Read.ReadFromKafkaViaUnbounded/Read(KafkaUnboundedSource)/Create/Read(CreateSource)/ParDo(OutputSingleSource)/ParMultiDo(OutputSingleSource).output/SplitAndSize0"} failed to deduce Step from MonitoringInfo: urn:"beam:metric:sampled_byte_size:v1"  type:"beam:metrics:distribution_int64:v1"  payload:"\x01\xc9A\xc9A\xc9A"  labels:{key:"PCOLLECTION"  value:"wcCCBghWcbExternal/KafkaIO.Read/KafkaIO.Read.ReadFromKafkaViaUnbounded/Read(KafkaUnboundedSource)/Create/Read(CreateSource)/ParDo(OutputSingleSource)/ParMultiDo(OutputSingleSource).output/SplitAndSize0"} failed to deduce Step from MonitoringInfo: urn:"beam:metric:sampled_byte_size:v1"  type:"beam:metrics:distribution_int64:v1"  payload:"\x01\xbcA\xbcA\xbcA"  labels:{key:"PCOLLECTION"  value:"wcCCBghWcbExternal/KafkaIO.Read/KafkaIO.Read.ReadFromKafkaViaUnbounded/Read(KafkaUnboundedSource)/Create/Read(CreateSource)/ParDo(OutputSingleSource)/ParMultiDo(OutputSingleSource).output/PairWithRestriction0"} failed to deduce Step from MonitoringInfo: urn:"beam:metric:element_count:v1"  type:"beam:metrics:sum_int64:v1"  payload:"\x01"  labels:{key:"PCOLLECTION"  value:"wcCCBghWcbExternal/KafkaIO.Read/KafkaIO.Read.ReadFromKafkaViaUnbounded/Read(KafkaUnboundedSource)/Create/Read(CreateSource)/ParDo(OutputSingleSource)/ParMultiDo(OutputSingleSource).output/SplitAndSize0"} failed to deduce Step from MonitoringInfo: urn:"beam:metric:sampled_byte_size:v1"  type:"beam:metrics:distribution_int64:v1"  payload:"\x01\xc9A\xc9A\xc9A"  labels:{key:"PCOLLECTION"  value:"wcCCBghWcbExternal/KafkaIO.Read/KafkaIO.Read.ReadFromKafkaViaUnbounded/Read(KafkaUnboundedSource)/Create/Read(CreateSource)/ParDo(OutputSingleSource)/ParMultiDo(OutputSingleSource).output/SplitAndSize0"}]
2022/02/17 00:39:17 Warning: 6 errors during metrics processing: [failed to deduce Step from MonitoringInfo: urn:"beam:metric:element_count:v1"  type:"beam:metrics:sum_int64:v1"  payload:"\x01"  labels:{key:"PCOLLECTION"  value:"wcCCBghWcbExternal/KafkaIO.Read/KafkaIO.Read.ReadFromKafkaViaUnbounded/Read(KafkaUnboundedSource)/Create/Read(CreateSource)/ParDo(OutputSingleSource)/ParMultiDo(OutputSingleSource).output/PairWithRestriction0"} failed to deduce Step from MonitoringInfo: urn:"beam:metric:element_count:v1"  type:"beam:metrics:sum_int64:v1"  payload:"\x01"  labels:{key:"PCOLLECTION"  value:"wcCCBghWcbExternal/KafkaIO.Read/KafkaIO.Read.ReadFromKafkaViaUnbounded/Read(KafkaUnboundedSource)/Create/Read(CreateSource)/ParDo(OutputSingleSource)/ParMultiDo(OutputSingleSource).output/SplitAndSize0"} failed to deduce Step from MonitoringInfo: urn:"beam:metric:sampled_byte_size:v1"  type:"beam:metrics:distribution_int64:v1"  payload:"\x01\xc9A\xc9A\xc9A"  labels:{key:"PCOLLECTION"  value:"wcCCBghWcbExternal/KafkaIO.Read/KafkaIO.Read.ReadFromKafkaViaUnbounded/Read(KafkaUnboundedSource)/Create/Read(CreateSource)/ParDo(OutputSingleSource)/ParMultiDo(OutputSingleSource).output/SplitAndSize0"} failed to deduce Step from MonitoringInfo: urn:"beam:metric:sampled_byte_size:v1"  type:"beam:metrics:distribution_int64:v1"  payload:"\x01\xbcA\xbcA\xbcA"  labels:{key:"PCOLLECTION"  value:"wcCCBghWcbExternal/KafkaIO.Read/KafkaIO.Read.ReadFromKafkaViaUnbounded/Read(KafkaUnboundedSource)/Create/Read(CreateSource)/ParDo(OutputSingleSource)/ParMultiDo(OutputSingleSource).output/PairWithRestriction0"} failed to deduce Step from MonitoringInfo: urn:"beam:metric:element_count:v1"  type:"beam:metrics:sum_int64:v1"  payload:"\x01"  labels:{key:"PCOLLECTION"  value:"wcCCBghWcbExternal/KafkaIO.Read/KafkaIO.Read.ReadFromKafkaViaUnbounded/Read(KafkaUnboundedSource)/Create/Read(CreateSource)/ParDo(OutputSingleSource)/ParMultiDo(OutputSingleSource).output/SplitAndSize0"} failed to deduce Step from MonitoringInfo: urn:"beam:metric:sampled_byte_size:v1"  type:"beam:metrics:distribution_int64:v1"  payload:"\x01\xc9A\xc9A\xc9A"  labels:{key:"PCOLLECTION"  value:"wcCCBghWcbExternal/KafkaIO.Read/KafkaIO.Read.ReadFromKafkaViaUnbounded/Read(KafkaUnboundedSource)/Create/Read(CreateSource)/ParDo(OutputSingleSource)/ParMultiDo(OutputSingleSource).output/SplitAndSize0"}]
--- PASS: TestKafkaIO_BasicReadWrite (97.97s)
PASS
ok  	github.com/apache/beam/sdks/v2/go/test/integration/io/xlang/kafka	101.068s
FAIL

> Task :runners:flink:1.13:job-server:validatesCrossLanguageRunnerGoUsingJava FAILED
> Task :runners:flink:1.13:job-server:validatesCrossLanguageRunnerJavaUsingJava

org.apache.beam.runners.core.construction.ValidateRunnerXlangTest$CoGroupByKeyTest > test FAILED
    org.apache.beam.vendor.grpc.v1p43p2.io.grpc.StatusRuntimeException at ValidateRunnerXlangTest.java:345
        Caused by: org.apache.beam.vendor.grpc.v1p43p2.io.netty.channel.AbstractChannel$AnnotatedConnectException
            Caused by: java.net.ConnectException at Errors.java:155
    java.lang.NullPointerException at ValidateRunnerXlangTest.java:340

org.apache.beam.runners.core.construction.ValidateRunnerXlangTest$CombineGloballyTest > test FAILED
    org.apache.beam.vendor.grpc.v1p43p2.io.grpc.StatusRuntimeException at ValidateRunnerXlangTest.java:362
        Caused by: org.apache.beam.vendor.grpc.v1p43p2.io.netty.channel.AbstractChannel$AnnotatedConnectException
            Caused by: java.net.ConnectException at Errors.java:155
    java.lang.NullPointerException at ValidateRunnerXlangTest.java:357

org.apache.beam.runners.core.construction.ValidateRunnerXlangTest$CombinePerKeyTest > test FAILED
    org.apache.beam.vendor.grpc.v1p43p2.io.grpc.StatusRuntimeException at ValidateRunnerXlangTest.java:379
        Caused by: org.apache.beam.vendor.grpc.v1p43p2.io.netty.channel.AbstractChannel$AnnotatedConnectException
            Caused by: java.net.ConnectException at Errors.java:155
    java.lang.NullPointerException at ValidateRunnerXlangTest.java:374

org.apache.beam.runners.core.construction.ValidateRunnerXlangTest$FlattenTest > test FAILED
    org.apache.beam.vendor.grpc.v1p43p2.io.grpc.StatusRuntimeException at ValidateRunnerXlangTest.java:396
        Caused by: org.apache.beam.vendor.grpc.v1p43p2.io.netty.channel.AbstractChannel$AnnotatedConnectException
            Caused by: java.net.ConnectException at Errors.java:155
    java.lang.NullPointerException at ValidateRunnerXlangTest.java:391

org.apache.beam.runners.core.construction.ValidateRunnerXlangTest$GroupByKeyTest > test FAILED
    org.apache.beam.vendor.grpc.v1p43p2.io.grpc.StatusRuntimeException at ValidateRunnerXlangTest.java:327
        Caused by: org.apache.beam.vendor.grpc.v1p43p2.io.netty.channel.AbstractChannel$AnnotatedConnectException
            Caused by: java.net.ConnectException at Errors.java:155
    java.lang.NullPointerException at ValidateRunnerXlangTest.java:322

org.apache.beam.runners.core.construction.ValidateRunnerXlangTest$MultiInputOutputWithSideInputTest > test FAILED
    org.apache.beam.vendor.grpc.v1p43p2.io.grpc.StatusRuntimeException at ValidateRunnerXlangTest.java:309
        Caused by: org.apache.beam.vendor.grpc.v1p43p2.io.netty.channel.AbstractChannel$AnnotatedConnectException
            Caused by: java.net.ConnectException at Errors.java:155
    java.lang.NullPointerException at ValidateRunnerXlangTest.java:304

org.apache.beam.runners.core.construction.ValidateRunnerXlangTest$PartitionTest > test FAILED
    org.apache.beam.vendor.grpc.v1p43p2.io.grpc.StatusRuntimeException at ValidateRunnerXlangTest.java:414
        Caused by: org.apache.beam.vendor.grpc.v1p43p2.io.netty.channel.AbstractChannel$AnnotatedConnectException
            Caused by: java.net.ConnectException at Errors.java:155
    java.lang.NullPointerException at ValidateRunnerXlangTest.java:409

org.apache.beam.runners.core.construction.ValidateRunnerXlangTest$SingleInputOutputTest > test FAILED
    org.apache.beam.vendor.grpc.v1p43p2.io.grpc.StatusRuntimeException at ValidateRunnerXlangTest.java:292
        Caused by: org.apache.beam.vendor.grpc.v1p43p2.io.netty.channel.AbstractChannel$AnnotatedConnectException
            Caused by: java.net.ConnectException at Errors.java:155
    java.lang.NullPointerException at ValidateRunnerXlangTest.java:287

8 tests completed, 8 failed

> Task :runners:flink:1.13:job-server:validatesCrossLanguageRunnerJavaUsingJava FAILED
> Task :runners:flink:1.13:job-server:validatesCrossLanguageRunnerJavaUsingPython

org.apache.beam.runners.core.construction.ValidateRunnerXlangTest$CoGroupByKeyTest > test FAILED
    org.apache.beam.vendor.grpc.v1p43p2.io.grpc.StatusRuntimeException at ValidateRunnerXlangTest.java:345
        Caused by: org.apache.beam.vendor.grpc.v1p43p2.io.netty.channel.AbstractChannel$AnnotatedConnectException
            Caused by: java.net.ConnectException at Errors.java:155
    java.lang.NullPointerException at ValidateRunnerXlangTest.java:340

org.apache.beam.runners.core.construction.ValidateRunnerXlangTest$CombineGloballyTest > test FAILED
    org.apache.beam.vendor.grpc.v1p43p2.io.grpc.StatusRuntimeException at ValidateRunnerXlangTest.java:362
        Caused by: org.apache.beam.vendor.grpc.v1p43p2.io.netty.channel.AbstractChannel$AnnotatedConnectException
            Caused by: java.net.ConnectException at Errors.java:155
    java.lang.NullPointerException at ValidateRunnerXlangTest.java:357

org.apache.beam.runners.core.construction.ValidateRunnerXlangTest$CombinePerKeyTest > test FAILED
    org.apache.beam.vendor.grpc.v1p43p2.io.grpc.StatusRuntimeException at ValidateRunnerXlangTest.java:379
        Caused by: org.apache.beam.vendor.grpc.v1p43p2.io.netty.channel.AbstractChannel$AnnotatedConnectException
            Caused by: java.net.ConnectException at Errors.java:155
    java.lang.NullPointerException at ValidateRunnerXlangTest.java:374

org.apache.beam.runners.core.construction.ValidateRunnerXlangTest$FlattenTest > test FAILED
    org.apache.beam.vendor.grpc.v1p43p2.io.grpc.StatusRuntimeException at ValidateRunnerXlangTest.java:396
        Caused by: org.apache.beam.vendor.grpc.v1p43p2.io.netty.channel.AbstractChannel$AnnotatedConnectException
            Caused by: java.net.ConnectException at Errors.java:155
    java.lang.NullPointerException at ValidateRunnerXlangTest.java:391

org.apache.beam.runners.core.construction.ValidateRunnerXlangTest$GroupByKeyTest > test FAILED
    org.apache.beam.vendor.grpc.v1p43p2.io.grpc.StatusRuntimeException at ValidateRunnerXlangTest.java:327
        Caused by: org.apache.beam.vendor.grpc.v1p43p2.io.netty.channel.AbstractChannel$AnnotatedConnectException
            Caused by: java.net.ConnectException at Errors.java:155
    java.lang.NullPointerException at ValidateRunnerXlangTest.java:322

org.apache.beam.runners.core.construction.ValidateRunnerXlangTest$MultiInputOutputWithSideInputTest > test FAILED
    org.apache.beam.vendor.grpc.v1p43p2.io.grpc.StatusRuntimeException at ValidateRunnerXlangTest.java:309
        Caused by: org.apache.beam.vendor.grpc.v1p43p2.io.netty.channel.AbstractChannel$AnnotatedConnectException
            Caused by: java.net.ConnectException at Errors.java:155
    java.lang.NullPointerException at ValidateRunnerXlangTest.java:304

org.apache.beam.runners.core.construction.ValidateRunnerXlangTest$PartitionTest > test FAILED
    org.apache.beam.vendor.grpc.v1p43p2.io.grpc.StatusRuntimeException at ValidateRunnerXlangTest.java:414
        Caused by: org.apache.beam.vendor.grpc.v1p43p2.io.netty.channel.AbstractChannel$AnnotatedConnectException
            Caused by: java.net.ConnectException at Errors.java:155
    java.lang.NullPointerException at ValidateRunnerXlangTest.java:409

org.apache.beam.runners.core.construction.ValidateRunnerXlangTest$SingleInputOutputTest > test FAILED
    org.apache.beam.vendor.grpc.v1p43p2.io.grpc.StatusRuntimeException at ValidateRunnerXlangTest.java:292
        Caused by: org.apache.beam.vendor.grpc.v1p43p2.io.netty.channel.AbstractChannel$AnnotatedConnectException
            Caused by: java.net.ConnectException at Errors.java:155
    java.lang.NullPointerException at ValidateRunnerXlangTest.java:287

8 tests completed, 8 failed

> Task :runners:flink:1.13:job-server:validatesCrossLanguageRunnerJavaUsingPython FAILED

> Task :runners:flink:1.13:job-server:validatesCrossLanguageRunnerJavaUsingPythonOnly

org.apache.beam.runners.core.construction.ValidateRunnerXlangTest$PythonDependenciesTest > test FAILED
    org.apache.beam.vendor.grpc.v1p43p2.io.grpc.StatusRuntimeException at ValidateRunnerXlangTest.java:423
        Caused by: org.apache.beam.vendor.grpc.v1p43p2.io.netty.channel.AbstractChannel$AnnotatedConnectException
            Caused by: java.net.ConnectException at Errors.java:155
    java.lang.NullPointerException at ValidateRunnerXlangTest.java:418

1 test completed, 1 failed

> Task :runners:flink:1.13:job-server:validatesCrossLanguageRunnerJavaUsingPythonOnly FAILED
> Task :runners:flink:1.13:job-server:validatesCrossLanguageRunnerPythonUsingJava FAILED
> Task :runners:flink:1.13:job-server:validatesCrossLanguageRunnerPythonUsingPython FAILED
> Task :runners:flink:1.13:job-server:validatesCrossLanguageRunnerPythonUsingSql
> Task :runners:flink:1.13:job-server:validatesCrossLanguageRunnerCleanup
> Task :runners:flink:1.13:job-server:flinkJobServerCleanup

FAILURE: Build completed with 6 failures.

1: Task failed with an exception.
-----------
* Where:
Build file '<https://ci-beam.apache.org/job/beam_PostCommit_XVR_Flink/ws/src/sdks/go/test/build.gradle'> line: 176

* What went wrong:
Execution failed for task ':runners:flink:1.13:job-server:validatesCrossLanguageRunnerGoUsingJava'.
> Process 'command 'sh'' finished with non-zero exit value 1

* Try:
> Run with --stacktrace option to get the stack trace.
> Run with --info or --debug option to get more log output.
> Run with --scan to get full insights.
==============================================================================

2: Task failed with an exception.
-----------
* What went wrong:
Execution failed for task ':runners:flink:1.13:job-server:validatesCrossLanguageRunnerJavaUsingJava'.
> There were failing tests. See the report at: file://<https://ci-beam.apache.org/job/beam_PostCommit_XVR_Flink/ws/src/runners/flink/1.13/job-server/build/reports/tests/validatesCrossLanguageRunnerJavaUsingJava/index.html>

* Try:
> Run with --stacktrace option to get the stack trace.
> Run with --info or --debug option to get more log output.
> Run with --scan to get full insights.
==============================================================================

3: Task failed with an exception.
-----------
* What went wrong:
Execution failed for task ':runners:flink:1.13:job-server:validatesCrossLanguageRunnerJavaUsingPython'.
> There were failing tests. See the report at: file://<https://ci-beam.apache.org/job/beam_PostCommit_XVR_Flink/ws/src/runners/flink/1.13/job-server/build/reports/tests/validatesCrossLanguageRunnerJavaUsingPython/index.html>

* Try:
> Run with --stacktrace option to get the stack trace.
> Run with --info or --debug option to get more log output.
> Run with --scan to get full insights.
==============================================================================

4: Task failed with an exception.
-----------
* What went wrong:
Execution failed for task ':runners:flink:1.13:job-server:validatesCrossLanguageRunnerJavaUsingPythonOnly'.
> There were failing tests. See the report at: file://<https://ci-beam.apache.org/job/beam_PostCommit_XVR_Flink/ws/src/runners/flink/1.13/job-server/build/reports/tests/validatesCrossLanguageRunnerJavaUsingPythonOnly/index.html>

* Try:
> Run with --stacktrace option to get the stack trace.
> Run with --info or --debug option to get more log output.
> Run with --scan to get full insights.
==============================================================================

5: Task failed with an exception.
-----------
* What went wrong:
Execution failed for task ':runners:flink:1.13:job-server:validatesCrossLanguageRunnerPythonUsingJava'.
> Process 'command 'sh'' finished with non-zero exit value 1

* Try:
> Run with --stacktrace option to get the stack trace.
> Run with --info or --debug option to get more log output.
> Run with --scan to get full insights.
==============================================================================

6: Task failed with an exception.
-----------
* What went wrong:
Execution failed for task ':runners:flink:1.13:job-server:validatesCrossLanguageRunnerPythonUsingPython'.
> Process 'command 'sh'' finished with non-zero exit value 1

* Try:
> Run with --stacktrace option to get the stack trace.
> Run with --info or --debug option to get more log output.
> Run with --scan to get full insights.
==============================================================================

* Get more help at https://help.gradle.org

Deprecated Gradle features were used in this build, making it incompatible with Gradle 8.0.

You can use '--warning-mode all' to show the individual deprecation warnings and determine if they come from your own scripts or plugins.

See https://docs.gradle.org/7.3.2/userguide/command_line_interface.html#sec:command_line_warnings

Execution optimizations have been disabled for 1 invalid unit(s) of work during this build to ensure correctness.
Please consult deprecation warnings for more details.

BUILD FAILED in 29m 38s
256 actionable tasks: 185 executed, 60 from cache, 11 up-to-date

Publishing build scan...
https://gradle.com/s/n6aeioykowhog

Build step 'Invoke Gradle script' changed build result to FAILURE
Build step 'Invoke Gradle script' marked build as failure

---------------------------------------------------------------------
To unsubscribe, e-mail: builds-unsubscribe@beam.apache.org
For additional commands, e-mail: builds-help@beam.apache.org


Jenkins build is back to normal : beam_PostCommit_XVR_Flink #5056

Posted by Apache Jenkins Server <je...@builds.apache.org>.
See <https://ci-beam.apache.org/job/beam_PostCommit_XVR_Flink/5056/display/redirect?page=changes>


---------------------------------------------------------------------
To unsubscribe, e-mail: builds-unsubscribe@beam.apache.org
For additional commands, e-mail: builds-help@beam.apache.org