You are viewing a plain text version of this content. The canonical link for it is here.
Posted to builds@beam.apache.org by Apache Jenkins Server <je...@builds.apache.org> on 2019/07/04 12:36:23 UTC
Build failed in Jenkins: beam_PostCommit_Py_ValCont #3718
See <https://builds.apache.org/job/beam_PostCommit_Py_ValCont/3718/display/redirect>
------------------------------------------
[...truncated 207.31 KB...]
copying apache_beam/utils/retry_test.py -> apache-beam-2.15.0.dev0/apache_beam/utils
copying apache_beam/utils/timestamp.py -> apache-beam-2.15.0.dev0/apache_beam/utils
copying apache_beam/utils/timestamp_test.py -> apache-beam-2.15.0.dev0/apache_beam/utils
copying apache_beam/utils/urns.py -> apache-beam-2.15.0.dev0/apache_beam/utils
copying apache_beam/utils/windowed_value.pxd -> apache-beam-2.15.0.dev0/apache_beam/utils
copying apache_beam/utils/windowed_value.py -> apache-beam-2.15.0.dev0/apache_beam/utils
copying apache_beam/utils/windowed_value_test.py -> apache-beam-2.15.0.dev0/apache_beam/utils
Writing apache-beam-2.15.0.dev0/setup.cfg
creating dist
Creating tar archive
removing 'apache-beam-2.15.0.dev0' (and everything under it)
SDK_LOCATION=$(find dist/apache-beam-*.tar.gz)
find dist/apache-beam-*.tar.gz
# Run ValidatesRunner tests on Google Cloud Dataflow service
echo ">>> RUNNING DATAFLOW RUNNER VALIDATESCONTAINER TEST"
>>> RUNNING DATAFLOW RUNNER VALIDATESCONTAINER TEST
python setup.py nosetests \
--attr ValidatesContainer \
--nologcapture \
--processes=1 \
--process-timeout=900 \
--test-pipeline-options=" \
--runner=TestDataflowRunner \
--project=$PROJECT \
--worker_harness_container_image=$CONTAINER:$TAG \
--staging_location=$GCS_LOCATION/staging-validatesrunner-test \
--temp_location=$GCS_LOCATION/temp-validatesrunner-test \
--output=$GCS_LOCATION/output \
--sdk_location=$SDK_LOCATION \
--num_workers=1"
<https://builds.apache.org/job/beam_PostCommit_Py_ValCont/ws/src/sdks/python/container/venv/python/local/lib/python2.7/site-packages/setuptools/dist.py>:472: UserWarning: Normalizing '2.15.0.dev' to '2.15.0.dev0'
normalized_version,
running nosetests
running egg_info
<https://builds.apache.org/job/beam_PostCommit_Py_ValCont/ws/src/sdks/python/gen_protos.py>:57: UserWarning: Installing grpcio-tools is recommended for development.
warnings.warn('Installing grpcio-tools is recommended for development.')
writing requirements to apache_beam.egg-info/requires.txt
writing apache_beam.egg-info/PKG-INFO
writing top-level names to apache_beam.egg-info/top_level.txt
writing dependency_links to apache_beam.egg-info/dependency_links.txt
writing entry points to apache_beam.egg-info/entry_points.txt
reading manifest file 'apache_beam.egg-info/SOURCES.txt'
reading manifest template 'MANIFEST.in'
warning: no files found matching 'README.md'
warning: no files found matching 'NOTICE'
warning: no files found matching 'LICENSE'
writing manifest file 'apache_beam.egg-info/SOURCES.txt'
WARNING:root:Using deprecated Datastore client.
This client will be removed in Beam 3.0 (next Beam major release).
Please migrate to apache_beam.io.gcp.datastore.v1new.datastoreio.
WARNING:root:python-snappy is not installed; some tests will be skipped.
WARNING:root:Tensorflow is not installed, so skipping some tests.
test_wordcount_fnapi_it (apache_beam.examples.wordcount_it_test.WordCountIT) ... ERROR
WARNING:root:Discarding unparseable args: ['--output=gs://temp-storage-for-end-to-end-tests/output']
WARNING:root:Discarding unparseable args: ['--output=gs://temp-storage-for-end-to-end-tests/output']
test_metrics_fnapi_it (apache_beam.runners.dataflow.dataflow_exercise_metrics_pipeline_test.ExerciseMetricsPipelineTest) ... ERROR
======================================================================
ERROR: test_wordcount_fnapi_it (apache_beam.examples.wordcount_it_test.WordCountIT)
----------------------------------------------------------------------
Traceback (most recent call last):
File "<https://builds.apache.org/job/beam_PostCommit_Py_ValCont/ws/src/sdks/python/apache_beam/examples/wordcount_it_test.py",> line 52, in test_wordcount_fnapi_it
self._run_wordcount_it(wordcount.run, experiment='beam_fn_api')
File "<https://builds.apache.org/job/beam_PostCommit_Py_ValCont/ws/src/sdks/python/apache_beam/examples/wordcount_it_test.py",> line 84, in _run_wordcount_it
run_wordcount(test_pipeline.get_full_options_as_args(**extra_opts))
File "<https://builds.apache.org/job/beam_PostCommit_Py_ValCont/ws/src/sdks/python/apache_beam/examples/wordcount.py",> line 114, in run
result = p.run()
File "<https://builds.apache.org/job/beam_PostCommit_Py_ValCont/ws/src/sdks/python/apache_beam/pipeline.py",> line 406, in run
self._options).run(False)
File "<https://builds.apache.org/job/beam_PostCommit_Py_ValCont/ws/src/sdks/python/apache_beam/pipeline.py",> line 419, in run
return self.runner.run_pipeline(self, self._options)
File "<https://builds.apache.org/job/beam_PostCommit_Py_ValCont/ws/src/sdks/python/apache_beam/runners/dataflow/test_dataflow_runner.py",> line 64, in run_pipeline
self.result.wait_until_finish(duration=wait_duration)
File "<https://builds.apache.org/job/beam_PostCommit_Py_ValCont/ws/src/sdks/python/apache_beam/runners/dataflow/dataflow_runner.py",> line 1338, in wait_until_finish
(self.state, getattr(self._runner, 'last_error_msg', None)), self)
DataflowRuntimeException: Dataflow pipeline failed. State: FAILED, Error:
java.util.concurrent.ExecutionException: java.lang.RuntimeException: Error received from SDK harness for instruction -288: Traceback (most recent call last):
File "/usr/local/lib/python2.7/site-packages/apache_beam/runners/worker/sdk_worker.py", line 157, in _execute
response = task()
File "/usr/local/lib/python2.7/site-packages/apache_beam/runners/worker/sdk_worker.py", line 190, in <lambda>
self._execute(lambda: worker.do_instruction(work), work)
File "/usr/local/lib/python2.7/site-packages/apache_beam/runners/worker/sdk_worker.py", line 342, in do_instruction
request.instruction_id)
File "/usr/local/lib/python2.7/site-packages/apache_beam/runners/worker/sdk_worker.py", line 368, in process_bundle
bundle_processor.process_bundle(instruction_id))
File "/usr/local/lib/python2.7/site-packages/apache_beam/runners/worker/bundle_processor.py", line 593, in process_bundle
data.ptransform_id].process_encoded(data.data)
KeyError: u'\n\x04-266\x12\x04-264'
at java.util.concurrent.CompletableFuture.reportGet(CompletableFuture.java:357)
at java.util.concurrent.CompletableFuture.get(CompletableFuture.java:1895)
at org.apache.beam.sdk.util.MoreFutures.get(MoreFutures.java:57)
at org.apache.beam.runners.dataflow.worker.fn.control.RegisterAndProcessBundleOperation.finish(RegisterAndProcessBundleOperation.java:285)
at org.apache.beam.runners.dataflow.worker.util.common.worker.MapTaskExecutor.execute(MapTaskExecutor.java:85)
at org.apache.beam.runners.dataflow.worker.fn.control.BeamFnMapTaskExecutor.execute(BeamFnMapTaskExecutor.java:125)
at org.apache.beam.runners.dataflow.worker.BatchDataflowWorker.executeWork(BatchDataflowWorker.java:412)
at org.apache.beam.runners.dataflow.worker.BatchDataflowWorker.doWork(BatchDataflowWorker.java:381)
at org.apache.beam.runners.dataflow.worker.BatchDataflowWorker.getAndPerformWork(BatchDataflowWorker.java:306)
at org.apache.beam.runners.dataflow.worker.DataflowRunnerHarness.start(DataflowRunnerHarness.java:195)
at org.apache.beam.runners.dataflow.worker.DataflowRunnerHarness.main(DataflowRunnerHarness.java:123)
Suppressed: java.lang.IllegalStateException: Already closed.
at org.apache.beam.sdk.fn.data.BeamFnDataBufferingOutboundObserver.close(BeamFnDataBufferingOutboundObserver.java:95)
at org.apache.beam.runners.dataflow.worker.fn.data.RemoteGrpcPortWriteOperation.abort(RemoteGrpcPortWriteOperation.java:215)
at org.apache.beam.runners.dataflow.worker.util.common.worker.MapTaskExecutor.execute(MapTaskExecutor.java:91)
... 6 more
Caused by: java.lang.RuntimeException: Error received from SDK harness for instruction -288: Traceback (most recent call last):
File "/usr/local/lib/python2.7/site-packages/apache_beam/runners/worker/sdk_worker.py", line 157, in _execute
response = task()
File "/usr/local/lib/python2.7/site-packages/apache_beam/runners/worker/sdk_worker.py", line 190, in <lambda>
self._execute(lambda: worker.do_instruction(work), work)
File "/usr/local/lib/python2.7/site-packages/apache_beam/runners/worker/sdk_worker.py", line 342, in do_instruction
request.instruction_id)
File "/usr/local/lib/python2.7/site-packages/apache_beam/runners/worker/sdk_worker.py", line 368, in process_bundle
bundle_processor.process_bundle(instruction_id))
File "/usr/local/lib/python2.7/site-packages/apache_beam/runners/worker/bundle_processor.py", line 593, in process_bundle
data.ptransform_id].process_encoded(data.data)
KeyError: u'\n\x04-266\x12\x04-264'
at org.apache.beam.runners.fnexecution.control.FnApiControlClient$ResponseStreamObserver.onNext(FnApiControlClient.java:157)
at org.apache.beam.runners.fnexecution.control.FnApiControlClient$ResponseStreamObserver.onNext(FnApiControlClient.java:140)
at org.apache.beam.vendor.grpc.v1p13p1.io.grpc.stub.ServerCalls$StreamingServerCallHandler$StreamingServerCallListener.onMessage(ServerCalls.java:248)
at org.apache.beam.vendor.grpc.v1p13p1.io.grpc.ForwardingServerCallListener.onMessage(ForwardingServerCallListener.java:33)
at org.apache.beam.vendor.grpc.v1p13p1.io.grpc.Contexts$ContextualizedServerCallListener.onMessage(Contexts.java:76)
at org.apache.beam.vendor.grpc.v1p13p1.io.grpc.internal.ServerCallImpl$ServerStreamListenerImpl.messagesAvailable(ServerCallImpl.java:263)
at org.apache.beam.vendor.grpc.v1p13p1.io.grpc.internal.ServerImpl$JumpToApplicationThreadServerStreamListener$1MessagesAvailable.runInContext(ServerImpl.java:683)
at org.apache.beam.vendor.grpc.v1p13p1.io.grpc.internal.ContextRunnable.run(ContextRunnable.java:37)
at org.apache.beam.vendor.grpc.v1p13p1.io.grpc.internal.SerializingExecutor.run(SerializingExecutor.java:123)
at java.util.concurrent.ThreadPoolExecutor.runWorker(ThreadPoolExecutor.java:1142)
at java.util.concurrent.ThreadPoolExecutor$Worker.run(ThreadPoolExecutor.java:617)
at java.lang.Thread.run(Thread.java:745)
-------------------- >> begin captured stdout << ---------------------
Found: https://console.cloud.google.com/dataflow/jobsDetail/locations/us-central1/jobs/2019-07-04_05_23_58-11063630514579930569?project=apache-beam-testing.
--------------------- >> end captured stdout << ----------------------
======================================================================
ERROR: test_metrics_fnapi_it (apache_beam.runners.dataflow.dataflow_exercise_metrics_pipeline_test.ExerciseMetricsPipelineTest)
----------------------------------------------------------------------
Traceback (most recent call last):
File "<https://builds.apache.org/job/beam_PostCommit_Py_ValCont/ws/src/sdks/python/apache_beam/runners/dataflow/dataflow_exercise_metrics_pipeline_test.py",> line 60, in test_metrics_fnapi_it
result = self.run_pipeline(experiment='beam_fn_api')
File "<https://builds.apache.org/job/beam_PostCommit_Py_ValCont/ws/src/sdks/python/apache_beam/runners/dataflow/dataflow_exercise_metrics_pipeline_test.py",> line 48, in run_pipeline
return dataflow_exercise_metrics_pipeline.apply_and_run(p)
File "<https://builds.apache.org/job/beam_PostCommit_Py_ValCont/ws/src/sdks/python/apache_beam/runners/dataflow/dataflow_exercise_metrics_pipeline.py",> line 197, in apply_and_run
result = pipeline.run()
File "<https://builds.apache.org/job/beam_PostCommit_Py_ValCont/ws/src/sdks/python/apache_beam/pipeline.py",> line 406, in run
self._options).run(False)
File "<https://builds.apache.org/job/beam_PostCommit_Py_ValCont/ws/src/sdks/python/apache_beam/pipeline.py",> line 419, in run
return self.runner.run_pipeline(self, self._options)
File "<https://builds.apache.org/job/beam_PostCommit_Py_ValCont/ws/src/sdks/python/apache_beam/runners/dataflow/test_dataflow_runner.py",> line 64, in run_pipeline
self.result.wait_until_finish(duration=wait_duration)
File "<https://builds.apache.org/job/beam_PostCommit_Py_ValCont/ws/src/sdks/python/apache_beam/runners/dataflow/dataflow_runner.py",> line 1338, in wait_until_finish
(self.state, getattr(self._runner, 'last_error_msg', None)), self)
DataflowRuntimeException: Dataflow pipeline failed. State: FAILED, Error:
java.util.concurrent.ExecutionException: java.lang.RuntimeException: Error received from SDK harness for instruction -129: Traceback (most recent call last):
File "/usr/local/lib/python2.7/site-packages/apache_beam/runners/worker/sdk_worker.py", line 157, in _execute
response = task()
File "/usr/local/lib/python2.7/site-packages/apache_beam/runners/worker/sdk_worker.py", line 190, in <lambda>
self._execute(lambda: worker.do_instruction(work), work)
File "/usr/local/lib/python2.7/site-packages/apache_beam/runners/worker/sdk_worker.py", line 342, in do_instruction
request.instruction_id)
File "/usr/local/lib/python2.7/site-packages/apache_beam/runners/worker/sdk_worker.py", line 368, in process_bundle
bundle_processor.process_bundle(instruction_id))
File "/usr/local/lib/python2.7/site-packages/apache_beam/runners/worker/bundle_processor.py", line 593, in process_bundle
data.ptransform_id].process_encoded(data.data)
KeyError: u'\n\x04-107\x12\x04-105'
at java.util.concurrent.CompletableFuture.reportGet(CompletableFuture.java:357)
at java.util.concurrent.CompletableFuture.get(CompletableFuture.java:1895)
at org.apache.beam.sdk.util.MoreFutures.get(MoreFutures.java:57)
at org.apache.beam.runners.dataflow.worker.fn.control.RegisterAndProcessBundleOperation.finish(RegisterAndProcessBundleOperation.java:285)
at org.apache.beam.runners.dataflow.worker.util.common.worker.MapTaskExecutor.execute(MapTaskExecutor.java:85)
at org.apache.beam.runners.dataflow.worker.fn.control.BeamFnMapTaskExecutor.execute(BeamFnMapTaskExecutor.java:125)
at org.apache.beam.runners.dataflow.worker.BatchDataflowWorker.executeWork(BatchDataflowWorker.java:412)
at org.apache.beam.runners.dataflow.worker.BatchDataflowWorker.doWork(BatchDataflowWorker.java:381)
at org.apache.beam.runners.dataflow.worker.BatchDataflowWorker.getAndPerformWork(BatchDataflowWorker.java:306)
at org.apache.beam.runners.dataflow.worker.DataflowRunnerHarness.start(DataflowRunnerHarness.java:195)
at org.apache.beam.runners.dataflow.worker.DataflowRunnerHarness.main(DataflowRunnerHarness.java:123)
Suppressed: java.lang.IllegalStateException: Already closed.
at org.apache.beam.sdk.fn.data.BeamFnDataBufferingOutboundObserver.close(BeamFnDataBufferingOutboundObserver.java:95)
at org.apache.beam.runners.dataflow.worker.fn.data.RemoteGrpcPortWriteOperation.abort(RemoteGrpcPortWriteOperation.java:215)
at org.apache.beam.runners.dataflow.worker.util.common.worker.MapTaskExecutor.execute(MapTaskExecutor.java:91)
... 6 more
Caused by: java.lang.RuntimeException: Error received from SDK harness for instruction -129: Traceback (most recent call last):
File "/usr/local/lib/python2.7/site-packages/apache_beam/runners/worker/sdk_worker.py", line 157, in _execute
response = task()
File "/usr/local/lib/python2.7/site-packages/apache_beam/runners/worker/sdk_worker.py", line 190, in <lambda>
self._execute(lambda: worker.do_instruction(work), work)
File "/usr/local/lib/python2.7/site-packages/apache_beam/runners/worker/sdk_worker.py", line 342, in do_instruction
request.instruction_id)
File "/usr/local/lib/python2.7/site-packages/apache_beam/runners/worker/sdk_worker.py", line 368, in process_bundle
bundle_processor.process_bundle(instruction_id))
File "/usr/local/lib/python2.7/site-packages/apache_beam/runners/worker/bundle_processor.py", line 593, in process_bundle
data.ptransform_id].process_encoded(data.data)
KeyError: u'\n\x04-107\x12\x04-105'
at org.apache.beam.runners.fnexecution.control.FnApiControlClient$ResponseStreamObserver.onNext(FnApiControlClient.java:157)
at org.apache.beam.runners.fnexecution.control.FnApiControlClient$ResponseStreamObserver.onNext(FnApiControlClient.java:140)
at org.apache.beam.vendor.grpc.v1p13p1.io.grpc.stub.ServerCalls$StreamingServerCallHandler$StreamingServerCallListener.onMessage(ServerCalls.java:248)
at org.apache.beam.vendor.grpc.v1p13p1.io.grpc.ForwardingServerCallListener.onMessage(ForwardingServerCallListener.java:33)
at org.apache.beam.vendor.grpc.v1p13p1.io.grpc.Contexts$ContextualizedServerCallListener.onMessage(Contexts.java:76)
at org.apache.beam.vendor.grpc.v1p13p1.io.grpc.internal.ServerCallImpl$ServerStreamListenerImpl.messagesAvailable(ServerCallImpl.java:263)
at org.apache.beam.vendor.grpc.v1p13p1.io.grpc.internal.ServerImpl$JumpToApplicationThreadServerStreamListener$1MessagesAvailable.runInContext(ServerImpl.java:683)
at org.apache.beam.vendor.grpc.v1p13p1.io.grpc.internal.ContextRunnable.run(ContextRunnable.java:37)
at org.apache.beam.vendor.grpc.v1p13p1.io.grpc.internal.SerializingExecutor.run(SerializingExecutor.java:123)
at java.util.concurrent.ThreadPoolExecutor.runWorker(ThreadPoolExecutor.java:1142)
at java.util.concurrent.ThreadPoolExecutor$Worker.run(ThreadPoolExecutor.java:617)
at java.lang.Thread.run(Thread.java:745)
-------------------- >> begin captured stdout << ---------------------
Found: https://console.cloud.google.com/dataflow/jobsDetail/locations/us-central1/jobs/2019-07-04_05_30_46-921014861769287707?project=apache-beam-testing.
--------------------- >> end captured stdout << ----------------------
----------------------------------------------------------------------
XML: <https://builds.apache.org/job/beam_PostCommit_Py_ValCont/ws/src/sdks/python/nosetests.xml>
----------------------------------------------------------------------
Ran 2 tests in 744.166s
FAILED (errors=2)
cleanup_container
Untagged: us.gcr.io/apache-beam-testing/jenkins/python:20190704-121650
Untagged: us.gcr.io/apache-beam-testing/jenkins/python@sha256:a8aec62bae3a1d6e6f0fb9fc06a413134ec6d508acc7719398a5c87b7927782f
Deleted: sha256:cab1138f70b3910e8f4bd1d151d0bc9c6117997c37be6e180af06e300f0cf2ee
Deleted: sha256:b8bb563229e2a24da8c04a096cb6635e0de7bc7404eb21be376b78fe65007a7f
Deleted: sha256:a291ecc029f4cecd6d448f33323e430ef2150e51d9dd38b1528dfdde55f95325
Deleted: sha256:0ad3f0a6bf131edac1cac34e9c61121e7981cb435113213bf1107b44d58cb4b7
Deleted: sha256:1d0d2b34f8533459faccadbf0eaf93c62b57812cf4943f815622e4f0c683bcd6
Deleted: sha256:c9617d316354c5027afb111779d4f601ae33f721c9b9f2b86aba4f0900353407
Deleted: sha256:8714433aed9ec9ea78833c99bd392f53db9c85185cb40a1b93afc7797fcca031
Deleted: sha256:a670dcab1dac24128fa469915f54162bb4c45742564298dcdf9fbb2a9044906d
Deleted: sha256:0ec949e0824a7ac58360027a394a430ba4e617f371fa24d448f525d6d0695d46
Deleted: sha256:64f9506411d2c8df71987cdccfd0d2fa2585fffa0e9c670016d71c2c2b7da987
Deleted: sha256:f9de546fbc2dffc65a7c49d88d6c34b48fb22bdc70b84f8e9d7fbc2013042ddd
Deleted: sha256:6fc62be8e6052b03560ac27f1ed61430ac99f68b4991a625c446b029ace72f19
Deleted: sha256:477ecc3178681f79ad9120e770189f8d321dcdf957c0fa2e3fb51e99c6f65064
Deleted: sha256:bf8aadb3bd94b5a5b26bbaed13b3e10bf34d61c88786576a3059b8914be73a42
Digests:
- us.gcr.io/apache-beam-testing/jenkins/python@sha256:a8aec62bae3a1d6e6f0fb9fc06a413134ec6d508acc7719398a5c87b7927782f
Associated tags:
- 20190704-121650
Tags:
- us.gcr.io/apache-beam-testing/jenkins/python:20190704-121650
Deleted [us.gcr.io/apache-beam-testing/jenkins/python:20190704-121650].
Deleted [us.gcr.io/apache-beam-testing/jenkins/python@sha256:a8aec62bae3a1d6e6f0fb9fc06a413134ec6d508acc7719398a5c87b7927782f].
Removed the container
Build step 'Execute shell' marked build as failure
---------------------------------------------------------------------
To unsubscribe, e-mail: builds-unsubscribe@beam.apache.org
For additional commands, e-mail: builds-help@beam.apache.org
Jenkins build is back to normal : beam_PostCommit_Py_ValCont #3720
Posted by Apache Jenkins Server <je...@builds.apache.org>.
See <https://builds.apache.org/job/beam_PostCommit_Py_ValCont/3720/display/redirect>
---------------------------------------------------------------------
To unsubscribe, e-mail: builds-unsubscribe@beam.apache.org
For additional commands, e-mail: builds-help@beam.apache.org
Build failed in Jenkins: beam_PostCommit_Py_ValCont #3719
Posted by Apache Jenkins Server <je...@builds.apache.org>.
See <https://builds.apache.org/job/beam_PostCommit_Py_ValCont/3719/display/redirect>
------------------------------------------
[...truncated 208.25 KB...]
copying apache_beam/utils/retry_test.py -> apache-beam-2.15.0.dev0/apache_beam/utils
copying apache_beam/utils/timestamp.py -> apache-beam-2.15.0.dev0/apache_beam/utils
copying apache_beam/utils/timestamp_test.py -> apache-beam-2.15.0.dev0/apache_beam/utils
copying apache_beam/utils/urns.py -> apache-beam-2.15.0.dev0/apache_beam/utils
copying apache_beam/utils/windowed_value.pxd -> apache-beam-2.15.0.dev0/apache_beam/utils
copying apache_beam/utils/windowed_value.py -> apache-beam-2.15.0.dev0/apache_beam/utils
copying apache_beam/utils/windowed_value_test.py -> apache-beam-2.15.0.dev0/apache_beam/utils
Writing apache-beam-2.15.0.dev0/setup.cfg
creating dist
Creating tar archive
removing 'apache-beam-2.15.0.dev0' (and everything under it)
SDK_LOCATION=$(find dist/apache-beam-*.tar.gz)
find dist/apache-beam-*.tar.gz
# Run ValidatesRunner tests on Google Cloud Dataflow service
echo ">>> RUNNING DATAFLOW RUNNER VALIDATESCONTAINER TEST"
>>> RUNNING DATAFLOW RUNNER VALIDATESCONTAINER TEST
python setup.py nosetests \
--attr ValidatesContainer \
--nologcapture \
--processes=1 \
--process-timeout=900 \
--test-pipeline-options=" \
--runner=TestDataflowRunner \
--project=$PROJECT \
--worker_harness_container_image=$CONTAINER:$TAG \
--staging_location=$GCS_LOCATION/staging-validatesrunner-test \
--temp_location=$GCS_LOCATION/temp-validatesrunner-test \
--output=$GCS_LOCATION/output \
--sdk_location=$SDK_LOCATION \
--num_workers=1"
<https://builds.apache.org/job/beam_PostCommit_Py_ValCont/ws/src/sdks/python/container/venv/python/local/lib/python2.7/site-packages/setuptools/dist.py>:472: UserWarning: Normalizing '2.15.0.dev' to '2.15.0.dev0'
normalized_version,
running nosetests
running egg_info
<https://builds.apache.org/job/beam_PostCommit_Py_ValCont/ws/src/sdks/python/gen_protos.py>:57: UserWarning: Installing grpcio-tools is recommended for development.
warnings.warn('Installing grpcio-tools is recommended for development.')
writing requirements to apache_beam.egg-info/requires.txt
writing apache_beam.egg-info/PKG-INFO
writing top-level names to apache_beam.egg-info/top_level.txt
writing dependency_links to apache_beam.egg-info/dependency_links.txt
writing entry points to apache_beam.egg-info/entry_points.txt
reading manifest file 'apache_beam.egg-info/SOURCES.txt'
reading manifest template 'MANIFEST.in'
warning: no files found matching 'README.md'
warning: no files found matching 'NOTICE'
warning: no files found matching 'LICENSE'
writing manifest file 'apache_beam.egg-info/SOURCES.txt'
WARNING:root:Using deprecated Datastore client.
This client will be removed in Beam 3.0 (next Beam major release).
Please migrate to apache_beam.io.gcp.datastore.v1new.datastoreio.
WARNING:root:python-snappy is not installed; some tests will be skipped.
WARNING:root:Tensorflow is not installed, so skipping some tests.
test_wordcount_fnapi_it (apache_beam.examples.wordcount_it_test.WordCountIT) ... ERROR
WARNING:root:Discarding unparseable args: ['--output=gs://temp-storage-for-end-to-end-tests/output']
WARNING:root:Discarding unparseable args: ['--output=gs://temp-storage-for-end-to-end-tests/output']
test_metrics_fnapi_it (apache_beam.runners.dataflow.dataflow_exercise_metrics_pipeline_test.ExerciseMetricsPipelineTest) ... ERROR
======================================================================
ERROR: test_wordcount_fnapi_it (apache_beam.examples.wordcount_it_test.WordCountIT)
----------------------------------------------------------------------
Traceback (most recent call last):
File "<https://builds.apache.org/job/beam_PostCommit_Py_ValCont/ws/src/sdks/python/apache_beam/examples/wordcount_it_test.py",> line 52, in test_wordcount_fnapi_it
self._run_wordcount_it(wordcount.run, experiment='beam_fn_api')
File "<https://builds.apache.org/job/beam_PostCommit_Py_ValCont/ws/src/sdks/python/apache_beam/examples/wordcount_it_test.py",> line 84, in _run_wordcount_it
run_wordcount(test_pipeline.get_full_options_as_args(**extra_opts))
File "<https://builds.apache.org/job/beam_PostCommit_Py_ValCont/ws/src/sdks/python/apache_beam/examples/wordcount.py",> line 114, in run
result = p.run()
File "<https://builds.apache.org/job/beam_PostCommit_Py_ValCont/ws/src/sdks/python/apache_beam/pipeline.py",> line 406, in run
self._options).run(False)
File "<https://builds.apache.org/job/beam_PostCommit_Py_ValCont/ws/src/sdks/python/apache_beam/pipeline.py",> line 419, in run
return self.runner.run_pipeline(self, self._options)
File "<https://builds.apache.org/job/beam_PostCommit_Py_ValCont/ws/src/sdks/python/apache_beam/runners/dataflow/test_dataflow_runner.py",> line 64, in run_pipeline
self.result.wait_until_finish(duration=wait_duration)
File "<https://builds.apache.org/job/beam_PostCommit_Py_ValCont/ws/src/sdks/python/apache_beam/runners/dataflow/dataflow_runner.py",> line 1338, in wait_until_finish
(self.state, getattr(self._runner, 'last_error_msg', None)), self)
DataflowRuntimeException: Dataflow pipeline failed. State: FAILED, Error:
java.util.concurrent.ExecutionException: java.lang.RuntimeException: Error received from SDK harness for instruction -208: Traceback (most recent call last):
File "/usr/local/lib/python2.7/site-packages/apache_beam/runners/worker/sdk_worker.py", line 157, in _execute
response = task()
File "/usr/local/lib/python2.7/site-packages/apache_beam/runners/worker/sdk_worker.py", line 190, in <lambda>
self._execute(lambda: worker.do_instruction(work), work)
File "/usr/local/lib/python2.7/site-packages/apache_beam/runners/worker/sdk_worker.py", line 342, in do_instruction
request.instruction_id)
File "/usr/local/lib/python2.7/site-packages/apache_beam/runners/worker/sdk_worker.py", line 368, in process_bundle
bundle_processor.process_bundle(instruction_id))
File "/usr/local/lib/python2.7/site-packages/apache_beam/runners/worker/bundle_processor.py", line 593, in process_bundle
data.ptransform_id].process_encoded(data.data)
KeyError: u'\n\x04-186\x12\x04-184'
at java.util.concurrent.CompletableFuture.reportGet(CompletableFuture.java:357)
at java.util.concurrent.CompletableFuture.get(CompletableFuture.java:1895)
at org.apache.beam.sdk.util.MoreFutures.get(MoreFutures.java:57)
at org.apache.beam.runners.dataflow.worker.fn.control.RegisterAndProcessBundleOperation.finish(RegisterAndProcessBundleOperation.java:285)
at org.apache.beam.runners.dataflow.worker.util.common.worker.MapTaskExecutor.execute(MapTaskExecutor.java:85)
at org.apache.beam.runners.dataflow.worker.fn.control.BeamFnMapTaskExecutor.execute(BeamFnMapTaskExecutor.java:125)
at org.apache.beam.runners.dataflow.worker.BatchDataflowWorker.executeWork(BatchDataflowWorker.java:412)
at org.apache.beam.runners.dataflow.worker.BatchDataflowWorker.doWork(BatchDataflowWorker.java:381)
at org.apache.beam.runners.dataflow.worker.BatchDataflowWorker.getAndPerformWork(BatchDataflowWorker.java:306)
at org.apache.beam.runners.dataflow.worker.DataflowRunnerHarness.start(DataflowRunnerHarness.java:195)
at org.apache.beam.runners.dataflow.worker.DataflowRunnerHarness.main(DataflowRunnerHarness.java:123)
Suppressed: java.lang.IllegalStateException: Already closed.
at org.apache.beam.sdk.fn.data.BeamFnDataBufferingOutboundObserver.close(BeamFnDataBufferingOutboundObserver.java:95)
at org.apache.beam.runners.dataflow.worker.fn.data.RemoteGrpcPortWriteOperation.abort(RemoteGrpcPortWriteOperation.java:215)
at org.apache.beam.runners.dataflow.worker.util.common.worker.MapTaskExecutor.execute(MapTaskExecutor.java:91)
... 6 more
Caused by: java.lang.RuntimeException: Error received from SDK harness for instruction -208: Traceback (most recent call last):
File "/usr/local/lib/python2.7/site-packages/apache_beam/runners/worker/sdk_worker.py", line 157, in _execute
response = task()
File "/usr/local/lib/python2.7/site-packages/apache_beam/runners/worker/sdk_worker.py", line 190, in <lambda>
self._execute(lambda: worker.do_instruction(work), work)
File "/usr/local/lib/python2.7/site-packages/apache_beam/runners/worker/sdk_worker.py", line 342, in do_instruction
request.instruction_id)
File "/usr/local/lib/python2.7/site-packages/apache_beam/runners/worker/sdk_worker.py", line 368, in process_bundle
bundle_processor.process_bundle(instruction_id))
File "/usr/local/lib/python2.7/site-packages/apache_beam/runners/worker/bundle_processor.py", line 593, in process_bundle
data.ptransform_id].process_encoded(data.data)
KeyError: u'\n\x04-186\x12\x04-184'
at org.apache.beam.runners.fnexecution.control.FnApiControlClient$ResponseStreamObserver.onNext(FnApiControlClient.java:157)
at org.apache.beam.runners.fnexecution.control.FnApiControlClient$ResponseStreamObserver.onNext(FnApiControlClient.java:140)
at org.apache.beam.vendor.grpc.v1p13p1.io.grpc.stub.ServerCalls$StreamingServerCallHandler$StreamingServerCallListener.onMessage(ServerCalls.java:248)
at org.apache.beam.vendor.grpc.v1p13p1.io.grpc.ForwardingServerCallListener.onMessage(ForwardingServerCallListener.java:33)
at org.apache.beam.vendor.grpc.v1p13p1.io.grpc.Contexts$ContextualizedServerCallListener.onMessage(Contexts.java:76)
at org.apache.beam.vendor.grpc.v1p13p1.io.grpc.internal.ServerCallImpl$ServerStreamListenerImpl.messagesAvailable(ServerCallImpl.java:263)
at org.apache.beam.vendor.grpc.v1p13p1.io.grpc.internal.ServerImpl$JumpToApplicationThreadServerStreamListener$1MessagesAvailable.runInContext(ServerImpl.java:683)
at org.apache.beam.vendor.grpc.v1p13p1.io.grpc.internal.ContextRunnable.run(ContextRunnable.java:37)
at org.apache.beam.vendor.grpc.v1p13p1.io.grpc.internal.SerializingExecutor.run(SerializingExecutor.java:123)
at java.util.concurrent.ThreadPoolExecutor.runWorker(ThreadPoolExecutor.java:1142)
at java.util.concurrent.ThreadPoolExecutor$Worker.run(ThreadPoolExecutor.java:617)
at java.lang.Thread.run(Thread.java:745)
-------------------- >> begin captured stdout << ---------------------
Found: https://console.cloud.google.com/dataflow/jobsDetail/locations/us-central1/jobs/2019-07-04_11_08_43-3863655898976076169?project=apache-beam-testing.
--------------------- >> end captured stdout << ----------------------
======================================================================
ERROR: test_metrics_fnapi_it (apache_beam.runners.dataflow.dataflow_exercise_metrics_pipeline_test.ExerciseMetricsPipelineTest)
----------------------------------------------------------------------
Traceback (most recent call last):
File "<https://builds.apache.org/job/beam_PostCommit_Py_ValCont/ws/src/sdks/python/apache_beam/runners/dataflow/dataflow_exercise_metrics_pipeline_test.py",> line 60, in test_metrics_fnapi_it
result = self.run_pipeline(experiment='beam_fn_api')
File "<https://builds.apache.org/job/beam_PostCommit_Py_ValCont/ws/src/sdks/python/apache_beam/runners/dataflow/dataflow_exercise_metrics_pipeline_test.py",> line 48, in run_pipeline
return dataflow_exercise_metrics_pipeline.apply_and_run(p)
File "<https://builds.apache.org/job/beam_PostCommit_Py_ValCont/ws/src/sdks/python/apache_beam/runners/dataflow/dataflow_exercise_metrics_pipeline.py",> line 197, in apply_and_run
result = pipeline.run()
File "<https://builds.apache.org/job/beam_PostCommit_Py_ValCont/ws/src/sdks/python/apache_beam/pipeline.py",> line 406, in run
self._options).run(False)
File "<https://builds.apache.org/job/beam_PostCommit_Py_ValCont/ws/src/sdks/python/apache_beam/pipeline.py",> line 419, in run
return self.runner.run_pipeline(self, self._options)
File "<https://builds.apache.org/job/beam_PostCommit_Py_ValCont/ws/src/sdks/python/apache_beam/runners/dataflow/test_dataflow_runner.py",> line 64, in run_pipeline
self.result.wait_until_finish(duration=wait_duration)
File "<https://builds.apache.org/job/beam_PostCommit_Py_ValCont/ws/src/sdks/python/apache_beam/runners/dataflow/dataflow_runner.py",> line 1338, in wait_until_finish
(self.state, getattr(self._runner, 'last_error_msg', None)), self)
DataflowRuntimeException: Dataflow pipeline failed. State: FAILED, Error:
java.util.concurrent.ExecutionException: java.lang.RuntimeException: Error received from SDK harness for instruction -129: Traceback (most recent call last):
File "/usr/local/lib/python2.7/site-packages/apache_beam/runners/worker/sdk_worker.py", line 157, in _execute
response = task()
File "/usr/local/lib/python2.7/site-packages/apache_beam/runners/worker/sdk_worker.py", line 190, in <lambda>
self._execute(lambda: worker.do_instruction(work), work)
File "/usr/local/lib/python2.7/site-packages/apache_beam/runners/worker/sdk_worker.py", line 342, in do_instruction
request.instruction_id)
File "/usr/local/lib/python2.7/site-packages/apache_beam/runners/worker/sdk_worker.py", line 368, in process_bundle
bundle_processor.process_bundle(instruction_id))
File "/usr/local/lib/python2.7/site-packages/apache_beam/runners/worker/bundle_processor.py", line 593, in process_bundle
data.ptransform_id].process_encoded(data.data)
KeyError: u'\n\x04-107\x12\x04-105'
at java.util.concurrent.CompletableFuture.reportGet(CompletableFuture.java:357)
at java.util.concurrent.CompletableFuture.get(CompletableFuture.java:1895)
at org.apache.beam.sdk.util.MoreFutures.get(MoreFutures.java:57)
at org.apache.beam.runners.dataflow.worker.fn.control.RegisterAndProcessBundleOperation.finish(RegisterAndProcessBundleOperation.java:285)
at org.apache.beam.runners.dataflow.worker.util.common.worker.MapTaskExecutor.execute(MapTaskExecutor.java:85)
at org.apache.beam.runners.dataflow.worker.fn.control.BeamFnMapTaskExecutor.execute(BeamFnMapTaskExecutor.java:125)
at org.apache.beam.runners.dataflow.worker.BatchDataflowWorker.executeWork(BatchDataflowWorker.java:412)
at org.apache.beam.runners.dataflow.worker.BatchDataflowWorker.doWork(BatchDataflowWorker.java:381)
at org.apache.beam.runners.dataflow.worker.BatchDataflowWorker.getAndPerformWork(BatchDataflowWorker.java:306)
at org.apache.beam.runners.dataflow.worker.DataflowRunnerHarness.start(DataflowRunnerHarness.java:195)
at org.apache.beam.runners.dataflow.worker.DataflowRunnerHarness.main(DataflowRunnerHarness.java:123)
Suppressed: java.lang.IllegalStateException: Already closed.
at org.apache.beam.sdk.fn.data.BeamFnDataBufferingOutboundObserver.close(BeamFnDataBufferingOutboundObserver.java:95)
at org.apache.beam.runners.dataflow.worker.fn.data.RemoteGrpcPortWriteOperation.abort(RemoteGrpcPortWriteOperation.java:215)
at org.apache.beam.runners.dataflow.worker.util.common.worker.MapTaskExecutor.execute(MapTaskExecutor.java:91)
... 6 more
Caused by: java.lang.RuntimeException: Error received from SDK harness for instruction -129: Traceback (most recent call last):
File "/usr/local/lib/python2.7/site-packages/apache_beam/runners/worker/sdk_worker.py", line 157, in _execute
response = task()
File "/usr/local/lib/python2.7/site-packages/apache_beam/runners/worker/sdk_worker.py", line 190, in <lambda>
self._execute(lambda: worker.do_instruction(work), work)
File "/usr/local/lib/python2.7/site-packages/apache_beam/runners/worker/sdk_worker.py", line 342, in do_instruction
request.instruction_id)
File "/usr/local/lib/python2.7/site-packages/apache_beam/runners/worker/sdk_worker.py", line 368, in process_bundle
bundle_processor.process_bundle(instruction_id))
File "/usr/local/lib/python2.7/site-packages/apache_beam/runners/worker/bundle_processor.py", line 593, in process_bundle
data.ptransform_id].process_encoded(data.data)
KeyError: u'\n\x04-107\x12\x04-105'
at org.apache.beam.runners.fnexecution.control.FnApiControlClient$ResponseStreamObserver.onNext(FnApiControlClient.java:157)
at org.apache.beam.runners.fnexecution.control.FnApiControlClient$ResponseStreamObserver.onNext(FnApiControlClient.java:140)
at org.apache.beam.vendor.grpc.v1p13p1.io.grpc.stub.ServerCalls$StreamingServerCallHandler$StreamingServerCallListener.onMessage(ServerCalls.java:248)
at org.apache.beam.vendor.grpc.v1p13p1.io.grpc.ForwardingServerCallListener.onMessage(ForwardingServerCallListener.java:33)
at org.apache.beam.vendor.grpc.v1p13p1.io.grpc.Contexts$ContextualizedServerCallListener.onMessage(Contexts.java:76)
at org.apache.beam.vendor.grpc.v1p13p1.io.grpc.internal.ServerCallImpl$ServerStreamListenerImpl.messagesAvailable(ServerCallImpl.java:263)
at org.apache.beam.vendor.grpc.v1p13p1.io.grpc.internal.ServerImpl$JumpToApplicationThreadServerStreamListener$1MessagesAvailable.runInContext(ServerImpl.java:683)
at org.apache.beam.vendor.grpc.v1p13p1.io.grpc.internal.ContextRunnable.run(ContextRunnable.java:37)
at org.apache.beam.vendor.grpc.v1p13p1.io.grpc.internal.SerializingExecutor.run(SerializingExecutor.java:123)
at java.util.concurrent.ThreadPoolExecutor.runWorker(ThreadPoolExecutor.java:1142)
at java.util.concurrent.ThreadPoolExecutor$Worker.run(ThreadPoolExecutor.java:617)
at java.lang.Thread.run(Thread.java:745)
-------------------- >> begin captured stdout << ---------------------
Found: https://console.cloud.google.com/dataflow/jobsDetail/locations/us-central1/jobs/2019-07-04_11_16_11-10906469653674380520?project=apache-beam-testing.
--------------------- >> end captured stdout << ----------------------
----------------------------------------------------------------------
XML: <https://builds.apache.org/job/beam_PostCommit_Py_ValCont/ws/src/sdks/python/nosetests.xml>
----------------------------------------------------------------------
Ran 2 tests in 815.020s
FAILED (errors=2)
cleanup_container
Untagged: us.gcr.io/apache-beam-testing/jenkins/python:20190704-180011
Untagged: us.gcr.io/apache-beam-testing/jenkins/python@sha256:7804478c37ec3682df3395abf43ca0fcdcbbab78f2feb615de1a20a3d667e019
Deleted: sha256:cb253f66a63544d9392d17636cd262a7fdccb4cb2eff58df2f7eb4017103ef7c
Deleted: sha256:4973a15bb50f72d3aec3df7fdcebdb7b3dd385e8672faa0ad29e8474f5936929
Deleted: sha256:c26a20aa35ab85d43a986ff9986ce40f8a29465cd312569a32cb3570960a60fb
Deleted: sha256:348e925365134bad5d6ad48558c070f12ce8c658e71dc226113f83793cff33a2
Deleted: sha256:350d221d21cc8e909aac90195353036d2395516f655df5f428eb959264d704c5
Deleted: sha256:40569dad9f1ab24247992ea25f4ff6782b7f141c844307fe0df75b5e8fdefea8
Deleted: sha256:29afd2c6efb5835ffd92206c06dcef3859814c4e2b79d9ed46796cbd610e2de1
Deleted: sha256:5fc3f1a3e6c0aee7e160b6523c6ce502e6c81f862bb7b0298efbc5082f3ee6b8
Deleted: sha256:291858aedc63bf7d47fe698693fa38c1251b55935b091443b817b2924e979ef6
Deleted: sha256:73457211c004f14c2f937b67cb9f547bc3b85d83acd3baa26d3b77799652a398
Deleted: sha256:7e13e36844c83629026b086fc959884110381367e3e974d72287a191a36b3664
Deleted: sha256:92850e9324724d46ce0663a81620112e66dd82804c908e148cf0420606f5514c
Deleted: sha256:2e9b34d761c0882b3a58ee9a8465616709e7996b78a723f3a58b31a874bf26cb
Deleted: sha256:841941b37ffc941b8eaf3f3ef75cad1cf3c430772d3ce6ce31a7ca119cced081
Digests:
- us.gcr.io/apache-beam-testing/jenkins/python@sha256:7804478c37ec3682df3395abf43ca0fcdcbbab78f2feb615de1a20a3d667e019
Associated tags:
- 20190704-180011
Tags:
- us.gcr.io/apache-beam-testing/jenkins/python:20190704-180011
Deleted [us.gcr.io/apache-beam-testing/jenkins/python:20190704-180011].
Deleted [us.gcr.io/apache-beam-testing/jenkins/python@sha256:7804478c37ec3682df3395abf43ca0fcdcbbab78f2feb615de1a20a3d667e019].
Removed the container
Build step 'Execute shell' marked build as failure
---------------------------------------------------------------------
To unsubscribe, e-mail: builds-unsubscribe@beam.apache.org
For additional commands, e-mail: builds-help@beam.apache.org