You are viewing a plain text version of this content. The canonical link for it is here.
Posted to commits@cloudstack.apache.org by Apache Jenkins Server <je...@builds.apache.org> on 2016/05/30 08:13:44 UTC
Build failed in Jenkins: cloudstack-apidocs-master #2858
See <https://builds.apache.org/job/cloudstack-apidocs-master/2858/>
------------------------------------------
Started by an SCM change
[EnvInject] - Loading node environment variables.
Building remotely on ubuntu-6 (docker Ubuntu ubuntu yahoo-not-h2) in workspace <https://builds.apache.org/job/cloudstack-apidocs-master/ws/>
java.io.IOException: Failed to install https://repo.maven.apache.org/maven2/org/apache/maven/apache-maven/3.0.4/apache-maven-3.0.4-bin.zip to /home/jenkins/tools/maven/apache-maven-3.0.4
at hudson.FilePath.installIfNecessaryFrom(FilePath.java:832)
at hudson.tools.DownloadFromUrlInstaller.performInstallation(DownloadFromUrlInstaller.java:75)
at hudson.tools.InstallerTranslator.getToolHome(InstallerTranslator.java:68)
at hudson.tools.ToolLocationNodeProperty.getToolHome(ToolLocationNodeProperty.java:108)
at hudson.tools.ToolInstallation.translateFor(ToolInstallation.java:206)
at hudson.tasks.Maven$MavenInstallation.forNode(Maven.java:624)
at hudson.maven.MavenModuleSetBuild.getEnvironment(MavenModuleSetBuild.java:183)
at hudson.plugins.git.GitSCM.checkout(GitSCM.java:1046)
at hudson.scm.SCM.checkout(SCM.java:485)
at hudson.model.AbstractProject.checkout(AbstractProject.java:1276)
at hudson.model.AbstractBuild$AbstractBuildExecution.defaultCheckout(AbstractBuild.java:607)
at jenkins.scm.SCMCheckoutStrategy.checkout(SCMCheckoutStrategy.java:86)
at hudson.model.AbstractBuild$AbstractBuildExecution.run(AbstractBuild.java:529)
at hudson.model.Run.execute(Run.java:1738)
at hudson.maven.MavenModuleSetBuild.run(MavenModuleSetBuild.java:531)
at hudson.model.ResourceController.execute(ResourceController.java:98)
at hudson.model.Executor.run(Executor.java:410)
Caused by: java.io.IOException: Failed to mkdirs: /home/jenkins/tools/maven/apache-maven-3.0.4
at hudson.FilePath.mkdirs(FilePath.java:1163)
at hudson.FilePath.installIfNecessaryFrom(FilePath.java:798)
... 16 more
Retrying after 10 seconds
java.io.IOException: Failed to install https://repo.maven.apache.org/maven2/org/apache/maven/apache-maven/3.0.4/apache-maven-3.0.4-bin.zip to /home/jenkins/tools/maven/apache-maven-3.0.4
at hudson.FilePath.installIfNecessaryFrom(FilePath.java:832)
at hudson.tools.DownloadFromUrlInstaller.performInstallation(DownloadFromUrlInstaller.java:75)
at hudson.tools.InstallerTranslator.getToolHome(InstallerTranslator.java:68)
at hudson.tools.ToolLocationNodeProperty.getToolHome(ToolLocationNodeProperty.java:108)
at hudson.tools.ToolInstallation.translateFor(ToolInstallation.java:206)
at hudson.tasks.Maven$MavenInstallation.forNode(Maven.java:624)
at hudson.maven.MavenModuleSetBuild.getEnvironment(MavenModuleSetBuild.java:183)
at hudson.plugins.git.GitSCM.checkout(GitSCM.java:1046)
at hudson.scm.SCM.checkout(SCM.java:485)
at hudson.model.AbstractProject.checkout(AbstractProject.java:1276)
at hudson.model.AbstractBuild$AbstractBuildExecution.defaultCheckout(AbstractBuild.java:607)
at jenkins.scm.SCMCheckoutStrategy.checkout(SCMCheckoutStrategy.java:86)
at hudson.model.AbstractBuild$AbstractBuildExecution.run(AbstractBuild.java:529)
at hudson.model.Run.execute(Run.java:1738)
at hudson.maven.MavenModuleSetBuild.run(MavenModuleSetBuild.java:531)
at hudson.model.ResourceController.execute(ResourceController.java:98)
at hudson.model.Executor.run(Executor.java:410)
Caused by: java.io.IOException: Failed to mkdirs: /home/jenkins/tools/maven/apache-maven-3.0.4
at hudson.FilePath.mkdirs(FilePath.java:1163)
at hudson.FilePath.installIfNecessaryFrom(FilePath.java:798)
... 16 more
Retrying after 10 seconds
java.io.IOException: Failed to install https://repo.maven.apache.org/maven2/org/apache/maven/apache-maven/3.0.4/apache-maven-3.0.4-bin.zip to /home/jenkins/tools/maven/apache-maven-3.0.4
at hudson.FilePath.installIfNecessaryFrom(FilePath.java:832)
at hudson.tools.DownloadFromUrlInstaller.performInstallation(DownloadFromUrlInstaller.java:75)
at hudson.tools.InstallerTranslator.getToolHome(InstallerTranslator.java:68)
at hudson.tools.ToolLocationNodeProperty.getToolHome(ToolLocationNodeProperty.java:108)
at hudson.tools.ToolInstallation.translateFor(ToolInstallation.java:206)
at hudson.tasks.Maven$MavenInstallation.forNode(Maven.java:624)
at hudson.maven.MavenModuleSetBuild.getEnvironment(MavenModuleSetBuild.java:183)
at hudson.plugins.git.GitSCM.checkout(GitSCM.java:1046)
at hudson.scm.SCM.checkout(SCM.java:485)
at hudson.model.AbstractProject.checkout(AbstractProject.java:1276)
at hudson.model.AbstractBuild$AbstractBuildExecution.defaultCheckout(AbstractBuild.java:607)
at jenkins.scm.SCMCheckoutStrategy.checkout(SCMCheckoutStrategy.java:86)
at hudson.model.AbstractBuild$AbstractBuildExecution.run(AbstractBuild.java:529)
at hudson.model.Run.execute(Run.java:1738)
at hudson.maven.MavenModuleSetBuild.run(MavenModuleSetBuild.java:531)
at hudson.model.ResourceController.execute(ResourceController.java:98)
at hudson.model.Executor.run(Executor.java:410)
Caused by: java.io.IOException: Failed to mkdirs: /home/jenkins/tools/maven/apache-maven-3.0.4
at hudson.FilePath.mkdirs(FilePath.java:1163)
at hudson.FilePath.installIfNecessaryFrom(FilePath.java:798)
... 16 more
Archiving artifacts
ERROR: Failed to archive artifacts: apidocs.bz2
java.io.IOException: Failed to install https://repo.maven.apache.org/maven2/org/apache/maven/apache-maven/3.0.4/apache-maven-3.0.4-bin.zip to /home/jenkins/tools/maven/apache-maven-3.0.4
at hudson.FilePath.installIfNecessaryFrom(FilePath.java:832)
at hudson.tools.DownloadFromUrlInstaller.performInstallation(DownloadFromUrlInstaller.java:75)
at hudson.tools.InstallerTranslator.getToolHome(InstallerTranslator.java:68)
at hudson.tools.ToolLocationNodeProperty.getToolHome(ToolLocationNodeProperty.java:108)
at hudson.tools.ToolInstallation.translateFor(ToolInstallation.java:206)
at hudson.tasks.Maven$MavenInstallation.forNode(Maven.java:624)
at hudson.maven.MavenModuleSetBuild.getEnvironment(MavenModuleSetBuild.java:183)
at hudson.tasks.ArtifactArchiver.perform(ArtifactArchiver.java:232)
at hudson.tasks.BuildStepCompatibilityLayer.perform(BuildStepCompatibilityLayer.java:78)
at hudson.tasks.BuildStepMonitor$1.perform(BuildStepMonitor.java:20)
at hudson.model.AbstractBuild$AbstractBuildExecution.perform(AbstractBuild.java:782)
at hudson.model.AbstractBuild$AbstractBuildExecution.performAllBuildSteps(AbstractBuild.java:723)
at hudson.maven.MavenModuleSetBuild$MavenModuleSetBuildExecution.post2(MavenModuleSetBuild.java:1047)
at hudson.model.AbstractBuild$AbstractBuildExecution.post(AbstractBuild.java:668)
at hudson.model.Run.execute(Run.java:1763)
at hudson.maven.MavenModuleSetBuild.run(MavenModuleSetBuild.java:531)
at hudson.model.ResourceController.execute(ResourceController.java:98)
at hudson.model.Executor.run(Executor.java:410)
Caused by: java.io.IOException: Failed to mkdirs: /home/jenkins/tools/maven/apache-maven-3.0.4
at hudson.FilePath.mkdirs(FilePath.java:1163)
at hudson.FilePath.installIfNecessaryFrom(FilePath.java:798)
... 17 more
Build failed in Jenkins: cloudstack-apidocs-master #2876
Posted by Apache Jenkins Server <je...@builds.apache.org>.
See <https://builds.apache.org/job/cloudstack-apidocs-master/2876/>
------------------------------------------
Started by an SCM change
[EnvInject] - Loading node environment variables.
Building remotely on ubuntu-6 (docker Ubuntu ubuntu yahoo-not-h2) in workspace <https://builds.apache.org/job/cloudstack-apidocs-master/ws/>
java.io.IOException: Failed to install https://repo.maven.apache.org/maven2/org/apache/maven/apache-maven/3.0.4/apache-maven-3.0.4-bin.zip to /home/jenkins/tools/maven/apache-maven-3.0.4
at hudson.FilePath.installIfNecessaryFrom(FilePath.java:832)
at hudson.tools.DownloadFromUrlInstaller.performInstallation(DownloadFromUrlInstaller.java:75)
at hudson.tools.InstallerTranslator.getToolHome(InstallerTranslator.java:68)
at hudson.tools.ToolLocationNodeProperty.getToolHome(ToolLocationNodeProperty.java:108)
at hudson.tools.ToolInstallation.translateFor(ToolInstallation.java:206)
at hudson.tasks.Maven$MavenInstallation.forNode(Maven.java:624)
at hudson.maven.MavenModuleSetBuild.getEnvironment(MavenModuleSetBuild.java:183)
at hudson.plugins.git.GitSCM.checkout(GitSCM.java:1046)
at hudson.scm.SCM.checkout(SCM.java:485)
at hudson.model.AbstractProject.checkout(AbstractProject.java:1276)
at hudson.model.AbstractBuild$AbstractBuildExecution.defaultCheckout(AbstractBuild.java:607)
at jenkins.scm.SCMCheckoutStrategy.checkout(SCMCheckoutStrategy.java:86)
at hudson.model.AbstractBuild$AbstractBuildExecution.run(AbstractBuild.java:529)
at hudson.model.Run.execute(Run.java:1738)
at hudson.maven.MavenModuleSetBuild.run(MavenModuleSetBuild.java:531)
at hudson.model.ResourceController.execute(ResourceController.java:98)
at hudson.model.Executor.run(Executor.java:410)
Caused by: java.io.IOException: Failed to mkdirs: /home/jenkins/tools/maven/apache-maven-3.0.4
at hudson.FilePath.mkdirs(FilePath.java:1163)
at hudson.FilePath.installIfNecessaryFrom(FilePath.java:798)
... 16 more
Retrying after 10 seconds
java.io.IOException: Failed to install https://repo.maven.apache.org/maven2/org/apache/maven/apache-maven/3.0.4/apache-maven-3.0.4-bin.zip to /home/jenkins/tools/maven/apache-maven-3.0.4
at hudson.FilePath.installIfNecessaryFrom(FilePath.java:832)
at hudson.tools.DownloadFromUrlInstaller.performInstallation(DownloadFromUrlInstaller.java:75)
at hudson.tools.InstallerTranslator.getToolHome(InstallerTranslator.java:68)
at hudson.tools.ToolLocationNodeProperty.getToolHome(ToolLocationNodeProperty.java:108)
at hudson.tools.ToolInstallation.translateFor(ToolInstallation.java:206)
at hudson.tasks.Maven$MavenInstallation.forNode(Maven.java:624)
at hudson.maven.MavenModuleSetBuild.getEnvironment(MavenModuleSetBuild.java:183)
at hudson.plugins.git.GitSCM.checkout(GitSCM.java:1046)
at hudson.scm.SCM.checkout(SCM.java:485)
at hudson.model.AbstractProject.checkout(AbstractProject.java:1276)
at hudson.model.AbstractBuild$AbstractBuildExecution.defaultCheckout(AbstractBuild.java:607)
at jenkins.scm.SCMCheckoutStrategy.checkout(SCMCheckoutStrategy.java:86)
at hudson.model.AbstractBuild$AbstractBuildExecution.run(AbstractBuild.java:529)
at hudson.model.Run.execute(Run.java:1738)
at hudson.maven.MavenModuleSetBuild.run(MavenModuleSetBuild.java:531)
at hudson.model.ResourceController.execute(ResourceController.java:98)
at hudson.model.Executor.run(Executor.java:410)
Caused by: java.io.IOException: Failed to mkdirs: /home/jenkins/tools/maven/apache-maven-3.0.4
at hudson.FilePath.mkdirs(FilePath.java:1163)
at hudson.FilePath.installIfNecessaryFrom(FilePath.java:798)
... 16 more
Retrying after 10 seconds
java.io.IOException: Failed to install https://repo.maven.apache.org/maven2/org/apache/maven/apache-maven/3.0.4/apache-maven-3.0.4-bin.zip to /home/jenkins/tools/maven/apache-maven-3.0.4
at hudson.FilePath.installIfNecessaryFrom(FilePath.java:832)
at hudson.tools.DownloadFromUrlInstaller.performInstallation(DownloadFromUrlInstaller.java:75)
at hudson.tools.InstallerTranslator.getToolHome(InstallerTranslator.java:68)
at hudson.tools.ToolLocationNodeProperty.getToolHome(ToolLocationNodeProperty.java:108)
at hudson.tools.ToolInstallation.translateFor(ToolInstallation.java:206)
at hudson.tasks.Maven$MavenInstallation.forNode(Maven.java:624)
at hudson.maven.MavenModuleSetBuild.getEnvironment(MavenModuleSetBuild.java:183)
at hudson.plugins.git.GitSCM.checkout(GitSCM.java:1046)
at hudson.scm.SCM.checkout(SCM.java:485)
at hudson.model.AbstractProject.checkout(AbstractProject.java:1276)
at hudson.model.AbstractBuild$AbstractBuildExecution.defaultCheckout(AbstractBuild.java:607)
at jenkins.scm.SCMCheckoutStrategy.checkout(SCMCheckoutStrategy.java:86)
at hudson.model.AbstractBuild$AbstractBuildExecution.run(AbstractBuild.java:529)
at hudson.model.Run.execute(Run.java:1738)
at hudson.maven.MavenModuleSetBuild.run(MavenModuleSetBuild.java:531)
at hudson.model.ResourceController.execute(ResourceController.java:98)
at hudson.model.Executor.run(Executor.java:410)
Caused by: java.io.IOException: Failed to mkdirs: /home/jenkins/tools/maven/apache-maven-3.0.4
at hudson.FilePath.mkdirs(FilePath.java:1163)
at hudson.FilePath.installIfNecessaryFrom(FilePath.java:798)
... 16 more
Archiving artifacts
ERROR: Failed to archive artifacts: apidocs.bz2
java.io.IOException: Failed to install https://repo.maven.apache.org/maven2/org/apache/maven/apache-maven/3.0.4/apache-maven-3.0.4-bin.zip to /home/jenkins/tools/maven/apache-maven-3.0.4
at hudson.FilePath.installIfNecessaryFrom(FilePath.java:832)
at hudson.tools.DownloadFromUrlInstaller.performInstallation(DownloadFromUrlInstaller.java:75)
at hudson.tools.InstallerTranslator.getToolHome(InstallerTranslator.java:68)
at hudson.tools.ToolLocationNodeProperty.getToolHome(ToolLocationNodeProperty.java:108)
at hudson.tools.ToolInstallation.translateFor(ToolInstallation.java:206)
at hudson.tasks.Maven$MavenInstallation.forNode(Maven.java:624)
at hudson.maven.MavenModuleSetBuild.getEnvironment(MavenModuleSetBuild.java:183)
at hudson.tasks.ArtifactArchiver.perform(ArtifactArchiver.java:232)
at hudson.tasks.BuildStepCompatibilityLayer.perform(BuildStepCompatibilityLayer.java:78)
at hudson.tasks.BuildStepMonitor$1.perform(BuildStepMonitor.java:20)
at hudson.model.AbstractBuild$AbstractBuildExecution.perform(AbstractBuild.java:782)
at hudson.model.AbstractBuild$AbstractBuildExecution.performAllBuildSteps(AbstractBuild.java:723)
at hudson.maven.MavenModuleSetBuild$MavenModuleSetBuildExecution.post2(MavenModuleSetBuild.java:1047)
at hudson.model.AbstractBuild$AbstractBuildExecution.post(AbstractBuild.java:668)
at hudson.model.Run.execute(Run.java:1763)
at hudson.maven.MavenModuleSetBuild.run(MavenModuleSetBuild.java:531)
at hudson.model.ResourceController.execute(ResourceController.java:98)
at hudson.model.Executor.run(Executor.java:410)
Caused by: java.io.IOException: Failed to mkdirs: /home/jenkins/tools/maven/apache-maven-3.0.4
at hudson.FilePath.mkdirs(FilePath.java:1163)
at hudson.FilePath.installIfNecessaryFrom(FilePath.java:798)
... 17 more
Build failed in Jenkins: cloudstack-apidocs-master #2875
Posted by Apache Jenkins Server <je...@builds.apache.org>.
See <https://builds.apache.org/job/cloudstack-apidocs-master/2875/>
------------------------------------------
Started by an SCM change
[EnvInject] - Loading node environment variables.
Building remotely on ubuntu-6 (docker Ubuntu ubuntu yahoo-not-h2) in workspace <https://builds.apache.org/job/cloudstack-apidocs-master/ws/>
java.io.IOException: Failed to install https://repo.maven.apache.org/maven2/org/apache/maven/apache-maven/3.0.4/apache-maven-3.0.4-bin.zip to /home/jenkins/tools/maven/apache-maven-3.0.4
at hudson.FilePath.installIfNecessaryFrom(FilePath.java:832)
at hudson.tools.DownloadFromUrlInstaller.performInstallation(DownloadFromUrlInstaller.java:75)
at hudson.tools.InstallerTranslator.getToolHome(InstallerTranslator.java:68)
at hudson.tools.ToolLocationNodeProperty.getToolHome(ToolLocationNodeProperty.java:108)
at hudson.tools.ToolInstallation.translateFor(ToolInstallation.java:206)
at hudson.tasks.Maven$MavenInstallation.forNode(Maven.java:624)
at hudson.maven.MavenModuleSetBuild.getEnvironment(MavenModuleSetBuild.java:183)
at hudson.plugins.git.GitSCM.checkout(GitSCM.java:1046)
at hudson.scm.SCM.checkout(SCM.java:485)
at hudson.model.AbstractProject.checkout(AbstractProject.java:1276)
at hudson.model.AbstractBuild$AbstractBuildExecution.defaultCheckout(AbstractBuild.java:607)
at jenkins.scm.SCMCheckoutStrategy.checkout(SCMCheckoutStrategy.java:86)
at hudson.model.AbstractBuild$AbstractBuildExecution.run(AbstractBuild.java:529)
at hudson.model.Run.execute(Run.java:1738)
at hudson.maven.MavenModuleSetBuild.run(MavenModuleSetBuild.java:531)
at hudson.model.ResourceController.execute(ResourceController.java:98)
at hudson.model.Executor.run(Executor.java:410)
Caused by: java.io.IOException: Failed to mkdirs: /home/jenkins/tools/maven/apache-maven-3.0.4
at hudson.FilePath.mkdirs(FilePath.java:1163)
at hudson.FilePath.installIfNecessaryFrom(FilePath.java:798)
... 16 more
Retrying after 10 seconds
java.io.IOException: Failed to install https://repo.maven.apache.org/maven2/org/apache/maven/apache-maven/3.0.4/apache-maven-3.0.4-bin.zip to /home/jenkins/tools/maven/apache-maven-3.0.4
at hudson.FilePath.installIfNecessaryFrom(FilePath.java:832)
at hudson.tools.DownloadFromUrlInstaller.performInstallation(DownloadFromUrlInstaller.java:75)
at hudson.tools.InstallerTranslator.getToolHome(InstallerTranslator.java:68)
at hudson.tools.ToolLocationNodeProperty.getToolHome(ToolLocationNodeProperty.java:108)
at hudson.tools.ToolInstallation.translateFor(ToolInstallation.java:206)
at hudson.tasks.Maven$MavenInstallation.forNode(Maven.java:624)
at hudson.maven.MavenModuleSetBuild.getEnvironment(MavenModuleSetBuild.java:183)
at hudson.plugins.git.GitSCM.checkout(GitSCM.java:1046)
at hudson.scm.SCM.checkout(SCM.java:485)
at hudson.model.AbstractProject.checkout(AbstractProject.java:1276)
at hudson.model.AbstractBuild$AbstractBuildExecution.defaultCheckout(AbstractBuild.java:607)
at jenkins.scm.SCMCheckoutStrategy.checkout(SCMCheckoutStrategy.java:86)
at hudson.model.AbstractBuild$AbstractBuildExecution.run(AbstractBuild.java:529)
at hudson.model.Run.execute(Run.java:1738)
at hudson.maven.MavenModuleSetBuild.run(MavenModuleSetBuild.java:531)
at hudson.model.ResourceController.execute(ResourceController.java:98)
at hudson.model.Executor.run(Executor.java:410)
Caused by: java.io.IOException: Failed to mkdirs: /home/jenkins/tools/maven/apache-maven-3.0.4
at hudson.FilePath.mkdirs(FilePath.java:1163)
at hudson.FilePath.installIfNecessaryFrom(FilePath.java:798)
... 16 more
Retrying after 10 seconds
java.io.IOException: Failed to install https://repo.maven.apache.org/maven2/org/apache/maven/apache-maven/3.0.4/apache-maven-3.0.4-bin.zip to /home/jenkins/tools/maven/apache-maven-3.0.4
at hudson.FilePath.installIfNecessaryFrom(FilePath.java:832)
at hudson.tools.DownloadFromUrlInstaller.performInstallation(DownloadFromUrlInstaller.java:75)
at hudson.tools.InstallerTranslator.getToolHome(InstallerTranslator.java:68)
at hudson.tools.ToolLocationNodeProperty.getToolHome(ToolLocationNodeProperty.java:108)
at hudson.tools.ToolInstallation.translateFor(ToolInstallation.java:206)
at hudson.tasks.Maven$MavenInstallation.forNode(Maven.java:624)
at hudson.maven.MavenModuleSetBuild.getEnvironment(MavenModuleSetBuild.java:183)
at hudson.plugins.git.GitSCM.checkout(GitSCM.java:1046)
at hudson.scm.SCM.checkout(SCM.java:485)
at hudson.model.AbstractProject.checkout(AbstractProject.java:1276)
at hudson.model.AbstractBuild$AbstractBuildExecution.defaultCheckout(AbstractBuild.java:607)
at jenkins.scm.SCMCheckoutStrategy.checkout(SCMCheckoutStrategy.java:86)
at hudson.model.AbstractBuild$AbstractBuildExecution.run(AbstractBuild.java:529)
at hudson.model.Run.execute(Run.java:1738)
at hudson.maven.MavenModuleSetBuild.run(MavenModuleSetBuild.java:531)
at hudson.model.ResourceController.execute(ResourceController.java:98)
at hudson.model.Executor.run(Executor.java:410)
Caused by: java.io.IOException: Failed to mkdirs: /home/jenkins/tools/maven/apache-maven-3.0.4
at hudson.FilePath.mkdirs(FilePath.java:1163)
at hudson.FilePath.installIfNecessaryFrom(FilePath.java:798)
... 16 more
Archiving artifacts
ERROR: Failed to archive artifacts: apidocs.bz2
java.io.IOException: Failed to install https://repo.maven.apache.org/maven2/org/apache/maven/apache-maven/3.0.4/apache-maven-3.0.4-bin.zip to /home/jenkins/tools/maven/apache-maven-3.0.4
at hudson.FilePath.installIfNecessaryFrom(FilePath.java:832)
at hudson.tools.DownloadFromUrlInstaller.performInstallation(DownloadFromUrlInstaller.java:75)
at hudson.tools.InstallerTranslator.getToolHome(InstallerTranslator.java:68)
at hudson.tools.ToolLocationNodeProperty.getToolHome(ToolLocationNodeProperty.java:108)
at hudson.tools.ToolInstallation.translateFor(ToolInstallation.java:206)
at hudson.tasks.Maven$MavenInstallation.forNode(Maven.java:624)
at hudson.maven.MavenModuleSetBuild.getEnvironment(MavenModuleSetBuild.java:183)
at hudson.tasks.ArtifactArchiver.perform(ArtifactArchiver.java:232)
at hudson.tasks.BuildStepCompatibilityLayer.perform(BuildStepCompatibilityLayer.java:78)
at hudson.tasks.BuildStepMonitor$1.perform(BuildStepMonitor.java:20)
at hudson.model.AbstractBuild$AbstractBuildExecution.perform(AbstractBuild.java:782)
at hudson.model.AbstractBuild$AbstractBuildExecution.performAllBuildSteps(AbstractBuild.java:723)
at hudson.maven.MavenModuleSetBuild$MavenModuleSetBuildExecution.post2(MavenModuleSetBuild.java:1047)
at hudson.model.AbstractBuild$AbstractBuildExecution.post(AbstractBuild.java:668)
at hudson.model.Run.execute(Run.java:1763)
at hudson.maven.MavenModuleSetBuild.run(MavenModuleSetBuild.java:531)
at hudson.model.ResourceController.execute(ResourceController.java:98)
at hudson.model.Executor.run(Executor.java:410)
Caused by: java.io.IOException: Failed to mkdirs: /home/jenkins/tools/maven/apache-maven-3.0.4
at hudson.FilePath.mkdirs(FilePath.java:1163)
at hudson.FilePath.installIfNecessaryFrom(FilePath.java:798)
... 17 more
Build failed in Jenkins: cloudstack-apidocs-master #2874
Posted by Apache Jenkins Server <je...@builds.apache.org>.
See <https://builds.apache.org/job/cloudstack-apidocs-master/2874/>
------------------------------------------
Started by an SCM change
[EnvInject] - Loading node environment variables.
Building remotely on ubuntu-6 (docker Ubuntu ubuntu yahoo-not-h2) in workspace <https://builds.apache.org/job/cloudstack-apidocs-master/ws/>
java.io.IOException: Failed to install https://repo.maven.apache.org/maven2/org/apache/maven/apache-maven/3.0.4/apache-maven-3.0.4-bin.zip to /home/jenkins/tools/maven/apache-maven-3.0.4
at hudson.FilePath.installIfNecessaryFrom(FilePath.java:832)
at hudson.tools.DownloadFromUrlInstaller.performInstallation(DownloadFromUrlInstaller.java:75)
at hudson.tools.InstallerTranslator.getToolHome(InstallerTranslator.java:68)
at hudson.tools.ToolLocationNodeProperty.getToolHome(ToolLocationNodeProperty.java:108)
at hudson.tools.ToolInstallation.translateFor(ToolInstallation.java:206)
at hudson.tasks.Maven$MavenInstallation.forNode(Maven.java:624)
at hudson.maven.MavenModuleSetBuild.getEnvironment(MavenModuleSetBuild.java:183)
at hudson.plugins.git.GitSCM.checkout(GitSCM.java:1046)
at hudson.scm.SCM.checkout(SCM.java:485)
at hudson.model.AbstractProject.checkout(AbstractProject.java:1276)
at hudson.model.AbstractBuild$AbstractBuildExecution.defaultCheckout(AbstractBuild.java:607)
at jenkins.scm.SCMCheckoutStrategy.checkout(SCMCheckoutStrategy.java:86)
at hudson.model.AbstractBuild$AbstractBuildExecution.run(AbstractBuild.java:529)
at hudson.model.Run.execute(Run.java:1738)
at hudson.maven.MavenModuleSetBuild.run(MavenModuleSetBuild.java:531)
at hudson.model.ResourceController.execute(ResourceController.java:98)
at hudson.model.Executor.run(Executor.java:410)
Caused by: java.io.IOException: Failed to mkdirs: /home/jenkins/tools/maven/apache-maven-3.0.4
at hudson.FilePath.mkdirs(FilePath.java:1163)
at hudson.FilePath.installIfNecessaryFrom(FilePath.java:798)
... 16 more
Retrying after 10 seconds
java.io.IOException: Failed to install https://repo.maven.apache.org/maven2/org/apache/maven/apache-maven/3.0.4/apache-maven-3.0.4-bin.zip to /home/jenkins/tools/maven/apache-maven-3.0.4
at hudson.FilePath.installIfNecessaryFrom(FilePath.java:832)
at hudson.tools.DownloadFromUrlInstaller.performInstallation(DownloadFromUrlInstaller.java:75)
at hudson.tools.InstallerTranslator.getToolHome(InstallerTranslator.java:68)
at hudson.tools.ToolLocationNodeProperty.getToolHome(ToolLocationNodeProperty.java:108)
at hudson.tools.ToolInstallation.translateFor(ToolInstallation.java:206)
at hudson.tasks.Maven$MavenInstallation.forNode(Maven.java:624)
at hudson.maven.MavenModuleSetBuild.getEnvironment(MavenModuleSetBuild.java:183)
at hudson.plugins.git.GitSCM.checkout(GitSCM.java:1046)
at hudson.scm.SCM.checkout(SCM.java:485)
at hudson.model.AbstractProject.checkout(AbstractProject.java:1276)
at hudson.model.AbstractBuild$AbstractBuildExecution.defaultCheckout(AbstractBuild.java:607)
at jenkins.scm.SCMCheckoutStrategy.checkout(SCMCheckoutStrategy.java:86)
at hudson.model.AbstractBuild$AbstractBuildExecution.run(AbstractBuild.java:529)
at hudson.model.Run.execute(Run.java:1738)
at hudson.maven.MavenModuleSetBuild.run(MavenModuleSetBuild.java:531)
at hudson.model.ResourceController.execute(ResourceController.java:98)
at hudson.model.Executor.run(Executor.java:410)
Caused by: java.io.IOException: Failed to mkdirs: /home/jenkins/tools/maven/apache-maven-3.0.4
at hudson.FilePath.mkdirs(FilePath.java:1163)
at hudson.FilePath.installIfNecessaryFrom(FilePath.java:798)
... 16 more
Retrying after 10 seconds
java.io.IOException: Failed to install https://repo.maven.apache.org/maven2/org/apache/maven/apache-maven/3.0.4/apache-maven-3.0.4-bin.zip to /home/jenkins/tools/maven/apache-maven-3.0.4
at hudson.FilePath.installIfNecessaryFrom(FilePath.java:832)
at hudson.tools.DownloadFromUrlInstaller.performInstallation(DownloadFromUrlInstaller.java:75)
at hudson.tools.InstallerTranslator.getToolHome(InstallerTranslator.java:68)
at hudson.tools.ToolLocationNodeProperty.getToolHome(ToolLocationNodeProperty.java:108)
at hudson.tools.ToolInstallation.translateFor(ToolInstallation.java:206)
at hudson.tasks.Maven$MavenInstallation.forNode(Maven.java:624)
at hudson.maven.MavenModuleSetBuild.getEnvironment(MavenModuleSetBuild.java:183)
at hudson.plugins.git.GitSCM.checkout(GitSCM.java:1046)
at hudson.scm.SCM.checkout(SCM.java:485)
at hudson.model.AbstractProject.checkout(AbstractProject.java:1276)
at hudson.model.AbstractBuild$AbstractBuildExecution.defaultCheckout(AbstractBuild.java:607)
at jenkins.scm.SCMCheckoutStrategy.checkout(SCMCheckoutStrategy.java:86)
at hudson.model.AbstractBuild$AbstractBuildExecution.run(AbstractBuild.java:529)
at hudson.model.Run.execute(Run.java:1738)
at hudson.maven.MavenModuleSetBuild.run(MavenModuleSetBuild.java:531)
at hudson.model.ResourceController.execute(ResourceController.java:98)
at hudson.model.Executor.run(Executor.java:410)
Caused by: java.io.IOException: Failed to mkdirs: /home/jenkins/tools/maven/apache-maven-3.0.4
at hudson.FilePath.mkdirs(FilePath.java:1163)
at hudson.FilePath.installIfNecessaryFrom(FilePath.java:798)
... 16 more
Archiving artifacts
ERROR: Failed to archive artifacts: apidocs.bz2
java.io.IOException: Failed to install https://repo.maven.apache.org/maven2/org/apache/maven/apache-maven/3.0.4/apache-maven-3.0.4-bin.zip to /home/jenkins/tools/maven/apache-maven-3.0.4
at hudson.FilePath.installIfNecessaryFrom(FilePath.java:832)
at hudson.tools.DownloadFromUrlInstaller.performInstallation(DownloadFromUrlInstaller.java:75)
at hudson.tools.InstallerTranslator.getToolHome(InstallerTranslator.java:68)
at hudson.tools.ToolLocationNodeProperty.getToolHome(ToolLocationNodeProperty.java:108)
at hudson.tools.ToolInstallation.translateFor(ToolInstallation.java:206)
at hudson.tasks.Maven$MavenInstallation.forNode(Maven.java:624)
at hudson.maven.MavenModuleSetBuild.getEnvironment(MavenModuleSetBuild.java:183)
at hudson.tasks.ArtifactArchiver.perform(ArtifactArchiver.java:232)
at hudson.tasks.BuildStepCompatibilityLayer.perform(BuildStepCompatibilityLayer.java:78)
at hudson.tasks.BuildStepMonitor$1.perform(BuildStepMonitor.java:20)
at hudson.model.AbstractBuild$AbstractBuildExecution.perform(AbstractBuild.java:782)
at hudson.model.AbstractBuild$AbstractBuildExecution.performAllBuildSteps(AbstractBuild.java:723)
at hudson.maven.MavenModuleSetBuild$MavenModuleSetBuildExecution.post2(MavenModuleSetBuild.java:1047)
at hudson.model.AbstractBuild$AbstractBuildExecution.post(AbstractBuild.java:668)
at hudson.model.Run.execute(Run.java:1763)
at hudson.maven.MavenModuleSetBuild.run(MavenModuleSetBuild.java:531)
at hudson.model.ResourceController.execute(ResourceController.java:98)
at hudson.model.Executor.run(Executor.java:410)
Caused by: java.io.IOException: Failed to mkdirs: /home/jenkins/tools/maven/apache-maven-3.0.4
at hudson.FilePath.mkdirs(FilePath.java:1163)
at hudson.FilePath.installIfNecessaryFrom(FilePath.java:798)
... 17 more
Build failed in Jenkins: cloudstack-apidocs-master #2873
Posted by Apache Jenkins Server <je...@builds.apache.org>.
See <https://builds.apache.org/job/cloudstack-apidocs-master/2873/>
------------------------------------------
Started by an SCM change
[EnvInject] - Loading node environment variables.
Building remotely on ubuntu-6 (docker Ubuntu ubuntu yahoo-not-h2) in workspace <https://builds.apache.org/job/cloudstack-apidocs-master/ws/>
java.io.IOException: Failed to install https://repo.maven.apache.org/maven2/org/apache/maven/apache-maven/3.0.4/apache-maven-3.0.4-bin.zip to /home/jenkins/tools/maven/apache-maven-3.0.4
at hudson.FilePath.installIfNecessaryFrom(FilePath.java:832)
at hudson.tools.DownloadFromUrlInstaller.performInstallation(DownloadFromUrlInstaller.java:75)
at hudson.tools.InstallerTranslator.getToolHome(InstallerTranslator.java:68)
at hudson.tools.ToolLocationNodeProperty.getToolHome(ToolLocationNodeProperty.java:108)
at hudson.tools.ToolInstallation.translateFor(ToolInstallation.java:206)
at hudson.tasks.Maven$MavenInstallation.forNode(Maven.java:624)
at hudson.maven.MavenModuleSetBuild.getEnvironment(MavenModuleSetBuild.java:183)
at hudson.plugins.git.GitSCM.checkout(GitSCM.java:1046)
at hudson.scm.SCM.checkout(SCM.java:485)
at hudson.model.AbstractProject.checkout(AbstractProject.java:1276)
at hudson.model.AbstractBuild$AbstractBuildExecution.defaultCheckout(AbstractBuild.java:607)
at jenkins.scm.SCMCheckoutStrategy.checkout(SCMCheckoutStrategy.java:86)
at hudson.model.AbstractBuild$AbstractBuildExecution.run(AbstractBuild.java:529)
at hudson.model.Run.execute(Run.java:1738)
at hudson.maven.MavenModuleSetBuild.run(MavenModuleSetBuild.java:531)
at hudson.model.ResourceController.execute(ResourceController.java:98)
at hudson.model.Executor.run(Executor.java:410)
Caused by: java.io.IOException: Failed to mkdirs: /home/jenkins/tools/maven/apache-maven-3.0.4
at hudson.FilePath.mkdirs(FilePath.java:1163)
at hudson.FilePath.installIfNecessaryFrom(FilePath.java:798)
... 16 more
Retrying after 10 seconds
java.io.IOException: Failed to install https://repo.maven.apache.org/maven2/org/apache/maven/apache-maven/3.0.4/apache-maven-3.0.4-bin.zip to /home/jenkins/tools/maven/apache-maven-3.0.4
at hudson.FilePath.installIfNecessaryFrom(FilePath.java:832)
at hudson.tools.DownloadFromUrlInstaller.performInstallation(DownloadFromUrlInstaller.java:75)
at hudson.tools.InstallerTranslator.getToolHome(InstallerTranslator.java:68)
at hudson.tools.ToolLocationNodeProperty.getToolHome(ToolLocationNodeProperty.java:108)
at hudson.tools.ToolInstallation.translateFor(ToolInstallation.java:206)
at hudson.tasks.Maven$MavenInstallation.forNode(Maven.java:624)
at hudson.maven.MavenModuleSetBuild.getEnvironment(MavenModuleSetBuild.java:183)
at hudson.plugins.git.GitSCM.checkout(GitSCM.java:1046)
at hudson.scm.SCM.checkout(SCM.java:485)
at hudson.model.AbstractProject.checkout(AbstractProject.java:1276)
at hudson.model.AbstractBuild$AbstractBuildExecution.defaultCheckout(AbstractBuild.java:607)
at jenkins.scm.SCMCheckoutStrategy.checkout(SCMCheckoutStrategy.java:86)
at hudson.model.AbstractBuild$AbstractBuildExecution.run(AbstractBuild.java:529)
at hudson.model.Run.execute(Run.java:1738)
at hudson.maven.MavenModuleSetBuild.run(MavenModuleSetBuild.java:531)
at hudson.model.ResourceController.execute(ResourceController.java:98)
at hudson.model.Executor.run(Executor.java:410)
Caused by: java.io.IOException: Failed to mkdirs: /home/jenkins/tools/maven/apache-maven-3.0.4
at hudson.FilePath.mkdirs(FilePath.java:1163)
at hudson.FilePath.installIfNecessaryFrom(FilePath.java:798)
... 16 more
Retrying after 10 seconds
java.io.IOException: Failed to install https://repo.maven.apache.org/maven2/org/apache/maven/apache-maven/3.0.4/apache-maven-3.0.4-bin.zip to /home/jenkins/tools/maven/apache-maven-3.0.4
at hudson.FilePath.installIfNecessaryFrom(FilePath.java:832)
at hudson.tools.DownloadFromUrlInstaller.performInstallation(DownloadFromUrlInstaller.java:75)
at hudson.tools.InstallerTranslator.getToolHome(InstallerTranslator.java:68)
at hudson.tools.ToolLocationNodeProperty.getToolHome(ToolLocationNodeProperty.java:108)
at hudson.tools.ToolInstallation.translateFor(ToolInstallation.java:206)
at hudson.tasks.Maven$MavenInstallation.forNode(Maven.java:624)
at hudson.maven.MavenModuleSetBuild.getEnvironment(MavenModuleSetBuild.java:183)
at hudson.plugins.git.GitSCM.checkout(GitSCM.java:1046)
at hudson.scm.SCM.checkout(SCM.java:485)
at hudson.model.AbstractProject.checkout(AbstractProject.java:1276)
at hudson.model.AbstractBuild$AbstractBuildExecution.defaultCheckout(AbstractBuild.java:607)
at jenkins.scm.SCMCheckoutStrategy.checkout(SCMCheckoutStrategy.java:86)
at hudson.model.AbstractBuild$AbstractBuildExecution.run(AbstractBuild.java:529)
at hudson.model.Run.execute(Run.java:1738)
at hudson.maven.MavenModuleSetBuild.run(MavenModuleSetBuild.java:531)
at hudson.model.ResourceController.execute(ResourceController.java:98)
at hudson.model.Executor.run(Executor.java:410)
Caused by: java.io.IOException: Failed to mkdirs: /home/jenkins/tools/maven/apache-maven-3.0.4
at hudson.FilePath.mkdirs(FilePath.java:1163)
at hudson.FilePath.installIfNecessaryFrom(FilePath.java:798)
... 16 more
Archiving artifacts
ERROR: Failed to archive artifacts: apidocs.bz2
java.io.IOException: Failed to install https://repo.maven.apache.org/maven2/org/apache/maven/apache-maven/3.0.4/apache-maven-3.0.4-bin.zip to /home/jenkins/tools/maven/apache-maven-3.0.4
at hudson.FilePath.installIfNecessaryFrom(FilePath.java:832)
at hudson.tools.DownloadFromUrlInstaller.performInstallation(DownloadFromUrlInstaller.java:75)
at hudson.tools.InstallerTranslator.getToolHome(InstallerTranslator.java:68)
at hudson.tools.ToolLocationNodeProperty.getToolHome(ToolLocationNodeProperty.java:108)
at hudson.tools.ToolInstallation.translateFor(ToolInstallation.java:206)
at hudson.tasks.Maven$MavenInstallation.forNode(Maven.java:624)
at hudson.maven.MavenModuleSetBuild.getEnvironment(MavenModuleSetBuild.java:183)
at hudson.tasks.ArtifactArchiver.perform(ArtifactArchiver.java:232)
at hudson.tasks.BuildStepCompatibilityLayer.perform(BuildStepCompatibilityLayer.java:78)
at hudson.tasks.BuildStepMonitor$1.perform(BuildStepMonitor.java:20)
at hudson.model.AbstractBuild$AbstractBuildExecution.perform(AbstractBuild.java:782)
at hudson.model.AbstractBuild$AbstractBuildExecution.performAllBuildSteps(AbstractBuild.java:723)
at hudson.maven.MavenModuleSetBuild$MavenModuleSetBuildExecution.post2(MavenModuleSetBuild.java:1047)
at hudson.model.AbstractBuild$AbstractBuildExecution.post(AbstractBuild.java:668)
at hudson.model.Run.execute(Run.java:1763)
at hudson.maven.MavenModuleSetBuild.run(MavenModuleSetBuild.java:531)
at hudson.model.ResourceController.execute(ResourceController.java:98)
at hudson.model.Executor.run(Executor.java:410)
Caused by: java.io.IOException: Failed to mkdirs: /home/jenkins/tools/maven/apache-maven-3.0.4
at hudson.FilePath.mkdirs(FilePath.java:1163)
at hudson.FilePath.installIfNecessaryFrom(FilePath.java:798)
... 17 more
Build failed in Jenkins: cloudstack-apidocs-master #2872
Posted by Apache Jenkins Server <je...@builds.apache.org>.
See <https://builds.apache.org/job/cloudstack-apidocs-master/2872/>
------------------------------------------
Started by an SCM change
[EnvInject] - Loading node environment variables.
Building remotely on ubuntu-6 (docker Ubuntu ubuntu yahoo-not-h2) in workspace <https://builds.apache.org/job/cloudstack-apidocs-master/ws/>
java.io.IOException: Failed to install https://repo.maven.apache.org/maven2/org/apache/maven/apache-maven/3.0.4/apache-maven-3.0.4-bin.zip to /home/jenkins/tools/maven/apache-maven-3.0.4
at hudson.FilePath.installIfNecessaryFrom(FilePath.java:832)
at hudson.tools.DownloadFromUrlInstaller.performInstallation(DownloadFromUrlInstaller.java:75)
at hudson.tools.InstallerTranslator.getToolHome(InstallerTranslator.java:68)
at hudson.tools.ToolLocationNodeProperty.getToolHome(ToolLocationNodeProperty.java:108)
at hudson.tools.ToolInstallation.translateFor(ToolInstallation.java:206)
at hudson.tasks.Maven$MavenInstallation.forNode(Maven.java:624)
at hudson.maven.MavenModuleSetBuild.getEnvironment(MavenModuleSetBuild.java:183)
at hudson.plugins.git.GitSCM.checkout(GitSCM.java:1046)
at hudson.scm.SCM.checkout(SCM.java:485)
at hudson.model.AbstractProject.checkout(AbstractProject.java:1276)
at hudson.model.AbstractBuild$AbstractBuildExecution.defaultCheckout(AbstractBuild.java:607)
at jenkins.scm.SCMCheckoutStrategy.checkout(SCMCheckoutStrategy.java:86)
at hudson.model.AbstractBuild$AbstractBuildExecution.run(AbstractBuild.java:529)
at hudson.model.Run.execute(Run.java:1738)
at hudson.maven.MavenModuleSetBuild.run(MavenModuleSetBuild.java:531)
at hudson.model.ResourceController.execute(ResourceController.java:98)
at hudson.model.Executor.run(Executor.java:410)
Caused by: java.io.IOException: Failed to mkdirs: /home/jenkins/tools/maven/apache-maven-3.0.4
at hudson.FilePath.mkdirs(FilePath.java:1163)
at hudson.FilePath.installIfNecessaryFrom(FilePath.java:798)
... 16 more
Retrying after 10 seconds
java.io.IOException: Failed to install https://repo.maven.apache.org/maven2/org/apache/maven/apache-maven/3.0.4/apache-maven-3.0.4-bin.zip to /home/jenkins/tools/maven/apache-maven-3.0.4
at hudson.FilePath.installIfNecessaryFrom(FilePath.java:832)
at hudson.tools.DownloadFromUrlInstaller.performInstallation(DownloadFromUrlInstaller.java:75)
at hudson.tools.InstallerTranslator.getToolHome(InstallerTranslator.java:68)
at hudson.tools.ToolLocationNodeProperty.getToolHome(ToolLocationNodeProperty.java:108)
at hudson.tools.ToolInstallation.translateFor(ToolInstallation.java:206)
at hudson.tasks.Maven$MavenInstallation.forNode(Maven.java:624)
at hudson.maven.MavenModuleSetBuild.getEnvironment(MavenModuleSetBuild.java:183)
at hudson.plugins.git.GitSCM.checkout(GitSCM.java:1046)
at hudson.scm.SCM.checkout(SCM.java:485)
at hudson.model.AbstractProject.checkout(AbstractProject.java:1276)
at hudson.model.AbstractBuild$AbstractBuildExecution.defaultCheckout(AbstractBuild.java:607)
at jenkins.scm.SCMCheckoutStrategy.checkout(SCMCheckoutStrategy.java:86)
at hudson.model.AbstractBuild$AbstractBuildExecution.run(AbstractBuild.java:529)
at hudson.model.Run.execute(Run.java:1738)
at hudson.maven.MavenModuleSetBuild.run(MavenModuleSetBuild.java:531)
at hudson.model.ResourceController.execute(ResourceController.java:98)
at hudson.model.Executor.run(Executor.java:410)
Caused by: java.io.IOException: Failed to mkdirs: /home/jenkins/tools/maven/apache-maven-3.0.4
at hudson.FilePath.mkdirs(FilePath.java:1163)
at hudson.FilePath.installIfNecessaryFrom(FilePath.java:798)
... 16 more
Retrying after 10 seconds
java.io.IOException: Failed to install https://repo.maven.apache.org/maven2/org/apache/maven/apache-maven/3.0.4/apache-maven-3.0.4-bin.zip to /home/jenkins/tools/maven/apache-maven-3.0.4
at hudson.FilePath.installIfNecessaryFrom(FilePath.java:832)
at hudson.tools.DownloadFromUrlInstaller.performInstallation(DownloadFromUrlInstaller.java:75)
at hudson.tools.InstallerTranslator.getToolHome(InstallerTranslator.java:68)
at hudson.tools.ToolLocationNodeProperty.getToolHome(ToolLocationNodeProperty.java:108)
at hudson.tools.ToolInstallation.translateFor(ToolInstallation.java:206)
at hudson.tasks.Maven$MavenInstallation.forNode(Maven.java:624)
at hudson.maven.MavenModuleSetBuild.getEnvironment(MavenModuleSetBuild.java:183)
at hudson.plugins.git.GitSCM.checkout(GitSCM.java:1046)
at hudson.scm.SCM.checkout(SCM.java:485)
at hudson.model.AbstractProject.checkout(AbstractProject.java:1276)
at hudson.model.AbstractBuild$AbstractBuildExecution.defaultCheckout(AbstractBuild.java:607)
at jenkins.scm.SCMCheckoutStrategy.checkout(SCMCheckoutStrategy.java:86)
at hudson.model.AbstractBuild$AbstractBuildExecution.run(AbstractBuild.java:529)
at hudson.model.Run.execute(Run.java:1738)
at hudson.maven.MavenModuleSetBuild.run(MavenModuleSetBuild.java:531)
at hudson.model.ResourceController.execute(ResourceController.java:98)
at hudson.model.Executor.run(Executor.java:410)
Caused by: java.io.IOException: Failed to mkdirs: /home/jenkins/tools/maven/apache-maven-3.0.4
at hudson.FilePath.mkdirs(FilePath.java:1163)
at hudson.FilePath.installIfNecessaryFrom(FilePath.java:798)
... 16 more
Archiving artifacts
ERROR: Failed to archive artifacts: apidocs.bz2
java.io.IOException: Failed to install https://repo.maven.apache.org/maven2/org/apache/maven/apache-maven/3.0.4/apache-maven-3.0.4-bin.zip to /home/jenkins/tools/maven/apache-maven-3.0.4
at hudson.FilePath.installIfNecessaryFrom(FilePath.java:832)
at hudson.tools.DownloadFromUrlInstaller.performInstallation(DownloadFromUrlInstaller.java:75)
at hudson.tools.InstallerTranslator.getToolHome(InstallerTranslator.java:68)
at hudson.tools.ToolLocationNodeProperty.getToolHome(ToolLocationNodeProperty.java:108)
at hudson.tools.ToolInstallation.translateFor(ToolInstallation.java:206)
at hudson.tasks.Maven$MavenInstallation.forNode(Maven.java:624)
at hudson.maven.MavenModuleSetBuild.getEnvironment(MavenModuleSetBuild.java:183)
at hudson.tasks.ArtifactArchiver.perform(ArtifactArchiver.java:232)
at hudson.tasks.BuildStepCompatibilityLayer.perform(BuildStepCompatibilityLayer.java:78)
at hudson.tasks.BuildStepMonitor$1.perform(BuildStepMonitor.java:20)
at hudson.model.AbstractBuild$AbstractBuildExecution.perform(AbstractBuild.java:782)
at hudson.model.AbstractBuild$AbstractBuildExecution.performAllBuildSteps(AbstractBuild.java:723)
at hudson.maven.MavenModuleSetBuild$MavenModuleSetBuildExecution.post2(MavenModuleSetBuild.java:1047)
at hudson.model.AbstractBuild$AbstractBuildExecution.post(AbstractBuild.java:668)
at hudson.model.Run.execute(Run.java:1763)
at hudson.maven.MavenModuleSetBuild.run(MavenModuleSetBuild.java:531)
at hudson.model.ResourceController.execute(ResourceController.java:98)
at hudson.model.Executor.run(Executor.java:410)
Caused by: java.io.IOException: Failed to mkdirs: /home/jenkins/tools/maven/apache-maven-3.0.4
at hudson.FilePath.mkdirs(FilePath.java:1163)
at hudson.FilePath.installIfNecessaryFrom(FilePath.java:798)
... 17 more
Build failed in Jenkins: cloudstack-apidocs-master #2871
Posted by Apache Jenkins Server <je...@builds.apache.org>.
See <https://builds.apache.org/job/cloudstack-apidocs-master/2871/>
------------------------------------------
Started by an SCM change
[EnvInject] - Loading node environment variables.
Building remotely on ubuntu-6 (docker Ubuntu ubuntu yahoo-not-h2) in workspace <https://builds.apache.org/job/cloudstack-apidocs-master/ws/>
java.io.IOException: Failed to install https://repo.maven.apache.org/maven2/org/apache/maven/apache-maven/3.0.4/apache-maven-3.0.4-bin.zip to /home/jenkins/tools/maven/apache-maven-3.0.4
at hudson.FilePath.installIfNecessaryFrom(FilePath.java:832)
at hudson.tools.DownloadFromUrlInstaller.performInstallation(DownloadFromUrlInstaller.java:75)
at hudson.tools.InstallerTranslator.getToolHome(InstallerTranslator.java:68)
at hudson.tools.ToolLocationNodeProperty.getToolHome(ToolLocationNodeProperty.java:108)
at hudson.tools.ToolInstallation.translateFor(ToolInstallation.java:206)
at hudson.tasks.Maven$MavenInstallation.forNode(Maven.java:624)
at hudson.maven.MavenModuleSetBuild.getEnvironment(MavenModuleSetBuild.java:183)
at hudson.plugins.git.GitSCM.checkout(GitSCM.java:1046)
at hudson.scm.SCM.checkout(SCM.java:485)
at hudson.model.AbstractProject.checkout(AbstractProject.java:1276)
at hudson.model.AbstractBuild$AbstractBuildExecution.defaultCheckout(AbstractBuild.java:607)
at jenkins.scm.SCMCheckoutStrategy.checkout(SCMCheckoutStrategy.java:86)
at hudson.model.AbstractBuild$AbstractBuildExecution.run(AbstractBuild.java:529)
at hudson.model.Run.execute(Run.java:1738)
at hudson.maven.MavenModuleSetBuild.run(MavenModuleSetBuild.java:531)
at hudson.model.ResourceController.execute(ResourceController.java:98)
at hudson.model.Executor.run(Executor.java:410)
Caused by: java.io.IOException: Failed to mkdirs: /home/jenkins/tools/maven/apache-maven-3.0.4
at hudson.FilePath.mkdirs(FilePath.java:1163)
at hudson.FilePath.installIfNecessaryFrom(FilePath.java:798)
... 16 more
Retrying after 10 seconds
java.io.IOException: Failed to install https://repo.maven.apache.org/maven2/org/apache/maven/apache-maven/3.0.4/apache-maven-3.0.4-bin.zip to /home/jenkins/tools/maven/apache-maven-3.0.4
at hudson.FilePath.installIfNecessaryFrom(FilePath.java:832)
at hudson.tools.DownloadFromUrlInstaller.performInstallation(DownloadFromUrlInstaller.java:75)
at hudson.tools.InstallerTranslator.getToolHome(InstallerTranslator.java:68)
at hudson.tools.ToolLocationNodeProperty.getToolHome(ToolLocationNodeProperty.java:108)
at hudson.tools.ToolInstallation.translateFor(ToolInstallation.java:206)
at hudson.tasks.Maven$MavenInstallation.forNode(Maven.java:624)
at hudson.maven.MavenModuleSetBuild.getEnvironment(MavenModuleSetBuild.java:183)
at hudson.plugins.git.GitSCM.checkout(GitSCM.java:1046)
at hudson.scm.SCM.checkout(SCM.java:485)
at hudson.model.AbstractProject.checkout(AbstractProject.java:1276)
at hudson.model.AbstractBuild$AbstractBuildExecution.defaultCheckout(AbstractBuild.java:607)
at jenkins.scm.SCMCheckoutStrategy.checkout(SCMCheckoutStrategy.java:86)
at hudson.model.AbstractBuild$AbstractBuildExecution.run(AbstractBuild.java:529)
at hudson.model.Run.execute(Run.java:1738)
at hudson.maven.MavenModuleSetBuild.run(MavenModuleSetBuild.java:531)
at hudson.model.ResourceController.execute(ResourceController.java:98)
at hudson.model.Executor.run(Executor.java:410)
Caused by: java.io.IOException: Failed to mkdirs: /home/jenkins/tools/maven/apache-maven-3.0.4
at hudson.FilePath.mkdirs(FilePath.java:1163)
at hudson.FilePath.installIfNecessaryFrom(FilePath.java:798)
... 16 more
Retrying after 10 seconds
java.io.IOException: Failed to install https://repo.maven.apache.org/maven2/org/apache/maven/apache-maven/3.0.4/apache-maven-3.0.4-bin.zip to /home/jenkins/tools/maven/apache-maven-3.0.4
at hudson.FilePath.installIfNecessaryFrom(FilePath.java:832)
at hudson.tools.DownloadFromUrlInstaller.performInstallation(DownloadFromUrlInstaller.java:75)
at hudson.tools.InstallerTranslator.getToolHome(InstallerTranslator.java:68)
at hudson.tools.ToolLocationNodeProperty.getToolHome(ToolLocationNodeProperty.java:108)
at hudson.tools.ToolInstallation.translateFor(ToolInstallation.java:206)
at hudson.tasks.Maven$MavenInstallation.forNode(Maven.java:624)
at hudson.maven.MavenModuleSetBuild.getEnvironment(MavenModuleSetBuild.java:183)
at hudson.plugins.git.GitSCM.checkout(GitSCM.java:1046)
at hudson.scm.SCM.checkout(SCM.java:485)
at hudson.model.AbstractProject.checkout(AbstractProject.java:1276)
at hudson.model.AbstractBuild$AbstractBuildExecution.defaultCheckout(AbstractBuild.java:607)
at jenkins.scm.SCMCheckoutStrategy.checkout(SCMCheckoutStrategy.java:86)
at hudson.model.AbstractBuild$AbstractBuildExecution.run(AbstractBuild.java:529)
at hudson.model.Run.execute(Run.java:1738)
at hudson.maven.MavenModuleSetBuild.run(MavenModuleSetBuild.java:531)
at hudson.model.ResourceController.execute(ResourceController.java:98)
at hudson.model.Executor.run(Executor.java:410)
Caused by: java.io.IOException: Failed to mkdirs: /home/jenkins/tools/maven/apache-maven-3.0.4
at hudson.FilePath.mkdirs(FilePath.java:1163)
at hudson.FilePath.installIfNecessaryFrom(FilePath.java:798)
... 16 more
Archiving artifacts
ERROR: Failed to archive artifacts: apidocs.bz2
java.io.IOException: Failed to install https://repo.maven.apache.org/maven2/org/apache/maven/apache-maven/3.0.4/apache-maven-3.0.4-bin.zip to /home/jenkins/tools/maven/apache-maven-3.0.4
at hudson.FilePath.installIfNecessaryFrom(FilePath.java:832)
at hudson.tools.DownloadFromUrlInstaller.performInstallation(DownloadFromUrlInstaller.java:75)
at hudson.tools.InstallerTranslator.getToolHome(InstallerTranslator.java:68)
at hudson.tools.ToolLocationNodeProperty.getToolHome(ToolLocationNodeProperty.java:108)
at hudson.tools.ToolInstallation.translateFor(ToolInstallation.java:206)
at hudson.tasks.Maven$MavenInstallation.forNode(Maven.java:624)
at hudson.maven.MavenModuleSetBuild.getEnvironment(MavenModuleSetBuild.java:183)
at hudson.tasks.ArtifactArchiver.perform(ArtifactArchiver.java:232)
at hudson.tasks.BuildStepCompatibilityLayer.perform(BuildStepCompatibilityLayer.java:78)
at hudson.tasks.BuildStepMonitor$1.perform(BuildStepMonitor.java:20)
at hudson.model.AbstractBuild$AbstractBuildExecution.perform(AbstractBuild.java:782)
at hudson.model.AbstractBuild$AbstractBuildExecution.performAllBuildSteps(AbstractBuild.java:723)
at hudson.maven.MavenModuleSetBuild$MavenModuleSetBuildExecution.post2(MavenModuleSetBuild.java:1047)
at hudson.model.AbstractBuild$AbstractBuildExecution.post(AbstractBuild.java:668)
at hudson.model.Run.execute(Run.java:1763)
at hudson.maven.MavenModuleSetBuild.run(MavenModuleSetBuild.java:531)
at hudson.model.ResourceController.execute(ResourceController.java:98)
at hudson.model.Executor.run(Executor.java:410)
Caused by: java.io.IOException: Failed to mkdirs: /home/jenkins/tools/maven/apache-maven-3.0.4
at hudson.FilePath.mkdirs(FilePath.java:1163)
at hudson.FilePath.installIfNecessaryFrom(FilePath.java:798)
... 17 more
Build failed in Jenkins: cloudstack-apidocs-master #2870
Posted by Apache Jenkins Server <je...@builds.apache.org>.
See <https://builds.apache.org/job/cloudstack-apidocs-master/2870/>
------------------------------------------
Started by an SCM change
[EnvInject] - Loading node environment variables.
Building remotely on ubuntu-6 (docker Ubuntu ubuntu yahoo-not-h2) in workspace <https://builds.apache.org/job/cloudstack-apidocs-master/ws/>
java.io.IOException: Failed to install https://repo.maven.apache.org/maven2/org/apache/maven/apache-maven/3.0.4/apache-maven-3.0.4-bin.zip to /home/jenkins/tools/maven/apache-maven-3.0.4
at hudson.FilePath.installIfNecessaryFrom(FilePath.java:832)
at hudson.tools.DownloadFromUrlInstaller.performInstallation(DownloadFromUrlInstaller.java:75)
at hudson.tools.InstallerTranslator.getToolHome(InstallerTranslator.java:68)
at hudson.tools.ToolLocationNodeProperty.getToolHome(ToolLocationNodeProperty.java:108)
at hudson.tools.ToolInstallation.translateFor(ToolInstallation.java:206)
at hudson.tasks.Maven$MavenInstallation.forNode(Maven.java:624)
at hudson.maven.MavenModuleSetBuild.getEnvironment(MavenModuleSetBuild.java:183)
at hudson.plugins.git.GitSCM.checkout(GitSCM.java:1046)
at hudson.scm.SCM.checkout(SCM.java:485)
at hudson.model.AbstractProject.checkout(AbstractProject.java:1276)
at hudson.model.AbstractBuild$AbstractBuildExecution.defaultCheckout(AbstractBuild.java:607)
at jenkins.scm.SCMCheckoutStrategy.checkout(SCMCheckoutStrategy.java:86)
at hudson.model.AbstractBuild$AbstractBuildExecution.run(AbstractBuild.java:529)
at hudson.model.Run.execute(Run.java:1738)
at hudson.maven.MavenModuleSetBuild.run(MavenModuleSetBuild.java:531)
at hudson.model.ResourceController.execute(ResourceController.java:98)
at hudson.model.Executor.run(Executor.java:410)
Caused by: java.io.IOException: Failed to mkdirs: /home/jenkins/tools/maven/apache-maven-3.0.4
at hudson.FilePath.mkdirs(FilePath.java:1163)
at hudson.FilePath.installIfNecessaryFrom(FilePath.java:798)
... 16 more
Retrying after 10 seconds
java.io.IOException: Failed to install https://repo.maven.apache.org/maven2/org/apache/maven/apache-maven/3.0.4/apache-maven-3.0.4-bin.zip to /home/jenkins/tools/maven/apache-maven-3.0.4
at hudson.FilePath.installIfNecessaryFrom(FilePath.java:832)
at hudson.tools.DownloadFromUrlInstaller.performInstallation(DownloadFromUrlInstaller.java:75)
at hudson.tools.InstallerTranslator.getToolHome(InstallerTranslator.java:68)
at hudson.tools.ToolLocationNodeProperty.getToolHome(ToolLocationNodeProperty.java:108)
at hudson.tools.ToolInstallation.translateFor(ToolInstallation.java:206)
at hudson.tasks.Maven$MavenInstallation.forNode(Maven.java:624)
at hudson.maven.MavenModuleSetBuild.getEnvironment(MavenModuleSetBuild.java:183)
at hudson.plugins.git.GitSCM.checkout(GitSCM.java:1046)
at hudson.scm.SCM.checkout(SCM.java:485)
at hudson.model.AbstractProject.checkout(AbstractProject.java:1276)
at hudson.model.AbstractBuild$AbstractBuildExecution.defaultCheckout(AbstractBuild.java:607)
at jenkins.scm.SCMCheckoutStrategy.checkout(SCMCheckoutStrategy.java:86)
at hudson.model.AbstractBuild$AbstractBuildExecution.run(AbstractBuild.java:529)
at hudson.model.Run.execute(Run.java:1738)
at hudson.maven.MavenModuleSetBuild.run(MavenModuleSetBuild.java:531)
at hudson.model.ResourceController.execute(ResourceController.java:98)
at hudson.model.Executor.run(Executor.java:410)
Caused by: java.io.IOException: Failed to mkdirs: /home/jenkins/tools/maven/apache-maven-3.0.4
at hudson.FilePath.mkdirs(FilePath.java:1163)
at hudson.FilePath.installIfNecessaryFrom(FilePath.java:798)
... 16 more
Retrying after 10 seconds
java.io.IOException: Failed to install https://repo.maven.apache.org/maven2/org/apache/maven/apache-maven/3.0.4/apache-maven-3.0.4-bin.zip to /home/jenkins/tools/maven/apache-maven-3.0.4
at hudson.FilePath.installIfNecessaryFrom(FilePath.java:832)
at hudson.tools.DownloadFromUrlInstaller.performInstallation(DownloadFromUrlInstaller.java:75)
at hudson.tools.InstallerTranslator.getToolHome(InstallerTranslator.java:68)
at hudson.tools.ToolLocationNodeProperty.getToolHome(ToolLocationNodeProperty.java:108)
at hudson.tools.ToolInstallation.translateFor(ToolInstallation.java:206)
at hudson.tasks.Maven$MavenInstallation.forNode(Maven.java:624)
at hudson.maven.MavenModuleSetBuild.getEnvironment(MavenModuleSetBuild.java:183)
at hudson.plugins.git.GitSCM.checkout(GitSCM.java:1046)
at hudson.scm.SCM.checkout(SCM.java:485)
at hudson.model.AbstractProject.checkout(AbstractProject.java:1276)
at hudson.model.AbstractBuild$AbstractBuildExecution.defaultCheckout(AbstractBuild.java:607)
at jenkins.scm.SCMCheckoutStrategy.checkout(SCMCheckoutStrategy.java:86)
at hudson.model.AbstractBuild$AbstractBuildExecution.run(AbstractBuild.java:529)
at hudson.model.Run.execute(Run.java:1738)
at hudson.maven.MavenModuleSetBuild.run(MavenModuleSetBuild.java:531)
at hudson.model.ResourceController.execute(ResourceController.java:98)
at hudson.model.Executor.run(Executor.java:410)
Caused by: java.io.IOException: Failed to mkdirs: /home/jenkins/tools/maven/apache-maven-3.0.4
at hudson.FilePath.mkdirs(FilePath.java:1163)
at hudson.FilePath.installIfNecessaryFrom(FilePath.java:798)
... 16 more
Archiving artifacts
ERROR: Failed to archive artifacts: apidocs.bz2
java.io.IOException: Failed to install https://repo.maven.apache.org/maven2/org/apache/maven/apache-maven/3.0.4/apache-maven-3.0.4-bin.zip to /home/jenkins/tools/maven/apache-maven-3.0.4
at hudson.FilePath.installIfNecessaryFrom(FilePath.java:832)
at hudson.tools.DownloadFromUrlInstaller.performInstallation(DownloadFromUrlInstaller.java:75)
at hudson.tools.InstallerTranslator.getToolHome(InstallerTranslator.java:68)
at hudson.tools.ToolLocationNodeProperty.getToolHome(ToolLocationNodeProperty.java:108)
at hudson.tools.ToolInstallation.translateFor(ToolInstallation.java:206)
at hudson.tasks.Maven$MavenInstallation.forNode(Maven.java:624)
at hudson.maven.MavenModuleSetBuild.getEnvironment(MavenModuleSetBuild.java:183)
at hudson.tasks.ArtifactArchiver.perform(ArtifactArchiver.java:232)
at hudson.tasks.BuildStepCompatibilityLayer.perform(BuildStepCompatibilityLayer.java:78)
at hudson.tasks.BuildStepMonitor$1.perform(BuildStepMonitor.java:20)
at hudson.model.AbstractBuild$AbstractBuildExecution.perform(AbstractBuild.java:782)
at hudson.model.AbstractBuild$AbstractBuildExecution.performAllBuildSteps(AbstractBuild.java:723)
at hudson.maven.MavenModuleSetBuild$MavenModuleSetBuildExecution.post2(MavenModuleSetBuild.java:1047)
at hudson.model.AbstractBuild$AbstractBuildExecution.post(AbstractBuild.java:668)
at hudson.model.Run.execute(Run.java:1763)
at hudson.maven.MavenModuleSetBuild.run(MavenModuleSetBuild.java:531)
at hudson.model.ResourceController.execute(ResourceController.java:98)
at hudson.model.Executor.run(Executor.java:410)
Caused by: java.io.IOException: Failed to mkdirs: /home/jenkins/tools/maven/apache-maven-3.0.4
at hudson.FilePath.mkdirs(FilePath.java:1163)
at hudson.FilePath.installIfNecessaryFrom(FilePath.java:798)
... 17 more
Build failed in Jenkins: cloudstack-apidocs-master #2869
Posted by Apache Jenkins Server <je...@builds.apache.org>.
See <https://builds.apache.org/job/cloudstack-apidocs-master/2869/>
------------------------------------------
Started by an SCM change
[EnvInject] - Loading node environment variables.
Building remotely on ubuntu-6 (docker Ubuntu ubuntu yahoo-not-h2) in workspace <https://builds.apache.org/job/cloudstack-apidocs-master/ws/>
java.io.IOException: Failed to install https://repo.maven.apache.org/maven2/org/apache/maven/apache-maven/3.0.4/apache-maven-3.0.4-bin.zip to /home/jenkins/tools/maven/apache-maven-3.0.4
at hudson.FilePath.installIfNecessaryFrom(FilePath.java:832)
at hudson.tools.DownloadFromUrlInstaller.performInstallation(DownloadFromUrlInstaller.java:75)
at hudson.tools.InstallerTranslator.getToolHome(InstallerTranslator.java:68)
at hudson.tools.ToolLocationNodeProperty.getToolHome(ToolLocationNodeProperty.java:108)
at hudson.tools.ToolInstallation.translateFor(ToolInstallation.java:206)
at hudson.tasks.Maven$MavenInstallation.forNode(Maven.java:624)
at hudson.maven.MavenModuleSetBuild.getEnvironment(MavenModuleSetBuild.java:183)
at hudson.plugins.git.GitSCM.checkout(GitSCM.java:1046)
at hudson.scm.SCM.checkout(SCM.java:485)
at hudson.model.AbstractProject.checkout(AbstractProject.java:1276)
at hudson.model.AbstractBuild$AbstractBuildExecution.defaultCheckout(AbstractBuild.java:607)
at jenkins.scm.SCMCheckoutStrategy.checkout(SCMCheckoutStrategy.java:86)
at hudson.model.AbstractBuild$AbstractBuildExecution.run(AbstractBuild.java:529)
at hudson.model.Run.execute(Run.java:1738)
at hudson.maven.MavenModuleSetBuild.run(MavenModuleSetBuild.java:531)
at hudson.model.ResourceController.execute(ResourceController.java:98)
at hudson.model.Executor.run(Executor.java:410)
Caused by: java.io.IOException: Failed to mkdirs: /home/jenkins/tools/maven/apache-maven-3.0.4
at hudson.FilePath.mkdirs(FilePath.java:1163)
at hudson.FilePath.installIfNecessaryFrom(FilePath.java:798)
... 16 more
Retrying after 10 seconds
java.io.IOException: Failed to install https://repo.maven.apache.org/maven2/org/apache/maven/apache-maven/3.0.4/apache-maven-3.0.4-bin.zip to /home/jenkins/tools/maven/apache-maven-3.0.4
at hudson.FilePath.installIfNecessaryFrom(FilePath.java:832)
at hudson.tools.DownloadFromUrlInstaller.performInstallation(DownloadFromUrlInstaller.java:75)
at hudson.tools.InstallerTranslator.getToolHome(InstallerTranslator.java:68)
at hudson.tools.ToolLocationNodeProperty.getToolHome(ToolLocationNodeProperty.java:108)
at hudson.tools.ToolInstallation.translateFor(ToolInstallation.java:206)
at hudson.tasks.Maven$MavenInstallation.forNode(Maven.java:624)
at hudson.maven.MavenModuleSetBuild.getEnvironment(MavenModuleSetBuild.java:183)
at hudson.plugins.git.GitSCM.checkout(GitSCM.java:1046)
at hudson.scm.SCM.checkout(SCM.java:485)
at hudson.model.AbstractProject.checkout(AbstractProject.java:1276)
at hudson.model.AbstractBuild$AbstractBuildExecution.defaultCheckout(AbstractBuild.java:607)
at jenkins.scm.SCMCheckoutStrategy.checkout(SCMCheckoutStrategy.java:86)
at hudson.model.AbstractBuild$AbstractBuildExecution.run(AbstractBuild.java:529)
at hudson.model.Run.execute(Run.java:1738)
at hudson.maven.MavenModuleSetBuild.run(MavenModuleSetBuild.java:531)
at hudson.model.ResourceController.execute(ResourceController.java:98)
at hudson.model.Executor.run(Executor.java:410)
Caused by: java.io.IOException: Failed to mkdirs: /home/jenkins/tools/maven/apache-maven-3.0.4
at hudson.FilePath.mkdirs(FilePath.java:1163)
at hudson.FilePath.installIfNecessaryFrom(FilePath.java:798)
... 16 more
Retrying after 10 seconds
java.io.IOException: Failed to install https://repo.maven.apache.org/maven2/org/apache/maven/apache-maven/3.0.4/apache-maven-3.0.4-bin.zip to /home/jenkins/tools/maven/apache-maven-3.0.4
at hudson.FilePath.installIfNecessaryFrom(FilePath.java:832)
at hudson.tools.DownloadFromUrlInstaller.performInstallation(DownloadFromUrlInstaller.java:75)
at hudson.tools.InstallerTranslator.getToolHome(InstallerTranslator.java:68)
at hudson.tools.ToolLocationNodeProperty.getToolHome(ToolLocationNodeProperty.java:108)
at hudson.tools.ToolInstallation.translateFor(ToolInstallation.java:206)
at hudson.tasks.Maven$MavenInstallation.forNode(Maven.java:624)
at hudson.maven.MavenModuleSetBuild.getEnvironment(MavenModuleSetBuild.java:183)
at hudson.plugins.git.GitSCM.checkout(GitSCM.java:1046)
at hudson.scm.SCM.checkout(SCM.java:485)
at hudson.model.AbstractProject.checkout(AbstractProject.java:1276)
at hudson.model.AbstractBuild$AbstractBuildExecution.defaultCheckout(AbstractBuild.java:607)
at jenkins.scm.SCMCheckoutStrategy.checkout(SCMCheckoutStrategy.java:86)
at hudson.model.AbstractBuild$AbstractBuildExecution.run(AbstractBuild.java:529)
at hudson.model.Run.execute(Run.java:1738)
at hudson.maven.MavenModuleSetBuild.run(MavenModuleSetBuild.java:531)
at hudson.model.ResourceController.execute(ResourceController.java:98)
at hudson.model.Executor.run(Executor.java:410)
Caused by: java.io.IOException: Failed to mkdirs: /home/jenkins/tools/maven/apache-maven-3.0.4
at hudson.FilePath.mkdirs(FilePath.java:1163)
at hudson.FilePath.installIfNecessaryFrom(FilePath.java:798)
... 16 more
Archiving artifacts
ERROR: Failed to archive artifacts: apidocs.bz2
java.io.IOException: Failed to install https://repo.maven.apache.org/maven2/org/apache/maven/apache-maven/3.0.4/apache-maven-3.0.4-bin.zip to /home/jenkins/tools/maven/apache-maven-3.0.4
at hudson.FilePath.installIfNecessaryFrom(FilePath.java:832)
at hudson.tools.DownloadFromUrlInstaller.performInstallation(DownloadFromUrlInstaller.java:75)
at hudson.tools.InstallerTranslator.getToolHome(InstallerTranslator.java:68)
at hudson.tools.ToolLocationNodeProperty.getToolHome(ToolLocationNodeProperty.java:108)
at hudson.tools.ToolInstallation.translateFor(ToolInstallation.java:206)
at hudson.tasks.Maven$MavenInstallation.forNode(Maven.java:624)
at hudson.maven.MavenModuleSetBuild.getEnvironment(MavenModuleSetBuild.java:183)
at hudson.tasks.ArtifactArchiver.perform(ArtifactArchiver.java:232)
at hudson.tasks.BuildStepCompatibilityLayer.perform(BuildStepCompatibilityLayer.java:78)
at hudson.tasks.BuildStepMonitor$1.perform(BuildStepMonitor.java:20)
at hudson.model.AbstractBuild$AbstractBuildExecution.perform(AbstractBuild.java:782)
at hudson.model.AbstractBuild$AbstractBuildExecution.performAllBuildSteps(AbstractBuild.java:723)
at hudson.maven.MavenModuleSetBuild$MavenModuleSetBuildExecution.post2(MavenModuleSetBuild.java:1047)
at hudson.model.AbstractBuild$AbstractBuildExecution.post(AbstractBuild.java:668)
at hudson.model.Run.execute(Run.java:1763)
at hudson.maven.MavenModuleSetBuild.run(MavenModuleSetBuild.java:531)
at hudson.model.ResourceController.execute(ResourceController.java:98)
at hudson.model.Executor.run(Executor.java:410)
Caused by: java.io.IOException: Failed to mkdirs: /home/jenkins/tools/maven/apache-maven-3.0.4
at hudson.FilePath.mkdirs(FilePath.java:1163)
at hudson.FilePath.installIfNecessaryFrom(FilePath.java:798)
... 17 more
Build failed in Jenkins: cloudstack-apidocs-master #2868
Posted by Apache Jenkins Server <je...@builds.apache.org>.
See <https://builds.apache.org/job/cloudstack-apidocs-master/2868/>
------------------------------------------
Started by an SCM change
[EnvInject] - Loading node environment variables.
Building remotely on ubuntu-6 (docker Ubuntu ubuntu yahoo-not-h2) in workspace <https://builds.apache.org/job/cloudstack-apidocs-master/ws/>
java.io.IOException: Failed to install https://repo.maven.apache.org/maven2/org/apache/maven/apache-maven/3.0.4/apache-maven-3.0.4-bin.zip to /home/jenkins/tools/maven/apache-maven-3.0.4
at hudson.FilePath.installIfNecessaryFrom(FilePath.java:832)
at hudson.tools.DownloadFromUrlInstaller.performInstallation(DownloadFromUrlInstaller.java:75)
at hudson.tools.InstallerTranslator.getToolHome(InstallerTranslator.java:68)
at hudson.tools.ToolLocationNodeProperty.getToolHome(ToolLocationNodeProperty.java:108)
at hudson.tools.ToolInstallation.translateFor(ToolInstallation.java:206)
at hudson.tasks.Maven$MavenInstallation.forNode(Maven.java:624)
at hudson.maven.MavenModuleSetBuild.getEnvironment(MavenModuleSetBuild.java:183)
at hudson.plugins.git.GitSCM.checkout(GitSCM.java:1046)
at hudson.scm.SCM.checkout(SCM.java:485)
at hudson.model.AbstractProject.checkout(AbstractProject.java:1276)
at hudson.model.AbstractBuild$AbstractBuildExecution.defaultCheckout(AbstractBuild.java:607)
at jenkins.scm.SCMCheckoutStrategy.checkout(SCMCheckoutStrategy.java:86)
at hudson.model.AbstractBuild$AbstractBuildExecution.run(AbstractBuild.java:529)
at hudson.model.Run.execute(Run.java:1738)
at hudson.maven.MavenModuleSetBuild.run(MavenModuleSetBuild.java:531)
at hudson.model.ResourceController.execute(ResourceController.java:98)
at hudson.model.Executor.run(Executor.java:410)
Caused by: java.io.IOException: Failed to mkdirs: /home/jenkins/tools/maven/apache-maven-3.0.4
at hudson.FilePath.mkdirs(FilePath.java:1163)
at hudson.FilePath.installIfNecessaryFrom(FilePath.java:798)
... 16 more
Retrying after 10 seconds
java.io.IOException: Failed to install https://repo.maven.apache.org/maven2/org/apache/maven/apache-maven/3.0.4/apache-maven-3.0.4-bin.zip to /home/jenkins/tools/maven/apache-maven-3.0.4
at hudson.FilePath.installIfNecessaryFrom(FilePath.java:832)
at hudson.tools.DownloadFromUrlInstaller.performInstallation(DownloadFromUrlInstaller.java:75)
at hudson.tools.InstallerTranslator.getToolHome(InstallerTranslator.java:68)
at hudson.tools.ToolLocationNodeProperty.getToolHome(ToolLocationNodeProperty.java:108)
at hudson.tools.ToolInstallation.translateFor(ToolInstallation.java:206)
at hudson.tasks.Maven$MavenInstallation.forNode(Maven.java:624)
at hudson.maven.MavenModuleSetBuild.getEnvironment(MavenModuleSetBuild.java:183)
at hudson.plugins.git.GitSCM.checkout(GitSCM.java:1046)
at hudson.scm.SCM.checkout(SCM.java:485)
at hudson.model.AbstractProject.checkout(AbstractProject.java:1276)
at hudson.model.AbstractBuild$AbstractBuildExecution.defaultCheckout(AbstractBuild.java:607)
at jenkins.scm.SCMCheckoutStrategy.checkout(SCMCheckoutStrategy.java:86)
at hudson.model.AbstractBuild$AbstractBuildExecution.run(AbstractBuild.java:529)
at hudson.model.Run.execute(Run.java:1738)
at hudson.maven.MavenModuleSetBuild.run(MavenModuleSetBuild.java:531)
at hudson.model.ResourceController.execute(ResourceController.java:98)
at hudson.model.Executor.run(Executor.java:410)
Caused by: java.io.IOException: Failed to mkdirs: /home/jenkins/tools/maven/apache-maven-3.0.4
at hudson.FilePath.mkdirs(FilePath.java:1163)
at hudson.FilePath.installIfNecessaryFrom(FilePath.java:798)
... 16 more
Retrying after 10 seconds
java.io.IOException: Failed to install https://repo.maven.apache.org/maven2/org/apache/maven/apache-maven/3.0.4/apache-maven-3.0.4-bin.zip to /home/jenkins/tools/maven/apache-maven-3.0.4
at hudson.FilePath.installIfNecessaryFrom(FilePath.java:832)
at hudson.tools.DownloadFromUrlInstaller.performInstallation(DownloadFromUrlInstaller.java:75)
at hudson.tools.InstallerTranslator.getToolHome(InstallerTranslator.java:68)
at hudson.tools.ToolLocationNodeProperty.getToolHome(ToolLocationNodeProperty.java:108)
at hudson.tools.ToolInstallation.translateFor(ToolInstallation.java:206)
at hudson.tasks.Maven$MavenInstallation.forNode(Maven.java:624)
at hudson.maven.MavenModuleSetBuild.getEnvironment(MavenModuleSetBuild.java:183)
at hudson.plugins.git.GitSCM.checkout(GitSCM.java:1046)
at hudson.scm.SCM.checkout(SCM.java:485)
at hudson.model.AbstractProject.checkout(AbstractProject.java:1276)
at hudson.model.AbstractBuild$AbstractBuildExecution.defaultCheckout(AbstractBuild.java:607)
at jenkins.scm.SCMCheckoutStrategy.checkout(SCMCheckoutStrategy.java:86)
at hudson.model.AbstractBuild$AbstractBuildExecution.run(AbstractBuild.java:529)
at hudson.model.Run.execute(Run.java:1738)
at hudson.maven.MavenModuleSetBuild.run(MavenModuleSetBuild.java:531)
at hudson.model.ResourceController.execute(ResourceController.java:98)
at hudson.model.Executor.run(Executor.java:410)
Caused by: java.io.IOException: Failed to mkdirs: /home/jenkins/tools/maven/apache-maven-3.0.4
at hudson.FilePath.mkdirs(FilePath.java:1163)
at hudson.FilePath.installIfNecessaryFrom(FilePath.java:798)
... 16 more
Archiving artifacts
ERROR: Failed to archive artifacts: apidocs.bz2
java.io.IOException: Failed to install https://repo.maven.apache.org/maven2/org/apache/maven/apache-maven/3.0.4/apache-maven-3.0.4-bin.zip to /home/jenkins/tools/maven/apache-maven-3.0.4
at hudson.FilePath.installIfNecessaryFrom(FilePath.java:832)
at hudson.tools.DownloadFromUrlInstaller.performInstallation(DownloadFromUrlInstaller.java:75)
at hudson.tools.InstallerTranslator.getToolHome(InstallerTranslator.java:68)
at hudson.tools.ToolLocationNodeProperty.getToolHome(ToolLocationNodeProperty.java:108)
at hudson.tools.ToolInstallation.translateFor(ToolInstallation.java:206)
at hudson.tasks.Maven$MavenInstallation.forNode(Maven.java:624)
at hudson.maven.MavenModuleSetBuild.getEnvironment(MavenModuleSetBuild.java:183)
at hudson.tasks.ArtifactArchiver.perform(ArtifactArchiver.java:232)
at hudson.tasks.BuildStepCompatibilityLayer.perform(BuildStepCompatibilityLayer.java:78)
at hudson.tasks.BuildStepMonitor$1.perform(BuildStepMonitor.java:20)
at hudson.model.AbstractBuild$AbstractBuildExecution.perform(AbstractBuild.java:782)
at hudson.model.AbstractBuild$AbstractBuildExecution.performAllBuildSteps(AbstractBuild.java:723)
at hudson.maven.MavenModuleSetBuild$MavenModuleSetBuildExecution.post2(MavenModuleSetBuild.java:1047)
at hudson.model.AbstractBuild$AbstractBuildExecution.post(AbstractBuild.java:668)
at hudson.model.Run.execute(Run.java:1763)
at hudson.maven.MavenModuleSetBuild.run(MavenModuleSetBuild.java:531)
at hudson.model.ResourceController.execute(ResourceController.java:98)
at hudson.model.Executor.run(Executor.java:410)
Caused by: java.io.IOException: Failed to mkdirs: /home/jenkins/tools/maven/apache-maven-3.0.4
at hudson.FilePath.mkdirs(FilePath.java:1163)
at hudson.FilePath.installIfNecessaryFrom(FilePath.java:798)
... 17 more
Build failed in Jenkins: cloudstack-apidocs-master #2867
Posted by Apache Jenkins Server <je...@builds.apache.org>.
See <https://builds.apache.org/job/cloudstack-apidocs-master/2867/>
------------------------------------------
Started by an SCM change
[EnvInject] - Loading node environment variables.
Building remotely on ubuntu-6 (docker Ubuntu ubuntu yahoo-not-h2) in workspace <https://builds.apache.org/job/cloudstack-apidocs-master/ws/>
java.io.IOException: Failed to install https://repo.maven.apache.org/maven2/org/apache/maven/apache-maven/3.0.4/apache-maven-3.0.4-bin.zip to /home/jenkins/tools/maven/apache-maven-3.0.4
at hudson.FilePath.installIfNecessaryFrom(FilePath.java:832)
at hudson.tools.DownloadFromUrlInstaller.performInstallation(DownloadFromUrlInstaller.java:75)
at hudson.tools.InstallerTranslator.getToolHome(InstallerTranslator.java:68)
at hudson.tools.ToolLocationNodeProperty.getToolHome(ToolLocationNodeProperty.java:108)
at hudson.tools.ToolInstallation.translateFor(ToolInstallation.java:206)
at hudson.tasks.Maven$MavenInstallation.forNode(Maven.java:624)
at hudson.maven.MavenModuleSetBuild.getEnvironment(MavenModuleSetBuild.java:183)
at hudson.plugins.git.GitSCM.checkout(GitSCM.java:1046)
at hudson.scm.SCM.checkout(SCM.java:485)
at hudson.model.AbstractProject.checkout(AbstractProject.java:1276)
at hudson.model.AbstractBuild$AbstractBuildExecution.defaultCheckout(AbstractBuild.java:607)
at jenkins.scm.SCMCheckoutStrategy.checkout(SCMCheckoutStrategy.java:86)
at hudson.model.AbstractBuild$AbstractBuildExecution.run(AbstractBuild.java:529)
at hudson.model.Run.execute(Run.java:1738)
at hudson.maven.MavenModuleSetBuild.run(MavenModuleSetBuild.java:531)
at hudson.model.ResourceController.execute(ResourceController.java:98)
at hudson.model.Executor.run(Executor.java:410)
Caused by: java.io.IOException: Failed to mkdirs: /home/jenkins/tools/maven/apache-maven-3.0.4
at hudson.FilePath.mkdirs(FilePath.java:1163)
at hudson.FilePath.installIfNecessaryFrom(FilePath.java:798)
... 16 more
Retrying after 10 seconds
java.io.IOException: Failed to install https://repo.maven.apache.org/maven2/org/apache/maven/apache-maven/3.0.4/apache-maven-3.0.4-bin.zip to /home/jenkins/tools/maven/apache-maven-3.0.4
at hudson.FilePath.installIfNecessaryFrom(FilePath.java:832)
at hudson.tools.DownloadFromUrlInstaller.performInstallation(DownloadFromUrlInstaller.java:75)
at hudson.tools.InstallerTranslator.getToolHome(InstallerTranslator.java:68)
at hudson.tools.ToolLocationNodeProperty.getToolHome(ToolLocationNodeProperty.java:108)
at hudson.tools.ToolInstallation.translateFor(ToolInstallation.java:206)
at hudson.tasks.Maven$MavenInstallation.forNode(Maven.java:624)
at hudson.maven.MavenModuleSetBuild.getEnvironment(MavenModuleSetBuild.java:183)
at hudson.plugins.git.GitSCM.checkout(GitSCM.java:1046)
at hudson.scm.SCM.checkout(SCM.java:485)
at hudson.model.AbstractProject.checkout(AbstractProject.java:1276)
at hudson.model.AbstractBuild$AbstractBuildExecution.defaultCheckout(AbstractBuild.java:607)
at jenkins.scm.SCMCheckoutStrategy.checkout(SCMCheckoutStrategy.java:86)
at hudson.model.AbstractBuild$AbstractBuildExecution.run(AbstractBuild.java:529)
at hudson.model.Run.execute(Run.java:1738)
at hudson.maven.MavenModuleSetBuild.run(MavenModuleSetBuild.java:531)
at hudson.model.ResourceController.execute(ResourceController.java:98)
at hudson.model.Executor.run(Executor.java:410)
Caused by: java.io.IOException: Failed to mkdirs: /home/jenkins/tools/maven/apache-maven-3.0.4
at hudson.FilePath.mkdirs(FilePath.java:1163)
at hudson.FilePath.installIfNecessaryFrom(FilePath.java:798)
... 16 more
Retrying after 10 seconds
java.io.IOException: Failed to install https://repo.maven.apache.org/maven2/org/apache/maven/apache-maven/3.0.4/apache-maven-3.0.4-bin.zip to /home/jenkins/tools/maven/apache-maven-3.0.4
at hudson.FilePath.installIfNecessaryFrom(FilePath.java:832)
at hudson.tools.DownloadFromUrlInstaller.performInstallation(DownloadFromUrlInstaller.java:75)
at hudson.tools.InstallerTranslator.getToolHome(InstallerTranslator.java:68)
at hudson.tools.ToolLocationNodeProperty.getToolHome(ToolLocationNodeProperty.java:108)
at hudson.tools.ToolInstallation.translateFor(ToolInstallation.java:206)
at hudson.tasks.Maven$MavenInstallation.forNode(Maven.java:624)
at hudson.maven.MavenModuleSetBuild.getEnvironment(MavenModuleSetBuild.java:183)
at hudson.plugins.git.GitSCM.checkout(GitSCM.java:1046)
at hudson.scm.SCM.checkout(SCM.java:485)
at hudson.model.AbstractProject.checkout(AbstractProject.java:1276)
at hudson.model.AbstractBuild$AbstractBuildExecution.defaultCheckout(AbstractBuild.java:607)
at jenkins.scm.SCMCheckoutStrategy.checkout(SCMCheckoutStrategy.java:86)
at hudson.model.AbstractBuild$AbstractBuildExecution.run(AbstractBuild.java:529)
at hudson.model.Run.execute(Run.java:1738)
at hudson.maven.MavenModuleSetBuild.run(MavenModuleSetBuild.java:531)
at hudson.model.ResourceController.execute(ResourceController.java:98)
at hudson.model.Executor.run(Executor.java:410)
Caused by: java.io.IOException: Failed to mkdirs: /home/jenkins/tools/maven/apache-maven-3.0.4
at hudson.FilePath.mkdirs(FilePath.java:1163)
at hudson.FilePath.installIfNecessaryFrom(FilePath.java:798)
... 16 more
Archiving artifacts
ERROR: Failed to archive artifacts: apidocs.bz2
java.io.IOException: Failed to install https://repo.maven.apache.org/maven2/org/apache/maven/apache-maven/3.0.4/apache-maven-3.0.4-bin.zip to /home/jenkins/tools/maven/apache-maven-3.0.4
at hudson.FilePath.installIfNecessaryFrom(FilePath.java:832)
at hudson.tools.DownloadFromUrlInstaller.performInstallation(DownloadFromUrlInstaller.java:75)
at hudson.tools.InstallerTranslator.getToolHome(InstallerTranslator.java:68)
at hudson.tools.ToolLocationNodeProperty.getToolHome(ToolLocationNodeProperty.java:108)
at hudson.tools.ToolInstallation.translateFor(ToolInstallation.java:206)
at hudson.tasks.Maven$MavenInstallation.forNode(Maven.java:624)
at hudson.maven.MavenModuleSetBuild.getEnvironment(MavenModuleSetBuild.java:183)
at hudson.tasks.ArtifactArchiver.perform(ArtifactArchiver.java:232)
at hudson.tasks.BuildStepCompatibilityLayer.perform(BuildStepCompatibilityLayer.java:78)
at hudson.tasks.BuildStepMonitor$1.perform(BuildStepMonitor.java:20)
at hudson.model.AbstractBuild$AbstractBuildExecution.perform(AbstractBuild.java:782)
at hudson.model.AbstractBuild$AbstractBuildExecution.performAllBuildSteps(AbstractBuild.java:723)
at hudson.maven.MavenModuleSetBuild$MavenModuleSetBuildExecution.post2(MavenModuleSetBuild.java:1047)
at hudson.model.AbstractBuild$AbstractBuildExecution.post(AbstractBuild.java:668)
at hudson.model.Run.execute(Run.java:1763)
at hudson.maven.MavenModuleSetBuild.run(MavenModuleSetBuild.java:531)
at hudson.model.ResourceController.execute(ResourceController.java:98)
at hudson.model.Executor.run(Executor.java:410)
Caused by: java.io.IOException: Failed to mkdirs: /home/jenkins/tools/maven/apache-maven-3.0.4
at hudson.FilePath.mkdirs(FilePath.java:1163)
at hudson.FilePath.installIfNecessaryFrom(FilePath.java:798)
... 17 more
Build failed in Jenkins: cloudstack-apidocs-master #2866
Posted by Apache Jenkins Server <je...@builds.apache.org>.
See <https://builds.apache.org/job/cloudstack-apidocs-master/2866/>
------------------------------------------
Started by an SCM change
[EnvInject] - Loading node environment variables.
Building remotely on ubuntu-6 (docker Ubuntu ubuntu yahoo-not-h2) in workspace <https://builds.apache.org/job/cloudstack-apidocs-master/ws/>
java.io.IOException: Failed to install https://repo.maven.apache.org/maven2/org/apache/maven/apache-maven/3.0.4/apache-maven-3.0.4-bin.zip to /home/jenkins/tools/maven/apache-maven-3.0.4
at hudson.FilePath.installIfNecessaryFrom(FilePath.java:832)
at hudson.tools.DownloadFromUrlInstaller.performInstallation(DownloadFromUrlInstaller.java:75)
at hudson.tools.InstallerTranslator.getToolHome(InstallerTranslator.java:68)
at hudson.tools.ToolLocationNodeProperty.getToolHome(ToolLocationNodeProperty.java:108)
at hudson.tools.ToolInstallation.translateFor(ToolInstallation.java:206)
at hudson.tasks.Maven$MavenInstallation.forNode(Maven.java:624)
at hudson.maven.MavenModuleSetBuild.getEnvironment(MavenModuleSetBuild.java:183)
at hudson.plugins.git.GitSCM.checkout(GitSCM.java:1046)
at hudson.scm.SCM.checkout(SCM.java:485)
at hudson.model.AbstractProject.checkout(AbstractProject.java:1276)
at hudson.model.AbstractBuild$AbstractBuildExecution.defaultCheckout(AbstractBuild.java:607)
at jenkins.scm.SCMCheckoutStrategy.checkout(SCMCheckoutStrategy.java:86)
at hudson.model.AbstractBuild$AbstractBuildExecution.run(AbstractBuild.java:529)
at hudson.model.Run.execute(Run.java:1738)
at hudson.maven.MavenModuleSetBuild.run(MavenModuleSetBuild.java:531)
at hudson.model.ResourceController.execute(ResourceController.java:98)
at hudson.model.Executor.run(Executor.java:410)
Caused by: java.io.IOException: Failed to mkdirs: /home/jenkins/tools/maven/apache-maven-3.0.4
at hudson.FilePath.mkdirs(FilePath.java:1163)
at hudson.FilePath.installIfNecessaryFrom(FilePath.java:798)
... 16 more
Retrying after 10 seconds
java.io.IOException: Failed to install https://repo.maven.apache.org/maven2/org/apache/maven/apache-maven/3.0.4/apache-maven-3.0.4-bin.zip to /home/jenkins/tools/maven/apache-maven-3.0.4
at hudson.FilePath.installIfNecessaryFrom(FilePath.java:832)
at hudson.tools.DownloadFromUrlInstaller.performInstallation(DownloadFromUrlInstaller.java:75)
at hudson.tools.InstallerTranslator.getToolHome(InstallerTranslator.java:68)
at hudson.tools.ToolLocationNodeProperty.getToolHome(ToolLocationNodeProperty.java:108)
at hudson.tools.ToolInstallation.translateFor(ToolInstallation.java:206)
at hudson.tasks.Maven$MavenInstallation.forNode(Maven.java:624)
at hudson.maven.MavenModuleSetBuild.getEnvironment(MavenModuleSetBuild.java:183)
at hudson.plugins.git.GitSCM.checkout(GitSCM.java:1046)
at hudson.scm.SCM.checkout(SCM.java:485)
at hudson.model.AbstractProject.checkout(AbstractProject.java:1276)
at hudson.model.AbstractBuild$AbstractBuildExecution.defaultCheckout(AbstractBuild.java:607)
at jenkins.scm.SCMCheckoutStrategy.checkout(SCMCheckoutStrategy.java:86)
at hudson.model.AbstractBuild$AbstractBuildExecution.run(AbstractBuild.java:529)
at hudson.model.Run.execute(Run.java:1738)
at hudson.maven.MavenModuleSetBuild.run(MavenModuleSetBuild.java:531)
at hudson.model.ResourceController.execute(ResourceController.java:98)
at hudson.model.Executor.run(Executor.java:410)
Caused by: java.io.IOException: Failed to mkdirs: /home/jenkins/tools/maven/apache-maven-3.0.4
at hudson.FilePath.mkdirs(FilePath.java:1163)
at hudson.FilePath.installIfNecessaryFrom(FilePath.java:798)
... 16 more
Retrying after 10 seconds
java.io.IOException: Failed to install https://repo.maven.apache.org/maven2/org/apache/maven/apache-maven/3.0.4/apache-maven-3.0.4-bin.zip to /home/jenkins/tools/maven/apache-maven-3.0.4
at hudson.FilePath.installIfNecessaryFrom(FilePath.java:832)
at hudson.tools.DownloadFromUrlInstaller.performInstallation(DownloadFromUrlInstaller.java:75)
at hudson.tools.InstallerTranslator.getToolHome(InstallerTranslator.java:68)
at hudson.tools.ToolLocationNodeProperty.getToolHome(ToolLocationNodeProperty.java:108)
at hudson.tools.ToolInstallation.translateFor(ToolInstallation.java:206)
at hudson.tasks.Maven$MavenInstallation.forNode(Maven.java:624)
at hudson.maven.MavenModuleSetBuild.getEnvironment(MavenModuleSetBuild.java:183)
at hudson.plugins.git.GitSCM.checkout(GitSCM.java:1046)
at hudson.scm.SCM.checkout(SCM.java:485)
at hudson.model.AbstractProject.checkout(AbstractProject.java:1276)
at hudson.model.AbstractBuild$AbstractBuildExecution.defaultCheckout(AbstractBuild.java:607)
at jenkins.scm.SCMCheckoutStrategy.checkout(SCMCheckoutStrategy.java:86)
at hudson.model.AbstractBuild$AbstractBuildExecution.run(AbstractBuild.java:529)
at hudson.model.Run.execute(Run.java:1738)
at hudson.maven.MavenModuleSetBuild.run(MavenModuleSetBuild.java:531)
at hudson.model.ResourceController.execute(ResourceController.java:98)
at hudson.model.Executor.run(Executor.java:410)
Caused by: java.io.IOException: Failed to mkdirs: /home/jenkins/tools/maven/apache-maven-3.0.4
at hudson.FilePath.mkdirs(FilePath.java:1163)
at hudson.FilePath.installIfNecessaryFrom(FilePath.java:798)
... 16 more
Archiving artifacts
ERROR: Failed to archive artifacts: apidocs.bz2
java.io.IOException: Failed to install https://repo.maven.apache.org/maven2/org/apache/maven/apache-maven/3.0.4/apache-maven-3.0.4-bin.zip to /home/jenkins/tools/maven/apache-maven-3.0.4
at hudson.FilePath.installIfNecessaryFrom(FilePath.java:832)
at hudson.tools.DownloadFromUrlInstaller.performInstallation(DownloadFromUrlInstaller.java:75)
at hudson.tools.InstallerTranslator.getToolHome(InstallerTranslator.java:68)
at hudson.tools.ToolLocationNodeProperty.getToolHome(ToolLocationNodeProperty.java:108)
at hudson.tools.ToolInstallation.translateFor(ToolInstallation.java:206)
at hudson.tasks.Maven$MavenInstallation.forNode(Maven.java:624)
at hudson.maven.MavenModuleSetBuild.getEnvironment(MavenModuleSetBuild.java:183)
at hudson.tasks.ArtifactArchiver.perform(ArtifactArchiver.java:232)
at hudson.tasks.BuildStepCompatibilityLayer.perform(BuildStepCompatibilityLayer.java:78)
at hudson.tasks.BuildStepMonitor$1.perform(BuildStepMonitor.java:20)
at hudson.model.AbstractBuild$AbstractBuildExecution.perform(AbstractBuild.java:782)
at hudson.model.AbstractBuild$AbstractBuildExecution.performAllBuildSteps(AbstractBuild.java:723)
at hudson.maven.MavenModuleSetBuild$MavenModuleSetBuildExecution.post2(MavenModuleSetBuild.java:1047)
at hudson.model.AbstractBuild$AbstractBuildExecution.post(AbstractBuild.java:668)
at hudson.model.Run.execute(Run.java:1763)
at hudson.maven.MavenModuleSetBuild.run(MavenModuleSetBuild.java:531)
at hudson.model.ResourceController.execute(ResourceController.java:98)
at hudson.model.Executor.run(Executor.java:410)
Caused by: java.io.IOException: Failed to mkdirs: /home/jenkins/tools/maven/apache-maven-3.0.4
at hudson.FilePath.mkdirs(FilePath.java:1163)
at hudson.FilePath.installIfNecessaryFrom(FilePath.java:798)
... 17 more
Build failed in Jenkins: cloudstack-apidocs-master #2865
Posted by Apache Jenkins Server <je...@builds.apache.org>.
See <https://builds.apache.org/job/cloudstack-apidocs-master/2865/>
------------------------------------------
Started by an SCM change
[EnvInject] - Loading node environment variables.
Building remotely on ubuntu-6 (docker Ubuntu ubuntu yahoo-not-h2) in workspace <https://builds.apache.org/job/cloudstack-apidocs-master/ws/>
java.io.IOException: Failed to install https://repo.maven.apache.org/maven2/org/apache/maven/apache-maven/3.0.4/apache-maven-3.0.4-bin.zip to /home/jenkins/tools/maven/apache-maven-3.0.4
at hudson.FilePath.installIfNecessaryFrom(FilePath.java:832)
at hudson.tools.DownloadFromUrlInstaller.performInstallation(DownloadFromUrlInstaller.java:75)
at hudson.tools.InstallerTranslator.getToolHome(InstallerTranslator.java:68)
at hudson.tools.ToolLocationNodeProperty.getToolHome(ToolLocationNodeProperty.java:108)
at hudson.tools.ToolInstallation.translateFor(ToolInstallation.java:206)
at hudson.tasks.Maven$MavenInstallation.forNode(Maven.java:624)
at hudson.maven.MavenModuleSetBuild.getEnvironment(MavenModuleSetBuild.java:183)
at hudson.plugins.git.GitSCM.checkout(GitSCM.java:1046)
at hudson.scm.SCM.checkout(SCM.java:485)
at hudson.model.AbstractProject.checkout(AbstractProject.java:1276)
at hudson.model.AbstractBuild$AbstractBuildExecution.defaultCheckout(AbstractBuild.java:607)
at jenkins.scm.SCMCheckoutStrategy.checkout(SCMCheckoutStrategy.java:86)
at hudson.model.AbstractBuild$AbstractBuildExecution.run(AbstractBuild.java:529)
at hudson.model.Run.execute(Run.java:1738)
at hudson.maven.MavenModuleSetBuild.run(MavenModuleSetBuild.java:531)
at hudson.model.ResourceController.execute(ResourceController.java:98)
at hudson.model.Executor.run(Executor.java:410)
Caused by: java.io.IOException: Failed to mkdirs: /home/jenkins/tools/maven/apache-maven-3.0.4
at hudson.FilePath.mkdirs(FilePath.java:1163)
at hudson.FilePath.installIfNecessaryFrom(FilePath.java:798)
... 16 more
Retrying after 10 seconds
java.io.IOException: Failed to install https://repo.maven.apache.org/maven2/org/apache/maven/apache-maven/3.0.4/apache-maven-3.0.4-bin.zip to /home/jenkins/tools/maven/apache-maven-3.0.4
at hudson.FilePath.installIfNecessaryFrom(FilePath.java:832)
at hudson.tools.DownloadFromUrlInstaller.performInstallation(DownloadFromUrlInstaller.java:75)
at hudson.tools.InstallerTranslator.getToolHome(InstallerTranslator.java:68)
at hudson.tools.ToolLocationNodeProperty.getToolHome(ToolLocationNodeProperty.java:108)
at hudson.tools.ToolInstallation.translateFor(ToolInstallation.java:206)
at hudson.tasks.Maven$MavenInstallation.forNode(Maven.java:624)
at hudson.maven.MavenModuleSetBuild.getEnvironment(MavenModuleSetBuild.java:183)
at hudson.plugins.git.GitSCM.checkout(GitSCM.java:1046)
at hudson.scm.SCM.checkout(SCM.java:485)
at hudson.model.AbstractProject.checkout(AbstractProject.java:1276)
at hudson.model.AbstractBuild$AbstractBuildExecution.defaultCheckout(AbstractBuild.java:607)
at jenkins.scm.SCMCheckoutStrategy.checkout(SCMCheckoutStrategy.java:86)
at hudson.model.AbstractBuild$AbstractBuildExecution.run(AbstractBuild.java:529)
at hudson.model.Run.execute(Run.java:1738)
at hudson.maven.MavenModuleSetBuild.run(MavenModuleSetBuild.java:531)
at hudson.model.ResourceController.execute(ResourceController.java:98)
at hudson.model.Executor.run(Executor.java:410)
Caused by: java.io.IOException: Failed to mkdirs: /home/jenkins/tools/maven/apache-maven-3.0.4
at hudson.FilePath.mkdirs(FilePath.java:1163)
at hudson.FilePath.installIfNecessaryFrom(FilePath.java:798)
... 16 more
Retrying after 10 seconds
java.io.IOException: Failed to install https://repo.maven.apache.org/maven2/org/apache/maven/apache-maven/3.0.4/apache-maven-3.0.4-bin.zip to /home/jenkins/tools/maven/apache-maven-3.0.4
at hudson.FilePath.installIfNecessaryFrom(FilePath.java:832)
at hudson.tools.DownloadFromUrlInstaller.performInstallation(DownloadFromUrlInstaller.java:75)
at hudson.tools.InstallerTranslator.getToolHome(InstallerTranslator.java:68)
at hudson.tools.ToolLocationNodeProperty.getToolHome(ToolLocationNodeProperty.java:108)
at hudson.tools.ToolInstallation.translateFor(ToolInstallation.java:206)
at hudson.tasks.Maven$MavenInstallation.forNode(Maven.java:624)
at hudson.maven.MavenModuleSetBuild.getEnvironment(MavenModuleSetBuild.java:183)
at hudson.plugins.git.GitSCM.checkout(GitSCM.java:1046)
at hudson.scm.SCM.checkout(SCM.java:485)
at hudson.model.AbstractProject.checkout(AbstractProject.java:1276)
at hudson.model.AbstractBuild$AbstractBuildExecution.defaultCheckout(AbstractBuild.java:607)
at jenkins.scm.SCMCheckoutStrategy.checkout(SCMCheckoutStrategy.java:86)
at hudson.model.AbstractBuild$AbstractBuildExecution.run(AbstractBuild.java:529)
at hudson.model.Run.execute(Run.java:1738)
at hudson.maven.MavenModuleSetBuild.run(MavenModuleSetBuild.java:531)
at hudson.model.ResourceController.execute(ResourceController.java:98)
at hudson.model.Executor.run(Executor.java:410)
Caused by: java.io.IOException: Failed to mkdirs: /home/jenkins/tools/maven/apache-maven-3.0.4
at hudson.FilePath.mkdirs(FilePath.java:1163)
at hudson.FilePath.installIfNecessaryFrom(FilePath.java:798)
... 16 more
Archiving artifacts
ERROR: Failed to archive artifacts: apidocs.bz2
java.io.IOException: Failed to install https://repo.maven.apache.org/maven2/org/apache/maven/apache-maven/3.0.4/apache-maven-3.0.4-bin.zip to /home/jenkins/tools/maven/apache-maven-3.0.4
at hudson.FilePath.installIfNecessaryFrom(FilePath.java:832)
at hudson.tools.DownloadFromUrlInstaller.performInstallation(DownloadFromUrlInstaller.java:75)
at hudson.tools.InstallerTranslator.getToolHome(InstallerTranslator.java:68)
at hudson.tools.ToolLocationNodeProperty.getToolHome(ToolLocationNodeProperty.java:108)
at hudson.tools.ToolInstallation.translateFor(ToolInstallation.java:206)
at hudson.tasks.Maven$MavenInstallation.forNode(Maven.java:624)
at hudson.maven.MavenModuleSetBuild.getEnvironment(MavenModuleSetBuild.java:183)
at hudson.tasks.ArtifactArchiver.perform(ArtifactArchiver.java:232)
at hudson.tasks.BuildStepCompatibilityLayer.perform(BuildStepCompatibilityLayer.java:78)
at hudson.tasks.BuildStepMonitor$1.perform(BuildStepMonitor.java:20)
at hudson.model.AbstractBuild$AbstractBuildExecution.perform(AbstractBuild.java:782)
at hudson.model.AbstractBuild$AbstractBuildExecution.performAllBuildSteps(AbstractBuild.java:723)
at hudson.maven.MavenModuleSetBuild$MavenModuleSetBuildExecution.post2(MavenModuleSetBuild.java:1047)
at hudson.model.AbstractBuild$AbstractBuildExecution.post(AbstractBuild.java:668)
at hudson.model.Run.execute(Run.java:1763)
at hudson.maven.MavenModuleSetBuild.run(MavenModuleSetBuild.java:531)
at hudson.model.ResourceController.execute(ResourceController.java:98)
at hudson.model.Executor.run(Executor.java:410)
Caused by: java.io.IOException: Failed to mkdirs: /home/jenkins/tools/maven/apache-maven-3.0.4
at hudson.FilePath.mkdirs(FilePath.java:1163)
at hudson.FilePath.installIfNecessaryFrom(FilePath.java:798)
... 17 more
Build failed in Jenkins: cloudstack-apidocs-master #2864
Posted by Apache Jenkins Server <je...@builds.apache.org>.
See <https://builds.apache.org/job/cloudstack-apidocs-master/2864/>
------------------------------------------
Started by an SCM change
[EnvInject] - Loading node environment variables.
Building remotely on ubuntu-6 (docker Ubuntu ubuntu yahoo-not-h2) in workspace <https://builds.apache.org/job/cloudstack-apidocs-master/ws/>
java.io.IOException: Failed to install https://repo.maven.apache.org/maven2/org/apache/maven/apache-maven/3.0.4/apache-maven-3.0.4-bin.zip to /home/jenkins/tools/maven/apache-maven-3.0.4
at hudson.FilePath.installIfNecessaryFrom(FilePath.java:832)
at hudson.tools.DownloadFromUrlInstaller.performInstallation(DownloadFromUrlInstaller.java:75)
at hudson.tools.InstallerTranslator.getToolHome(InstallerTranslator.java:68)
at hudson.tools.ToolLocationNodeProperty.getToolHome(ToolLocationNodeProperty.java:108)
at hudson.tools.ToolInstallation.translateFor(ToolInstallation.java:206)
at hudson.tasks.Maven$MavenInstallation.forNode(Maven.java:624)
at hudson.maven.MavenModuleSetBuild.getEnvironment(MavenModuleSetBuild.java:183)
at hudson.plugins.git.GitSCM.checkout(GitSCM.java:1046)
at hudson.scm.SCM.checkout(SCM.java:485)
at hudson.model.AbstractProject.checkout(AbstractProject.java:1276)
at hudson.model.AbstractBuild$AbstractBuildExecution.defaultCheckout(AbstractBuild.java:607)
at jenkins.scm.SCMCheckoutStrategy.checkout(SCMCheckoutStrategy.java:86)
at hudson.model.AbstractBuild$AbstractBuildExecution.run(AbstractBuild.java:529)
at hudson.model.Run.execute(Run.java:1738)
at hudson.maven.MavenModuleSetBuild.run(MavenModuleSetBuild.java:531)
at hudson.model.ResourceController.execute(ResourceController.java:98)
at hudson.model.Executor.run(Executor.java:410)
Caused by: java.io.IOException: Failed to mkdirs: /home/jenkins/tools/maven/apache-maven-3.0.4
at hudson.FilePath.mkdirs(FilePath.java:1163)
at hudson.FilePath.installIfNecessaryFrom(FilePath.java:798)
... 16 more
Retrying after 10 seconds
java.io.IOException: Failed to install https://repo.maven.apache.org/maven2/org/apache/maven/apache-maven/3.0.4/apache-maven-3.0.4-bin.zip to /home/jenkins/tools/maven/apache-maven-3.0.4
at hudson.FilePath.installIfNecessaryFrom(FilePath.java:832)
at hudson.tools.DownloadFromUrlInstaller.performInstallation(DownloadFromUrlInstaller.java:75)
at hudson.tools.InstallerTranslator.getToolHome(InstallerTranslator.java:68)
at hudson.tools.ToolLocationNodeProperty.getToolHome(ToolLocationNodeProperty.java:108)
at hudson.tools.ToolInstallation.translateFor(ToolInstallation.java:206)
at hudson.tasks.Maven$MavenInstallation.forNode(Maven.java:624)
at hudson.maven.MavenModuleSetBuild.getEnvironment(MavenModuleSetBuild.java:183)
at hudson.plugins.git.GitSCM.checkout(GitSCM.java:1046)
at hudson.scm.SCM.checkout(SCM.java:485)
at hudson.model.AbstractProject.checkout(AbstractProject.java:1276)
at hudson.model.AbstractBuild$AbstractBuildExecution.defaultCheckout(AbstractBuild.java:607)
at jenkins.scm.SCMCheckoutStrategy.checkout(SCMCheckoutStrategy.java:86)
at hudson.model.AbstractBuild$AbstractBuildExecution.run(AbstractBuild.java:529)
at hudson.model.Run.execute(Run.java:1738)
at hudson.maven.MavenModuleSetBuild.run(MavenModuleSetBuild.java:531)
at hudson.model.ResourceController.execute(ResourceController.java:98)
at hudson.model.Executor.run(Executor.java:410)
Caused by: java.io.IOException: Failed to mkdirs: /home/jenkins/tools/maven/apache-maven-3.0.4
at hudson.FilePath.mkdirs(FilePath.java:1163)
at hudson.FilePath.installIfNecessaryFrom(FilePath.java:798)
... 16 more
Retrying after 10 seconds
java.io.IOException: Failed to install https://repo.maven.apache.org/maven2/org/apache/maven/apache-maven/3.0.4/apache-maven-3.0.4-bin.zip to /home/jenkins/tools/maven/apache-maven-3.0.4
at hudson.FilePath.installIfNecessaryFrom(FilePath.java:832)
at hudson.tools.DownloadFromUrlInstaller.performInstallation(DownloadFromUrlInstaller.java:75)
at hudson.tools.InstallerTranslator.getToolHome(InstallerTranslator.java:68)
at hudson.tools.ToolLocationNodeProperty.getToolHome(ToolLocationNodeProperty.java:108)
at hudson.tools.ToolInstallation.translateFor(ToolInstallation.java:206)
at hudson.tasks.Maven$MavenInstallation.forNode(Maven.java:624)
at hudson.maven.MavenModuleSetBuild.getEnvironment(MavenModuleSetBuild.java:183)
at hudson.plugins.git.GitSCM.checkout(GitSCM.java:1046)
at hudson.scm.SCM.checkout(SCM.java:485)
at hudson.model.AbstractProject.checkout(AbstractProject.java:1276)
at hudson.model.AbstractBuild$AbstractBuildExecution.defaultCheckout(AbstractBuild.java:607)
at jenkins.scm.SCMCheckoutStrategy.checkout(SCMCheckoutStrategy.java:86)
at hudson.model.AbstractBuild$AbstractBuildExecution.run(AbstractBuild.java:529)
at hudson.model.Run.execute(Run.java:1738)
at hudson.maven.MavenModuleSetBuild.run(MavenModuleSetBuild.java:531)
at hudson.model.ResourceController.execute(ResourceController.java:98)
at hudson.model.Executor.run(Executor.java:410)
Caused by: java.io.IOException: Failed to mkdirs: /home/jenkins/tools/maven/apache-maven-3.0.4
at hudson.FilePath.mkdirs(FilePath.java:1163)
at hudson.FilePath.installIfNecessaryFrom(FilePath.java:798)
... 16 more
Archiving artifacts
ERROR: Failed to archive artifacts: apidocs.bz2
java.io.IOException: Failed to install https://repo.maven.apache.org/maven2/org/apache/maven/apache-maven/3.0.4/apache-maven-3.0.4-bin.zip to /home/jenkins/tools/maven/apache-maven-3.0.4
at hudson.FilePath.installIfNecessaryFrom(FilePath.java:832)
at hudson.tools.DownloadFromUrlInstaller.performInstallation(DownloadFromUrlInstaller.java:75)
at hudson.tools.InstallerTranslator.getToolHome(InstallerTranslator.java:68)
at hudson.tools.ToolLocationNodeProperty.getToolHome(ToolLocationNodeProperty.java:108)
at hudson.tools.ToolInstallation.translateFor(ToolInstallation.java:206)
at hudson.tasks.Maven$MavenInstallation.forNode(Maven.java:624)
at hudson.maven.MavenModuleSetBuild.getEnvironment(MavenModuleSetBuild.java:183)
at hudson.tasks.ArtifactArchiver.perform(ArtifactArchiver.java:232)
at hudson.tasks.BuildStepCompatibilityLayer.perform(BuildStepCompatibilityLayer.java:78)
at hudson.tasks.BuildStepMonitor$1.perform(BuildStepMonitor.java:20)
at hudson.model.AbstractBuild$AbstractBuildExecution.perform(AbstractBuild.java:782)
at hudson.model.AbstractBuild$AbstractBuildExecution.performAllBuildSteps(AbstractBuild.java:723)
at hudson.maven.MavenModuleSetBuild$MavenModuleSetBuildExecution.post2(MavenModuleSetBuild.java:1047)
at hudson.model.AbstractBuild$AbstractBuildExecution.post(AbstractBuild.java:668)
at hudson.model.Run.execute(Run.java:1763)
at hudson.maven.MavenModuleSetBuild.run(MavenModuleSetBuild.java:531)
at hudson.model.ResourceController.execute(ResourceController.java:98)
at hudson.model.Executor.run(Executor.java:410)
Caused by: java.io.IOException: Failed to mkdirs: /home/jenkins/tools/maven/apache-maven-3.0.4
at hudson.FilePath.mkdirs(FilePath.java:1163)
at hudson.FilePath.installIfNecessaryFrom(FilePath.java:798)
... 17 more
Build failed in Jenkins: cloudstack-apidocs-master #2863
Posted by Apache Jenkins Server <je...@builds.apache.org>.
See <https://builds.apache.org/job/cloudstack-apidocs-master/2863/>
------------------------------------------
Started by an SCM change
[EnvInject] - Loading node environment variables.
Building remotely on ubuntu-6 (docker Ubuntu ubuntu yahoo-not-h2) in workspace <https://builds.apache.org/job/cloudstack-apidocs-master/ws/>
java.io.IOException: Failed to install https://repo.maven.apache.org/maven2/org/apache/maven/apache-maven/3.0.4/apache-maven-3.0.4-bin.zip to /home/jenkins/tools/maven/apache-maven-3.0.4
at hudson.FilePath.installIfNecessaryFrom(FilePath.java:832)
at hudson.tools.DownloadFromUrlInstaller.performInstallation(DownloadFromUrlInstaller.java:75)
at hudson.tools.InstallerTranslator.getToolHome(InstallerTranslator.java:68)
at hudson.tools.ToolLocationNodeProperty.getToolHome(ToolLocationNodeProperty.java:108)
at hudson.tools.ToolInstallation.translateFor(ToolInstallation.java:206)
at hudson.tasks.Maven$MavenInstallation.forNode(Maven.java:624)
at hudson.maven.MavenModuleSetBuild.getEnvironment(MavenModuleSetBuild.java:183)
at hudson.plugins.git.GitSCM.checkout(GitSCM.java:1046)
at hudson.scm.SCM.checkout(SCM.java:485)
at hudson.model.AbstractProject.checkout(AbstractProject.java:1276)
at hudson.model.AbstractBuild$AbstractBuildExecution.defaultCheckout(AbstractBuild.java:607)
at jenkins.scm.SCMCheckoutStrategy.checkout(SCMCheckoutStrategy.java:86)
at hudson.model.AbstractBuild$AbstractBuildExecution.run(AbstractBuild.java:529)
at hudson.model.Run.execute(Run.java:1738)
at hudson.maven.MavenModuleSetBuild.run(MavenModuleSetBuild.java:531)
at hudson.model.ResourceController.execute(ResourceController.java:98)
at hudson.model.Executor.run(Executor.java:410)
Caused by: java.io.IOException: Failed to mkdirs: /home/jenkins/tools/maven/apache-maven-3.0.4
at hudson.FilePath.mkdirs(FilePath.java:1163)
at hudson.FilePath.installIfNecessaryFrom(FilePath.java:798)
... 16 more
Retrying after 10 seconds
java.io.IOException: Failed to install https://repo.maven.apache.org/maven2/org/apache/maven/apache-maven/3.0.4/apache-maven-3.0.4-bin.zip to /home/jenkins/tools/maven/apache-maven-3.0.4
at hudson.FilePath.installIfNecessaryFrom(FilePath.java:832)
at hudson.tools.DownloadFromUrlInstaller.performInstallation(DownloadFromUrlInstaller.java:75)
at hudson.tools.InstallerTranslator.getToolHome(InstallerTranslator.java:68)
at hudson.tools.ToolLocationNodeProperty.getToolHome(ToolLocationNodeProperty.java:108)
at hudson.tools.ToolInstallation.translateFor(ToolInstallation.java:206)
at hudson.tasks.Maven$MavenInstallation.forNode(Maven.java:624)
at hudson.maven.MavenModuleSetBuild.getEnvironment(MavenModuleSetBuild.java:183)
at hudson.plugins.git.GitSCM.checkout(GitSCM.java:1046)
at hudson.scm.SCM.checkout(SCM.java:485)
at hudson.model.AbstractProject.checkout(AbstractProject.java:1276)
at hudson.model.AbstractBuild$AbstractBuildExecution.defaultCheckout(AbstractBuild.java:607)
at jenkins.scm.SCMCheckoutStrategy.checkout(SCMCheckoutStrategy.java:86)
at hudson.model.AbstractBuild$AbstractBuildExecution.run(AbstractBuild.java:529)
at hudson.model.Run.execute(Run.java:1738)
at hudson.maven.MavenModuleSetBuild.run(MavenModuleSetBuild.java:531)
at hudson.model.ResourceController.execute(ResourceController.java:98)
at hudson.model.Executor.run(Executor.java:410)
Caused by: java.io.IOException: Failed to mkdirs: /home/jenkins/tools/maven/apache-maven-3.0.4
at hudson.FilePath.mkdirs(FilePath.java:1163)
at hudson.FilePath.installIfNecessaryFrom(FilePath.java:798)
... 16 more
Retrying after 10 seconds
java.io.IOException: Failed to install https://repo.maven.apache.org/maven2/org/apache/maven/apache-maven/3.0.4/apache-maven-3.0.4-bin.zip to /home/jenkins/tools/maven/apache-maven-3.0.4
at hudson.FilePath.installIfNecessaryFrom(FilePath.java:832)
at hudson.tools.DownloadFromUrlInstaller.performInstallation(DownloadFromUrlInstaller.java:75)
at hudson.tools.InstallerTranslator.getToolHome(InstallerTranslator.java:68)
at hudson.tools.ToolLocationNodeProperty.getToolHome(ToolLocationNodeProperty.java:108)
at hudson.tools.ToolInstallation.translateFor(ToolInstallation.java:206)
at hudson.tasks.Maven$MavenInstallation.forNode(Maven.java:624)
at hudson.maven.MavenModuleSetBuild.getEnvironment(MavenModuleSetBuild.java:183)
at hudson.plugins.git.GitSCM.checkout(GitSCM.java:1046)
at hudson.scm.SCM.checkout(SCM.java:485)
at hudson.model.AbstractProject.checkout(AbstractProject.java:1276)
at hudson.model.AbstractBuild$AbstractBuildExecution.defaultCheckout(AbstractBuild.java:607)
at jenkins.scm.SCMCheckoutStrategy.checkout(SCMCheckoutStrategy.java:86)
at hudson.model.AbstractBuild$AbstractBuildExecution.run(AbstractBuild.java:529)
at hudson.model.Run.execute(Run.java:1738)
at hudson.maven.MavenModuleSetBuild.run(MavenModuleSetBuild.java:531)
at hudson.model.ResourceController.execute(ResourceController.java:98)
at hudson.model.Executor.run(Executor.java:410)
Caused by: java.io.IOException: Failed to mkdirs: /home/jenkins/tools/maven/apache-maven-3.0.4
at hudson.FilePath.mkdirs(FilePath.java:1163)
at hudson.FilePath.installIfNecessaryFrom(FilePath.java:798)
... 16 more
Archiving artifacts
ERROR: Failed to archive artifacts: apidocs.bz2
java.io.IOException: Failed to install https://repo.maven.apache.org/maven2/org/apache/maven/apache-maven/3.0.4/apache-maven-3.0.4-bin.zip to /home/jenkins/tools/maven/apache-maven-3.0.4
at hudson.FilePath.installIfNecessaryFrom(FilePath.java:832)
at hudson.tools.DownloadFromUrlInstaller.performInstallation(DownloadFromUrlInstaller.java:75)
at hudson.tools.InstallerTranslator.getToolHome(InstallerTranslator.java:68)
at hudson.tools.ToolLocationNodeProperty.getToolHome(ToolLocationNodeProperty.java:108)
at hudson.tools.ToolInstallation.translateFor(ToolInstallation.java:206)
at hudson.tasks.Maven$MavenInstallation.forNode(Maven.java:624)
at hudson.maven.MavenModuleSetBuild.getEnvironment(MavenModuleSetBuild.java:183)
at hudson.tasks.ArtifactArchiver.perform(ArtifactArchiver.java:232)
at hudson.tasks.BuildStepCompatibilityLayer.perform(BuildStepCompatibilityLayer.java:78)
at hudson.tasks.BuildStepMonitor$1.perform(BuildStepMonitor.java:20)
at hudson.model.AbstractBuild$AbstractBuildExecution.perform(AbstractBuild.java:782)
at hudson.model.AbstractBuild$AbstractBuildExecution.performAllBuildSteps(AbstractBuild.java:723)
at hudson.maven.MavenModuleSetBuild$MavenModuleSetBuildExecution.post2(MavenModuleSetBuild.java:1047)
at hudson.model.AbstractBuild$AbstractBuildExecution.post(AbstractBuild.java:668)
at hudson.model.Run.execute(Run.java:1763)
at hudson.maven.MavenModuleSetBuild.run(MavenModuleSetBuild.java:531)
at hudson.model.ResourceController.execute(ResourceController.java:98)
at hudson.model.Executor.run(Executor.java:410)
Caused by: java.io.IOException: Failed to mkdirs: /home/jenkins/tools/maven/apache-maven-3.0.4
at hudson.FilePath.mkdirs(FilePath.java:1163)
at hudson.FilePath.installIfNecessaryFrom(FilePath.java:798)
... 17 more
Build failed in Jenkins: cloudstack-apidocs-master #2862
Posted by Apache Jenkins Server <je...@builds.apache.org>.
See <https://builds.apache.org/job/cloudstack-apidocs-master/2862/>
------------------------------------------
Started by an SCM change
[EnvInject] - Loading node environment variables.
Building remotely on ubuntu-6 (docker Ubuntu ubuntu yahoo-not-h2) in workspace <https://builds.apache.org/job/cloudstack-apidocs-master/ws/>
java.io.IOException: Failed to install https://repo.maven.apache.org/maven2/org/apache/maven/apache-maven/3.0.4/apache-maven-3.0.4-bin.zip to /home/jenkins/tools/maven/apache-maven-3.0.4
at hudson.FilePath.installIfNecessaryFrom(FilePath.java:832)
at hudson.tools.DownloadFromUrlInstaller.performInstallation(DownloadFromUrlInstaller.java:75)
at hudson.tools.InstallerTranslator.getToolHome(InstallerTranslator.java:68)
at hudson.tools.ToolLocationNodeProperty.getToolHome(ToolLocationNodeProperty.java:108)
at hudson.tools.ToolInstallation.translateFor(ToolInstallation.java:206)
at hudson.tasks.Maven$MavenInstallation.forNode(Maven.java:624)
at hudson.maven.MavenModuleSetBuild.getEnvironment(MavenModuleSetBuild.java:183)
at hudson.plugins.git.GitSCM.checkout(GitSCM.java:1046)
at hudson.scm.SCM.checkout(SCM.java:485)
at hudson.model.AbstractProject.checkout(AbstractProject.java:1276)
at hudson.model.AbstractBuild$AbstractBuildExecution.defaultCheckout(AbstractBuild.java:607)
at jenkins.scm.SCMCheckoutStrategy.checkout(SCMCheckoutStrategy.java:86)
at hudson.model.AbstractBuild$AbstractBuildExecution.run(AbstractBuild.java:529)
at hudson.model.Run.execute(Run.java:1738)
at hudson.maven.MavenModuleSetBuild.run(MavenModuleSetBuild.java:531)
at hudson.model.ResourceController.execute(ResourceController.java:98)
at hudson.model.Executor.run(Executor.java:410)
Caused by: java.io.IOException: Failed to mkdirs: /home/jenkins/tools/maven/apache-maven-3.0.4
at hudson.FilePath.mkdirs(FilePath.java:1163)
at hudson.FilePath.installIfNecessaryFrom(FilePath.java:798)
... 16 more
Retrying after 10 seconds
java.io.IOException: Failed to install https://repo.maven.apache.org/maven2/org/apache/maven/apache-maven/3.0.4/apache-maven-3.0.4-bin.zip to /home/jenkins/tools/maven/apache-maven-3.0.4
at hudson.FilePath.installIfNecessaryFrom(FilePath.java:832)
at hudson.tools.DownloadFromUrlInstaller.performInstallation(DownloadFromUrlInstaller.java:75)
at hudson.tools.InstallerTranslator.getToolHome(InstallerTranslator.java:68)
at hudson.tools.ToolLocationNodeProperty.getToolHome(ToolLocationNodeProperty.java:108)
at hudson.tools.ToolInstallation.translateFor(ToolInstallation.java:206)
at hudson.tasks.Maven$MavenInstallation.forNode(Maven.java:624)
at hudson.maven.MavenModuleSetBuild.getEnvironment(MavenModuleSetBuild.java:183)
at hudson.plugins.git.GitSCM.checkout(GitSCM.java:1046)
at hudson.scm.SCM.checkout(SCM.java:485)
at hudson.model.AbstractProject.checkout(AbstractProject.java:1276)
at hudson.model.AbstractBuild$AbstractBuildExecution.defaultCheckout(AbstractBuild.java:607)
at jenkins.scm.SCMCheckoutStrategy.checkout(SCMCheckoutStrategy.java:86)
at hudson.model.AbstractBuild$AbstractBuildExecution.run(AbstractBuild.java:529)
at hudson.model.Run.execute(Run.java:1738)
at hudson.maven.MavenModuleSetBuild.run(MavenModuleSetBuild.java:531)
at hudson.model.ResourceController.execute(ResourceController.java:98)
at hudson.model.Executor.run(Executor.java:410)
Caused by: java.io.IOException: Failed to mkdirs: /home/jenkins/tools/maven/apache-maven-3.0.4
at hudson.FilePath.mkdirs(FilePath.java:1163)
at hudson.FilePath.installIfNecessaryFrom(FilePath.java:798)
... 16 more
Retrying after 10 seconds
java.io.IOException: Failed to install https://repo.maven.apache.org/maven2/org/apache/maven/apache-maven/3.0.4/apache-maven-3.0.4-bin.zip to /home/jenkins/tools/maven/apache-maven-3.0.4
at hudson.FilePath.installIfNecessaryFrom(FilePath.java:832)
at hudson.tools.DownloadFromUrlInstaller.performInstallation(DownloadFromUrlInstaller.java:75)
at hudson.tools.InstallerTranslator.getToolHome(InstallerTranslator.java:68)
at hudson.tools.ToolLocationNodeProperty.getToolHome(ToolLocationNodeProperty.java:108)
at hudson.tools.ToolInstallation.translateFor(ToolInstallation.java:206)
at hudson.tasks.Maven$MavenInstallation.forNode(Maven.java:624)
at hudson.maven.MavenModuleSetBuild.getEnvironment(MavenModuleSetBuild.java:183)
at hudson.plugins.git.GitSCM.checkout(GitSCM.java:1046)
at hudson.scm.SCM.checkout(SCM.java:485)
at hudson.model.AbstractProject.checkout(AbstractProject.java:1276)
at hudson.model.AbstractBuild$AbstractBuildExecution.defaultCheckout(AbstractBuild.java:607)
at jenkins.scm.SCMCheckoutStrategy.checkout(SCMCheckoutStrategy.java:86)
at hudson.model.AbstractBuild$AbstractBuildExecution.run(AbstractBuild.java:529)
at hudson.model.Run.execute(Run.java:1738)
at hudson.maven.MavenModuleSetBuild.run(MavenModuleSetBuild.java:531)
at hudson.model.ResourceController.execute(ResourceController.java:98)
at hudson.model.Executor.run(Executor.java:410)
Caused by: java.io.IOException: Failed to mkdirs: /home/jenkins/tools/maven/apache-maven-3.0.4
at hudson.FilePath.mkdirs(FilePath.java:1163)
at hudson.FilePath.installIfNecessaryFrom(FilePath.java:798)
... 16 more
Archiving artifacts
ERROR: Failed to archive artifacts: apidocs.bz2
java.io.IOException: Failed to install https://repo.maven.apache.org/maven2/org/apache/maven/apache-maven/3.0.4/apache-maven-3.0.4-bin.zip to /home/jenkins/tools/maven/apache-maven-3.0.4
at hudson.FilePath.installIfNecessaryFrom(FilePath.java:832)
at hudson.tools.DownloadFromUrlInstaller.performInstallation(DownloadFromUrlInstaller.java:75)
at hudson.tools.InstallerTranslator.getToolHome(InstallerTranslator.java:68)
at hudson.tools.ToolLocationNodeProperty.getToolHome(ToolLocationNodeProperty.java:108)
at hudson.tools.ToolInstallation.translateFor(ToolInstallation.java:206)
at hudson.tasks.Maven$MavenInstallation.forNode(Maven.java:624)
at hudson.maven.MavenModuleSetBuild.getEnvironment(MavenModuleSetBuild.java:183)
at hudson.tasks.ArtifactArchiver.perform(ArtifactArchiver.java:232)
at hudson.tasks.BuildStepCompatibilityLayer.perform(BuildStepCompatibilityLayer.java:78)
at hudson.tasks.BuildStepMonitor$1.perform(BuildStepMonitor.java:20)
at hudson.model.AbstractBuild$AbstractBuildExecution.perform(AbstractBuild.java:782)
at hudson.model.AbstractBuild$AbstractBuildExecution.performAllBuildSteps(AbstractBuild.java:723)
at hudson.maven.MavenModuleSetBuild$MavenModuleSetBuildExecution.post2(MavenModuleSetBuild.java:1047)
at hudson.model.AbstractBuild$AbstractBuildExecution.post(AbstractBuild.java:668)
at hudson.model.Run.execute(Run.java:1763)
at hudson.maven.MavenModuleSetBuild.run(MavenModuleSetBuild.java:531)
at hudson.model.ResourceController.execute(ResourceController.java:98)
at hudson.model.Executor.run(Executor.java:410)
Caused by: java.io.IOException: Failed to mkdirs: /home/jenkins/tools/maven/apache-maven-3.0.4
at hudson.FilePath.mkdirs(FilePath.java:1163)
at hudson.FilePath.installIfNecessaryFrom(FilePath.java:798)
... 17 more
Build failed in Jenkins: cloudstack-apidocs-master #2861
Posted by Apache Jenkins Server <je...@builds.apache.org>.
See <https://builds.apache.org/job/cloudstack-apidocs-master/2861/>
------------------------------------------
Started by an SCM change
[EnvInject] - Loading node environment variables.
Building remotely on ubuntu-6 (docker Ubuntu ubuntu yahoo-not-h2) in workspace <https://builds.apache.org/job/cloudstack-apidocs-master/ws/>
java.io.IOException: Failed to install https://repo.maven.apache.org/maven2/org/apache/maven/apache-maven/3.0.4/apache-maven-3.0.4-bin.zip to /home/jenkins/tools/maven/apache-maven-3.0.4
at hudson.FilePath.installIfNecessaryFrom(FilePath.java:832)
at hudson.tools.DownloadFromUrlInstaller.performInstallation(DownloadFromUrlInstaller.java:75)
at hudson.tools.InstallerTranslator.getToolHome(InstallerTranslator.java:68)
at hudson.tools.ToolLocationNodeProperty.getToolHome(ToolLocationNodeProperty.java:108)
at hudson.tools.ToolInstallation.translateFor(ToolInstallation.java:206)
at hudson.tasks.Maven$MavenInstallation.forNode(Maven.java:624)
at hudson.maven.MavenModuleSetBuild.getEnvironment(MavenModuleSetBuild.java:183)
at hudson.plugins.git.GitSCM.checkout(GitSCM.java:1046)
at hudson.scm.SCM.checkout(SCM.java:485)
at hudson.model.AbstractProject.checkout(AbstractProject.java:1276)
at hudson.model.AbstractBuild$AbstractBuildExecution.defaultCheckout(AbstractBuild.java:607)
at jenkins.scm.SCMCheckoutStrategy.checkout(SCMCheckoutStrategy.java:86)
at hudson.model.AbstractBuild$AbstractBuildExecution.run(AbstractBuild.java:529)
at hudson.model.Run.execute(Run.java:1738)
at hudson.maven.MavenModuleSetBuild.run(MavenModuleSetBuild.java:531)
at hudson.model.ResourceController.execute(ResourceController.java:98)
at hudson.model.Executor.run(Executor.java:410)
Caused by: java.io.IOException: Failed to mkdirs: /home/jenkins/tools/maven/apache-maven-3.0.4
at hudson.FilePath.mkdirs(FilePath.java:1163)
at hudson.FilePath.installIfNecessaryFrom(FilePath.java:798)
... 16 more
Retrying after 10 seconds
java.io.IOException: Failed to install https://repo.maven.apache.org/maven2/org/apache/maven/apache-maven/3.0.4/apache-maven-3.0.4-bin.zip to /home/jenkins/tools/maven/apache-maven-3.0.4
at hudson.FilePath.installIfNecessaryFrom(FilePath.java:832)
at hudson.tools.DownloadFromUrlInstaller.performInstallation(DownloadFromUrlInstaller.java:75)
at hudson.tools.InstallerTranslator.getToolHome(InstallerTranslator.java:68)
at hudson.tools.ToolLocationNodeProperty.getToolHome(ToolLocationNodeProperty.java:108)
at hudson.tools.ToolInstallation.translateFor(ToolInstallation.java:206)
at hudson.tasks.Maven$MavenInstallation.forNode(Maven.java:624)
at hudson.maven.MavenModuleSetBuild.getEnvironment(MavenModuleSetBuild.java:183)
at hudson.plugins.git.GitSCM.checkout(GitSCM.java:1046)
at hudson.scm.SCM.checkout(SCM.java:485)
at hudson.model.AbstractProject.checkout(AbstractProject.java:1276)
at hudson.model.AbstractBuild$AbstractBuildExecution.defaultCheckout(AbstractBuild.java:607)
at jenkins.scm.SCMCheckoutStrategy.checkout(SCMCheckoutStrategy.java:86)
at hudson.model.AbstractBuild$AbstractBuildExecution.run(AbstractBuild.java:529)
at hudson.model.Run.execute(Run.java:1738)
at hudson.maven.MavenModuleSetBuild.run(MavenModuleSetBuild.java:531)
at hudson.model.ResourceController.execute(ResourceController.java:98)
at hudson.model.Executor.run(Executor.java:410)
Caused by: java.io.IOException: Failed to mkdirs: /home/jenkins/tools/maven/apache-maven-3.0.4
at hudson.FilePath.mkdirs(FilePath.java:1163)
at hudson.FilePath.installIfNecessaryFrom(FilePath.java:798)
... 16 more
Retrying after 10 seconds
java.io.IOException: Failed to install https://repo.maven.apache.org/maven2/org/apache/maven/apache-maven/3.0.4/apache-maven-3.0.4-bin.zip to /home/jenkins/tools/maven/apache-maven-3.0.4
at hudson.FilePath.installIfNecessaryFrom(FilePath.java:832)
at hudson.tools.DownloadFromUrlInstaller.performInstallation(DownloadFromUrlInstaller.java:75)
at hudson.tools.InstallerTranslator.getToolHome(InstallerTranslator.java:68)
at hudson.tools.ToolLocationNodeProperty.getToolHome(ToolLocationNodeProperty.java:108)
at hudson.tools.ToolInstallation.translateFor(ToolInstallation.java:206)
at hudson.tasks.Maven$MavenInstallation.forNode(Maven.java:624)
at hudson.maven.MavenModuleSetBuild.getEnvironment(MavenModuleSetBuild.java:183)
at hudson.plugins.git.GitSCM.checkout(GitSCM.java:1046)
at hudson.scm.SCM.checkout(SCM.java:485)
at hudson.model.AbstractProject.checkout(AbstractProject.java:1276)
at hudson.model.AbstractBuild$AbstractBuildExecution.defaultCheckout(AbstractBuild.java:607)
at jenkins.scm.SCMCheckoutStrategy.checkout(SCMCheckoutStrategy.java:86)
at hudson.model.AbstractBuild$AbstractBuildExecution.run(AbstractBuild.java:529)
at hudson.model.Run.execute(Run.java:1738)
at hudson.maven.MavenModuleSetBuild.run(MavenModuleSetBuild.java:531)
at hudson.model.ResourceController.execute(ResourceController.java:98)
at hudson.model.Executor.run(Executor.java:410)
Caused by: java.io.IOException: Failed to mkdirs: /home/jenkins/tools/maven/apache-maven-3.0.4
at hudson.FilePath.mkdirs(FilePath.java:1163)
at hudson.FilePath.installIfNecessaryFrom(FilePath.java:798)
... 16 more
Archiving artifacts
ERROR: Failed to archive artifacts: apidocs.bz2
java.io.IOException: Failed to install https://repo.maven.apache.org/maven2/org/apache/maven/apache-maven/3.0.4/apache-maven-3.0.4-bin.zip to /home/jenkins/tools/maven/apache-maven-3.0.4
at hudson.FilePath.installIfNecessaryFrom(FilePath.java:832)
at hudson.tools.DownloadFromUrlInstaller.performInstallation(DownloadFromUrlInstaller.java:75)
at hudson.tools.InstallerTranslator.getToolHome(InstallerTranslator.java:68)
at hudson.tools.ToolLocationNodeProperty.getToolHome(ToolLocationNodeProperty.java:108)
at hudson.tools.ToolInstallation.translateFor(ToolInstallation.java:206)
at hudson.tasks.Maven$MavenInstallation.forNode(Maven.java:624)
at hudson.maven.MavenModuleSetBuild.getEnvironment(MavenModuleSetBuild.java:183)
at hudson.tasks.ArtifactArchiver.perform(ArtifactArchiver.java:232)
at hudson.tasks.BuildStepCompatibilityLayer.perform(BuildStepCompatibilityLayer.java:78)
at hudson.tasks.BuildStepMonitor$1.perform(BuildStepMonitor.java:20)
at hudson.model.AbstractBuild$AbstractBuildExecution.perform(AbstractBuild.java:782)
at hudson.model.AbstractBuild$AbstractBuildExecution.performAllBuildSteps(AbstractBuild.java:723)
at hudson.maven.MavenModuleSetBuild$MavenModuleSetBuildExecution.post2(MavenModuleSetBuild.java:1047)
at hudson.model.AbstractBuild$AbstractBuildExecution.post(AbstractBuild.java:668)
at hudson.model.Run.execute(Run.java:1763)
at hudson.maven.MavenModuleSetBuild.run(MavenModuleSetBuild.java:531)
at hudson.model.ResourceController.execute(ResourceController.java:98)
at hudson.model.Executor.run(Executor.java:410)
Caused by: java.io.IOException: Failed to mkdirs: /home/jenkins/tools/maven/apache-maven-3.0.4
at hudson.FilePath.mkdirs(FilePath.java:1163)
at hudson.FilePath.installIfNecessaryFrom(FilePath.java:798)
... 17 more
Build failed in Jenkins: cloudstack-apidocs-master #2860
Posted by Apache Jenkins Server <je...@builds.apache.org>.
See <https://builds.apache.org/job/cloudstack-apidocs-master/2860/>
------------------------------------------
Started by an SCM change
[EnvInject] - Loading node environment variables.
Building remotely on ubuntu-6 (docker Ubuntu ubuntu yahoo-not-h2) in workspace <https://builds.apache.org/job/cloudstack-apidocs-master/ws/>
java.io.IOException: Failed to install https://repo.maven.apache.org/maven2/org/apache/maven/apache-maven/3.0.4/apache-maven-3.0.4-bin.zip to /home/jenkins/tools/maven/apache-maven-3.0.4
at hudson.FilePath.installIfNecessaryFrom(FilePath.java:832)
at hudson.tools.DownloadFromUrlInstaller.performInstallation(DownloadFromUrlInstaller.java:75)
at hudson.tools.InstallerTranslator.getToolHome(InstallerTranslator.java:68)
at hudson.tools.ToolLocationNodeProperty.getToolHome(ToolLocationNodeProperty.java:108)
at hudson.tools.ToolInstallation.translateFor(ToolInstallation.java:206)
at hudson.tasks.Maven$MavenInstallation.forNode(Maven.java:624)
at hudson.maven.MavenModuleSetBuild.getEnvironment(MavenModuleSetBuild.java:183)
at hudson.plugins.git.GitSCM.checkout(GitSCM.java:1046)
at hudson.scm.SCM.checkout(SCM.java:485)
at hudson.model.AbstractProject.checkout(AbstractProject.java:1276)
at hudson.model.AbstractBuild$AbstractBuildExecution.defaultCheckout(AbstractBuild.java:607)
at jenkins.scm.SCMCheckoutStrategy.checkout(SCMCheckoutStrategy.java:86)
at hudson.model.AbstractBuild$AbstractBuildExecution.run(AbstractBuild.java:529)
at hudson.model.Run.execute(Run.java:1738)
at hudson.maven.MavenModuleSetBuild.run(MavenModuleSetBuild.java:531)
at hudson.model.ResourceController.execute(ResourceController.java:98)
at hudson.model.Executor.run(Executor.java:410)
Caused by: java.io.IOException: Failed to mkdirs: /home/jenkins/tools/maven/apache-maven-3.0.4
at hudson.FilePath.mkdirs(FilePath.java:1163)
at hudson.FilePath.installIfNecessaryFrom(FilePath.java:798)
... 16 more
Retrying after 10 seconds
java.io.IOException: Failed to install https://repo.maven.apache.org/maven2/org/apache/maven/apache-maven/3.0.4/apache-maven-3.0.4-bin.zip to /home/jenkins/tools/maven/apache-maven-3.0.4
at hudson.FilePath.installIfNecessaryFrom(FilePath.java:832)
at hudson.tools.DownloadFromUrlInstaller.performInstallation(DownloadFromUrlInstaller.java:75)
at hudson.tools.InstallerTranslator.getToolHome(InstallerTranslator.java:68)
at hudson.tools.ToolLocationNodeProperty.getToolHome(ToolLocationNodeProperty.java:108)
at hudson.tools.ToolInstallation.translateFor(ToolInstallation.java:206)
at hudson.tasks.Maven$MavenInstallation.forNode(Maven.java:624)
at hudson.maven.MavenModuleSetBuild.getEnvironment(MavenModuleSetBuild.java:183)
at hudson.plugins.git.GitSCM.checkout(GitSCM.java:1046)
at hudson.scm.SCM.checkout(SCM.java:485)
at hudson.model.AbstractProject.checkout(AbstractProject.java:1276)
at hudson.model.AbstractBuild$AbstractBuildExecution.defaultCheckout(AbstractBuild.java:607)
at jenkins.scm.SCMCheckoutStrategy.checkout(SCMCheckoutStrategy.java:86)
at hudson.model.AbstractBuild$AbstractBuildExecution.run(AbstractBuild.java:529)
at hudson.model.Run.execute(Run.java:1738)
at hudson.maven.MavenModuleSetBuild.run(MavenModuleSetBuild.java:531)
at hudson.model.ResourceController.execute(ResourceController.java:98)
at hudson.model.Executor.run(Executor.java:410)
Caused by: java.io.IOException: Failed to mkdirs: /home/jenkins/tools/maven/apache-maven-3.0.4
at hudson.FilePath.mkdirs(FilePath.java:1163)
at hudson.FilePath.installIfNecessaryFrom(FilePath.java:798)
... 16 more
Retrying after 10 seconds
java.io.IOException: Failed to install https://repo.maven.apache.org/maven2/org/apache/maven/apache-maven/3.0.4/apache-maven-3.0.4-bin.zip to /home/jenkins/tools/maven/apache-maven-3.0.4
at hudson.FilePath.installIfNecessaryFrom(FilePath.java:832)
at hudson.tools.DownloadFromUrlInstaller.performInstallation(DownloadFromUrlInstaller.java:75)
at hudson.tools.InstallerTranslator.getToolHome(InstallerTranslator.java:68)
at hudson.tools.ToolLocationNodeProperty.getToolHome(ToolLocationNodeProperty.java:108)
at hudson.tools.ToolInstallation.translateFor(ToolInstallation.java:206)
at hudson.tasks.Maven$MavenInstallation.forNode(Maven.java:624)
at hudson.maven.MavenModuleSetBuild.getEnvironment(MavenModuleSetBuild.java:183)
at hudson.plugins.git.GitSCM.checkout(GitSCM.java:1046)
at hudson.scm.SCM.checkout(SCM.java:485)
at hudson.model.AbstractProject.checkout(AbstractProject.java:1276)
at hudson.model.AbstractBuild$AbstractBuildExecution.defaultCheckout(AbstractBuild.java:607)
at jenkins.scm.SCMCheckoutStrategy.checkout(SCMCheckoutStrategy.java:86)
at hudson.model.AbstractBuild$AbstractBuildExecution.run(AbstractBuild.java:529)
at hudson.model.Run.execute(Run.java:1738)
at hudson.maven.MavenModuleSetBuild.run(MavenModuleSetBuild.java:531)
at hudson.model.ResourceController.execute(ResourceController.java:98)
at hudson.model.Executor.run(Executor.java:410)
Caused by: java.io.IOException: Failed to mkdirs: /home/jenkins/tools/maven/apache-maven-3.0.4
at hudson.FilePath.mkdirs(FilePath.java:1163)
at hudson.FilePath.installIfNecessaryFrom(FilePath.java:798)
... 16 more
Archiving artifacts
ERROR: Failed to archive artifacts: apidocs.bz2
java.io.IOException: Failed to install https://repo.maven.apache.org/maven2/org/apache/maven/apache-maven/3.0.4/apache-maven-3.0.4-bin.zip to /home/jenkins/tools/maven/apache-maven-3.0.4
at hudson.FilePath.installIfNecessaryFrom(FilePath.java:832)
at hudson.tools.DownloadFromUrlInstaller.performInstallation(DownloadFromUrlInstaller.java:75)
at hudson.tools.InstallerTranslator.getToolHome(InstallerTranslator.java:68)
at hudson.tools.ToolLocationNodeProperty.getToolHome(ToolLocationNodeProperty.java:108)
at hudson.tools.ToolInstallation.translateFor(ToolInstallation.java:206)
at hudson.tasks.Maven$MavenInstallation.forNode(Maven.java:624)
at hudson.maven.MavenModuleSetBuild.getEnvironment(MavenModuleSetBuild.java:183)
at hudson.tasks.ArtifactArchiver.perform(ArtifactArchiver.java:232)
at hudson.tasks.BuildStepCompatibilityLayer.perform(BuildStepCompatibilityLayer.java:78)
at hudson.tasks.BuildStepMonitor$1.perform(BuildStepMonitor.java:20)
at hudson.model.AbstractBuild$AbstractBuildExecution.perform(AbstractBuild.java:782)
at hudson.model.AbstractBuild$AbstractBuildExecution.performAllBuildSteps(AbstractBuild.java:723)
at hudson.maven.MavenModuleSetBuild$MavenModuleSetBuildExecution.post2(MavenModuleSetBuild.java:1047)
at hudson.model.AbstractBuild$AbstractBuildExecution.post(AbstractBuild.java:668)
at hudson.model.Run.execute(Run.java:1763)
at hudson.maven.MavenModuleSetBuild.run(MavenModuleSetBuild.java:531)
at hudson.model.ResourceController.execute(ResourceController.java:98)
at hudson.model.Executor.run(Executor.java:410)
Caused by: java.io.IOException: Failed to mkdirs: /home/jenkins/tools/maven/apache-maven-3.0.4
at hudson.FilePath.mkdirs(FilePath.java:1163)
at hudson.FilePath.installIfNecessaryFrom(FilePath.java:798)
... 17 more
Build failed in Jenkins: cloudstack-apidocs-master #2859
Posted by Apache Jenkins Server <je...@builds.apache.org>.
See <https://builds.apache.org/job/cloudstack-apidocs-master/2859/>
------------------------------------------
Started by an SCM change
[EnvInject] - Loading node environment variables.
Building remotely on ubuntu-6 (docker Ubuntu ubuntu yahoo-not-h2) in workspace <https://builds.apache.org/job/cloudstack-apidocs-master/ws/>
java.io.IOException: Failed to install https://repo.maven.apache.org/maven2/org/apache/maven/apache-maven/3.0.4/apache-maven-3.0.4-bin.zip to /home/jenkins/tools/maven/apache-maven-3.0.4
at hudson.FilePath.installIfNecessaryFrom(FilePath.java:832)
at hudson.tools.DownloadFromUrlInstaller.performInstallation(DownloadFromUrlInstaller.java:75)
at hudson.tools.InstallerTranslator.getToolHome(InstallerTranslator.java:68)
at hudson.tools.ToolLocationNodeProperty.getToolHome(ToolLocationNodeProperty.java:108)
at hudson.tools.ToolInstallation.translateFor(ToolInstallation.java:206)
at hudson.tasks.Maven$MavenInstallation.forNode(Maven.java:624)
at hudson.maven.MavenModuleSetBuild.getEnvironment(MavenModuleSetBuild.java:183)
at hudson.plugins.git.GitSCM.checkout(GitSCM.java:1046)
at hudson.scm.SCM.checkout(SCM.java:485)
at hudson.model.AbstractProject.checkout(AbstractProject.java:1276)
at hudson.model.AbstractBuild$AbstractBuildExecution.defaultCheckout(AbstractBuild.java:607)
at jenkins.scm.SCMCheckoutStrategy.checkout(SCMCheckoutStrategy.java:86)
at hudson.model.AbstractBuild$AbstractBuildExecution.run(AbstractBuild.java:529)
at hudson.model.Run.execute(Run.java:1738)
at hudson.maven.MavenModuleSetBuild.run(MavenModuleSetBuild.java:531)
at hudson.model.ResourceController.execute(ResourceController.java:98)
at hudson.model.Executor.run(Executor.java:410)
Caused by: java.io.IOException: Failed to mkdirs: /home/jenkins/tools/maven/apache-maven-3.0.4
at hudson.FilePath.mkdirs(FilePath.java:1163)
at hudson.FilePath.installIfNecessaryFrom(FilePath.java:798)
... 16 more
Retrying after 10 seconds
java.io.IOException: Failed to install https://repo.maven.apache.org/maven2/org/apache/maven/apache-maven/3.0.4/apache-maven-3.0.4-bin.zip to /home/jenkins/tools/maven/apache-maven-3.0.4
at hudson.FilePath.installIfNecessaryFrom(FilePath.java:832)
at hudson.tools.DownloadFromUrlInstaller.performInstallation(DownloadFromUrlInstaller.java:75)
at hudson.tools.InstallerTranslator.getToolHome(InstallerTranslator.java:68)
at hudson.tools.ToolLocationNodeProperty.getToolHome(ToolLocationNodeProperty.java:108)
at hudson.tools.ToolInstallation.translateFor(ToolInstallation.java:206)
at hudson.tasks.Maven$MavenInstallation.forNode(Maven.java:624)
at hudson.maven.MavenModuleSetBuild.getEnvironment(MavenModuleSetBuild.java:183)
at hudson.plugins.git.GitSCM.checkout(GitSCM.java:1046)
at hudson.scm.SCM.checkout(SCM.java:485)
at hudson.model.AbstractProject.checkout(AbstractProject.java:1276)
at hudson.model.AbstractBuild$AbstractBuildExecution.defaultCheckout(AbstractBuild.java:607)
at jenkins.scm.SCMCheckoutStrategy.checkout(SCMCheckoutStrategy.java:86)
at hudson.model.AbstractBuild$AbstractBuildExecution.run(AbstractBuild.java:529)
at hudson.model.Run.execute(Run.java:1738)
at hudson.maven.MavenModuleSetBuild.run(MavenModuleSetBuild.java:531)
at hudson.model.ResourceController.execute(ResourceController.java:98)
at hudson.model.Executor.run(Executor.java:410)
Caused by: java.io.IOException: Failed to mkdirs: /home/jenkins/tools/maven/apache-maven-3.0.4
at hudson.FilePath.mkdirs(FilePath.java:1163)
at hudson.FilePath.installIfNecessaryFrom(FilePath.java:798)
... 16 more
Retrying after 10 seconds
java.io.IOException: Failed to install https://repo.maven.apache.org/maven2/org/apache/maven/apache-maven/3.0.4/apache-maven-3.0.4-bin.zip to /home/jenkins/tools/maven/apache-maven-3.0.4
at hudson.FilePath.installIfNecessaryFrom(FilePath.java:832)
at hudson.tools.DownloadFromUrlInstaller.performInstallation(DownloadFromUrlInstaller.java:75)
at hudson.tools.InstallerTranslator.getToolHome(InstallerTranslator.java:68)
at hudson.tools.ToolLocationNodeProperty.getToolHome(ToolLocationNodeProperty.java:108)
at hudson.tools.ToolInstallation.translateFor(ToolInstallation.java:206)
at hudson.tasks.Maven$MavenInstallation.forNode(Maven.java:624)
at hudson.maven.MavenModuleSetBuild.getEnvironment(MavenModuleSetBuild.java:183)
at hudson.plugins.git.GitSCM.checkout(GitSCM.java:1046)
at hudson.scm.SCM.checkout(SCM.java:485)
at hudson.model.AbstractProject.checkout(AbstractProject.java:1276)
at hudson.model.AbstractBuild$AbstractBuildExecution.defaultCheckout(AbstractBuild.java:607)
at jenkins.scm.SCMCheckoutStrategy.checkout(SCMCheckoutStrategy.java:86)
at hudson.model.AbstractBuild$AbstractBuildExecution.run(AbstractBuild.java:529)
at hudson.model.Run.execute(Run.java:1738)
at hudson.maven.MavenModuleSetBuild.run(MavenModuleSetBuild.java:531)
at hudson.model.ResourceController.execute(ResourceController.java:98)
at hudson.model.Executor.run(Executor.java:410)
Caused by: java.io.IOException: Failed to mkdirs: /home/jenkins/tools/maven/apache-maven-3.0.4
at hudson.FilePath.mkdirs(FilePath.java:1163)
at hudson.FilePath.installIfNecessaryFrom(FilePath.java:798)
... 16 more
Archiving artifacts
ERROR: Failed to archive artifacts: apidocs.bz2
java.io.IOException: Failed to install https://repo.maven.apache.org/maven2/org/apache/maven/apache-maven/3.0.4/apache-maven-3.0.4-bin.zip to /home/jenkins/tools/maven/apache-maven-3.0.4
at hudson.FilePath.installIfNecessaryFrom(FilePath.java:832)
at hudson.tools.DownloadFromUrlInstaller.performInstallation(DownloadFromUrlInstaller.java:75)
at hudson.tools.InstallerTranslator.getToolHome(InstallerTranslator.java:68)
at hudson.tools.ToolLocationNodeProperty.getToolHome(ToolLocationNodeProperty.java:108)
at hudson.tools.ToolInstallation.translateFor(ToolInstallation.java:206)
at hudson.tasks.Maven$MavenInstallation.forNode(Maven.java:624)
at hudson.maven.MavenModuleSetBuild.getEnvironment(MavenModuleSetBuild.java:183)
at hudson.tasks.ArtifactArchiver.perform(ArtifactArchiver.java:232)
at hudson.tasks.BuildStepCompatibilityLayer.perform(BuildStepCompatibilityLayer.java:78)
at hudson.tasks.BuildStepMonitor$1.perform(BuildStepMonitor.java:20)
at hudson.model.AbstractBuild$AbstractBuildExecution.perform(AbstractBuild.java:782)
at hudson.model.AbstractBuild$AbstractBuildExecution.performAllBuildSteps(AbstractBuild.java:723)
at hudson.maven.MavenModuleSetBuild$MavenModuleSetBuildExecution.post2(MavenModuleSetBuild.java:1047)
at hudson.model.AbstractBuild$AbstractBuildExecution.post(AbstractBuild.java:668)
at hudson.model.Run.execute(Run.java:1763)
at hudson.maven.MavenModuleSetBuild.run(MavenModuleSetBuild.java:531)
at hudson.model.ResourceController.execute(ResourceController.java:98)
at hudson.model.Executor.run(Executor.java:410)
Caused by: java.io.IOException: Failed to mkdirs: /home/jenkins/tools/maven/apache-maven-3.0.4
at hudson.FilePath.mkdirs(FilePath.java:1163)
at hudson.FilePath.installIfNecessaryFrom(FilePath.java:798)
... 17 more