You are viewing a plain text version of this content. The canonical link for it is here.
Posted to dev@zookeeper.apache.org by Apache Jenkins Server <je...@builds.apache.org> on 2019/08/15 23:32:07 UTC
ZooKeeper_branch34_jdk8 - Build # 1895 - Still Failing
See https://builds.apache.org/job/ZooKeeper_branch34_jdk8/1895/
###################################################################################
########################## LAST 60 LINES OF THE CONSOLE ###########################
[...truncated 43.43 KB...]
[junit] Running org.apache.zookeeper.test.RestoreCommittedLogTest
[junit] Tests run: 1, Failures: 0, Errors: 0, Skipped: 0, Time elapsed: 21.473 sec
[junit] Running org.apache.zookeeper.test.SaslAuthDesignatedClientTest
[junit] Tests run: 2, Failures: 0, Errors: 0, Skipped: 0, Time elapsed: 2.197 sec
[junit] Running org.apache.zookeeper.test.SaslAuthDesignatedServerTest
[junit] Tests run: 1, Failures: 0, Errors: 0, Skipped: 0, Time elapsed: 0.986 sec
[junit] Running org.apache.zookeeper.test.SaslAuthFailDesignatedClientTest
[junit] Tests run: 1, Failures: 0, Errors: 0, Skipped: 0, Time elapsed: 1.335 sec
[junit] Running org.apache.zookeeper.test.SaslAuthFailNotifyTest
[junit] Tests run: 1, Failures: 0, Errors: 0, Skipped: 0, Time elapsed: 0.829 sec
[junit] Running org.apache.zookeeper.test.SaslAuthFailTest
[junit] Tests run: 1, Failures: 0, Errors: 0, Skipped: 0, Time elapsed: 0.984 sec
[junit] Running org.apache.zookeeper.test.SaslAuthMissingClientConfigTest
[junit] Tests run: 1, Failures: 0, Errors: 0, Skipped: 0, Time elapsed: 1.03 sec
[junit] Running org.apache.zookeeper.test.SaslClientTest
[junit] Tests run: 1, Failures: 0, Errors: 0, Skipped: 0, Time elapsed: 0.205 sec
[junit] Running org.apache.zookeeper.test.SessionInvalidationTest
[junit] Tests run: 1, Failures: 0, Errors: 0, Skipped: 0, Time elapsed: 1.685 sec
[junit] Running org.apache.zookeeper.test.SessionTest
[junit] Tests run: 5, Failures: 0, Errors: 0, Skipped: 0, Time elapsed: 11.48 sec
[junit] Running org.apache.zookeeper.test.SessionTimeoutTest
[junit] Tests run: 4, Failures: 0, Errors: 0, Skipped: 0, Time elapsed: 1.246 sec
[junit] Running org.apache.zookeeper.test.StandaloneTest
[junit] Tests run: 1, Failures: 0, Errors: 0, Skipped: 0, Time elapsed: 1.141 sec
[junit] Running org.apache.zookeeper.test.StatTest
[junit] Tests run: 4, Failures: 0, Errors: 0, Skipped: 0, Time elapsed: 1.273 sec
[junit] Running org.apache.zookeeper.test.StaticHostProviderTest
[junit] Tests run: 13, Failures: 0, Errors: 0, Skipped: 0, Time elapsed: 2.044 sec
[junit] Running org.apache.zookeeper.test.SyncCallTest
[junit] Tests run: 1, Failures: 0, Errors: 0, Skipped: 0, Time elapsed: 0.822 sec
[junit] Running org.apache.zookeeper.test.TruncateTest
[junit] Tests run: 3, Failures: 0, Errors: 0, Skipped: 0, Time elapsed: 10.676 sec
[junit] Running org.apache.zookeeper.test.UpgradeTest
[junit] Tests run: 1, Failures: 0, Errors: 0, Skipped: 0, Time elapsed: 1.108 sec
[junit] Running org.apache.zookeeper.test.WatchedEventTest
[junit] Tests run: 4, Failures: 0, Errors: 0, Skipped: 0, Time elapsed: 0.122 sec
[junit] Running org.apache.zookeeper.test.WatcherFuncTest
[junit] Tests run: 6, Failures: 0, Errors: 0, Skipped: 0, Time elapsed: 2.427 sec
[junit] Running org.apache.zookeeper.test.WatcherTest
[junit] Tests run: 7, Failures: 0, Errors: 0, Skipped: 0, Time elapsed: 32.391 sec
[junit] Running org.apache.zookeeper.test.ZkDatabaseCorruptionTest
[junit] Tests run: 1, Failures: 0, Errors: 0, Skipped: 0, Time elapsed: 13.23 sec
[junit] Running org.apache.zookeeper.test.ZooKeeperQuotaTest
[junit] Tests run: 1, Failures: 0, Errors: 0, Skipped: 0, Time elapsed: 1.097 sec
[junit] Running org.apache.jute.BinaryInputArchiveTest
[junit] Tests run: 1, Failures: 0, Errors: 0, Skipped: 0, Time elapsed: 0.138 sec
fail.build.on.test.failure:
BUILD FAILED
/home/jenkins/jenkins-slave/workspace/ZooKeeper_branch34_jdk8/build.xml:1425: The following error occurred while executing this line:
/home/jenkins/jenkins-slave/workspace/ZooKeeper_branch34_jdk8/build.xml:1428: Tests failed!
Total time: 53 minutes 47 seconds
Build step 'Invoke Ant' marked build as failure
Archiving artifacts
Recording test results
Email was triggered for: Failure - Any
Sending email for trigger: Failure - Any
###################################################################################
############################## FAILED TESTS (if any) ##############################
2 tests failed.
FAILED: org.apache.zookeeper.server.PurgeTxnTest.testFindNRecentSnapshots
Error Message:
Forked Java VM exited abnormally. Please note the time in the report does not reflect the time until the VM exit.
Stack Trace:
junit.framework.AssertionFailedError: Forked Java VM exited abnormally. Please note the time in the report does not reflect the time until the VM exit.
FAILED: org.apache.zookeeper.server.quorum.Zab1_0Test.testTxnTimeout
Error Message:
null
Stack Trace:
java.io.EOFException
at java.io.DataInputStream.readInt(DataInputStream.java:392)
at org.apache.jute.BinaryInputArchive.readInt(BinaryInputArchive.java:63)
at org.apache.zookeeper.server.quorum.QuorumPacket.deserialize(QuorumPacket.java:85)
at org.apache.jute.BinaryInputArchive.readRecord(BinaryInputArchive.java:99)
at org.apache.zookeeper.server.quorum.Zab1_0Test.readPacketSkippingPing(Zab1_0Test.java:266)
at org.apache.zookeeper.server.quorum.Zab1_0Test$7.converseWithLeader(Zab1_0Test.java:916)
at org.apache.zookeeper.server.quorum.Zab1_0Test.testLeaderConversation(Zab1_0Test.java:320)
at org.apache.zookeeper.server.quorum.Zab1_0Test.testTxnTimeout(Zab1_0Test.java:879)