You are viewing a plain text version of this content. The canonical link for it is here.
Posted to builds@cassandra.apache.org by Apache Jenkins Server <je...@builds.apache.org> on 2022/05/28 17:06:15 UTC

Build complete: Cassandra-3.11 #364 [UNSTABLE] bb0e63fc389f59b98713b762ecd49e9021b1c66f

-------------------------------------------------------------------------------
Build Cassandra-3.11 #364 Still Unstable
URL: https://ci-cassandra.apache.org/job/Cassandra-3.11/364/
-------------------------------------------------------------------------------
Changes:
[Michael Semb Wever] In jenkins retry each stage build in the pipeline


-------------------------------------------------------------------------------
Failed Tests:
38 tests failed.
FAILED:  dtest-upgrade.upgrade_tests.upgrade_through_versions_test.TestUpgrade_current_2_1_x_To_indev_3_11_x.test_rolling_upgrade_with_internode_ssl
FAILED:  dtest.hintedhandoff_test.TestHintedHandoffConfig.test_hintedhandoff_dc_disabled
FAILED:  org.apache.cassandra.db.compaction.LongLeveledCompactionStrategyCQLTest.stressTestCompactionStrategyManager
FAILED:  org.apache.cassandra.cql3.ViewComplexTest.testMVWithDifferentColumnsWithoutFlush
FAILED:  org.apache.cassandra.cql3.ViewComplexTest.testCommutativeRowDeletionFlush
FAILED:  org.apache.cassandra.cql3.ViewFilteringTest.testCaseSensitivity
FAILED:  org.apache.cassandra.cql3.ViewFilteringTest.testPartitionKeyAndClusteringKeyFilteringRestrictions
FAILED:  org.apache.cassandra.cql3.ViewTest.testIgnoreUpdate
FAILED:  org.apache.cassandra.cql3.validation.entities.SecondaryIndexTest.testEmptyRestrictionValueWithSecondaryIndexAndCompactTables
FAILED:  org.apache.cassandra.distributed.upgrade.CompactStorage2to3UpgradeTest.testDropCompactWithClusteringAndValueColumn
FAILED:  dtest-offheap.materialized_views_test.TestMaterializedViews.test_complex_mv_select_statements
FAILED:  dtest-offheap.secondary_indexes_test.TestSecondaryIndexes.test_6924_dropping_cf
FAILED:  dtest-novnode.materialized_views_test.TestMaterializedViewsConsistency.test_multi_partition_consistent_reads_after_write
FAILED:  dtest-novnode.paxos_test.TestPaxos.test_contention_many_threads
FAILED:  dtest-novnode.repair_tests.repair_test.TestRepair.test_dead_sync_initiator
FAILED:  dtest-novnode.repair_tests.repair_test.TestRepair.test_failure_during_validation
FAILED:  dtest-novnode.repair_tests.deprecated_repair_test.TestDeprecatedRepairAPI.test_force_repair_range_async_1
FAILED:  dtest-novnode.repair_tests.deprecated_repair_test.TestDeprecatedRepairAPI.test_force_repair_range_async_3
FAILED:  dtest-offheap.repair_tests.deprecated_repair_test.TestDeprecatedRepairAPI.test_force_repair_range_async_1
FAILED:  dtest-offheap.paxos_test.TestPaxos.test_contention_many_threads
FAILED:  dtest-offheap.repair_tests.repair_test.TestRepair.test_dead_sync_initiator
FAILED:  dtest-offheap.repair_tests.deprecated_repair_test.TestDeprecatedRepairAPI.test_force_repair_range_async_3
FAILED:  dtest-offheap.repair_tests.repair_test.TestRepair.test_failure_during_validation
FAILED:  dtest-offheap.materialized_views_test.TestMaterializedViewsConsistency.test_multi_partition_consistent_reads_after_write
FAILED:  dtest.materialized_views_test.TestMaterializedViewsConsistency.test_multi_partition_consistent_reads_after_write
FAILED:  dtest.paxos_test.TestPaxos.test_contention_many_threads
FAILED:  dtest.repair_tests.deprecated_repair_test.TestDeprecatedRepairAPI.test_force_repair_range_async_1
FAILED:  dtest.repair_tests.repair_test.TestRepair.test_dead_sync_initiator
FAILED:  dtest.repair_tests.repair_test.TestRepair.test_failure_during_validation
FAILED:  dtest.repair_tests.deprecated_repair_test.TestDeprecatedRepairAPI.test_force_repair_range_async_3
FAILED:  org.apache.cassandra.distributed.upgrade.CompactStorage2to3UpgradeTest.singleColumn
FAILED:  org.apache.cassandra.distributed.upgrade.CompactStorage2to3UpgradeTest.singleColumn
FAILED:  dtest-upgrade.upgrade_internal_auth_test.TestAuthUpgrade.test_upgrade_legacy_table
FAILED:  org.apache.cassandra.distributed.upgrade.CompactStorage2to3UpgradeTest.testDropCompactWithClusteringAndValueColumnWithDeletesAndWrites
FAILED:  org.apache.cassandra.distributed.upgrade.CompactStorage2to3UpgradeTest.testDropCompactWithClusteringAndValueColumnWithDeletesAndWrites
FAILED:  org.apache.cassandra.distributed.upgrade.CompactStorage2to3UpgradeTest.testDropCompactWithClusteringAndValueColumnWithDeletesAndWrites
FAILED:  org.apache.cassandra.distributed.upgrade.CompactStorage2to3UpgradeTest.testDropCompactWithClusteringAndValueColumnWithDeletesAndWrites
FAILED:  org.apache.cassandra.utils.memory.LongBufferPoolTest.testAllocate

-------------------------------------------------------------------------------
For complete test report and logs see https://nightlies.apache.org/cassandra/Cassandra-3.11/364/