You are viewing a plain text version of this content. The canonical link for it is here.
Posted to notifications@jakarta.apache.org by Apache Hudson Server <hu...@hudson.apache.org> on 2011/04/07 02:08:34 UTC

Build failed in Jenkins: Cactus #791

See <https://hudson.apache.org/hudson/job/Cactus/791/>

------------------------------------------
[...truncated 795 lines...]
[INFO]    task-segment: [clean, install]
[INFO] ------------------------------------------------------------------------
[INFO] [clean:clean]
[INFO] Deleting directory <https://hudson.apache.org/hudson/job/Cactus/ws/Cactus/integration/ant/target>
[INFO] [remote-resources:process {execution: default}]
[INFO] [resources:resources]
[WARNING] Using platform encoding (ANSI_X3.4-1968 actually) to copy filtered resources, i.e. build is platform dependent!
[INFO] Copying 1 resource
[INFO] Copying 3 resources
[INFO] [compiler:compile]
[INFO] Compiling 12 source files to <https://hudson.apache.org/hudson/job/Cactus/ws/Cactus/integration/ant/target/classes>
[INFO] [resources:testResources]
[WARNING] Using platform encoding (ANSI_X3.4-1968 actually) to copy filtered resources, i.e. build is platform dependent!
[INFO] skip non existing resourceDirectory <https://hudson.apache.org/hudson/job/Cactus/ws/Cactus/integration/ant/src/test/resources>
[INFO] Copying 3 resources
[INFO] [compiler:testCompile]
[INFO] Compiling 16 source files to <https://hudson.apache.org/hudson/job/Cactus/ws/Cactus/integration/ant/target/test-classes>
[INFO] [surefire:test]
[INFO] Surefire report directory: <https://hudson.apache.org/hudson/job/Cactus/ws/Cactus/integration/ant/target/surefire-reports>

-------------------------------------------------------
 T E S T S
-------------------------------------------------------
Running org.apache.cactus.integration.ant.deployment.TestJarArchive
Tests run: 5, Failures: 0, Errors: 0, Skipped: 0, Time elapsed: 0.087 sec
Running org.apache.cactus.integration.ant.TestCactusTask
Tests run: 7, Failures: 0, Errors: 0, Skipped: 0, Time elapsed: 0.442 sec
Running org.apache.cactus.integration.ant.deployment.TestAll
Tests run: 0, Failures: 0, Errors: 0, Skipped: 0, Time elapsed: 0.003 sec
Running org.apache.cactus.integration.ant.TestCactusTestTask
Tests run: 7, Failures: 0, Errors: 0, Skipped: 0, Time elapsed: 0.095 sec
Running org.apache.cactus.integration.ant.deployment.application.TestApplicationXmlVersion
Tests run: 8, Failures: 0, Errors: 0, Skipped: 0, Time elapsed: 0.028 sec
Running org.apache.cactus.integration.ant.deployment.TestEarParser
Tests run: 2, Failures: 0, Errors: 0, Skipped: 0, Time elapsed: 0.14 sec
Running org.apache.cactus.integration.ant.deployment.webapp.TestWebXml
Tests run: 54, Failures: 0, Errors: 0, Skipped: 0, Time elapsed: 0.206 sec
Running org.apache.cactus.integration.ant.TestAll
Tests run: 0, Failures: 0, Errors: 0, Skipped: 0, Time elapsed: 0.002 sec
Running org.apache.cactus.integration.ant.TestCactifyEarTask
Tests run: 3, Failures: 0, Errors: 0, Skipped: 0, Time elapsed: 0.639 sec
Running org.apache.cactus.integration.ant.deployment.webapp.TestWebXmlVersion
Tests run: 8, Failures: 0, Errors: 0, Skipped: 0, Time elapsed: 0.006 sec
Running org.apache.cactus.integration.ant.deployment.webapp.TestWarArchive
Tests run: 3, Failures: 0, Errors: 0, Skipped: 0, Time elapsed: 0.008 sec
Running org.apache.cactus.integration.ant.deployment.application.TestApplicationXml
Tests run: 7, Failures: 0, Errors: 0, Skipped: 0, Time elapsed: 0.015 sec
Running org.apache.cactus.integration.ant.TestRunServerTestsTask
Tests run: 6, Failures: 0, Errors: 0, Skipped: 0, Time elapsed: 0.537 sec
Running org.apache.cactus.integration.ant.TestCactifyWarTask
Tests run: 21, Failures: 0, Errors: 0, Skipped: 0, Time elapsed: 2.305 sec

Results :

Tests run: 131, Failures: 0, Errors: 0, Skipped: 0

[JENKINS] Recording test results
[INFO] [jar:jar]
[INFO] Building jar: <https://hudson.apache.org/hudson/job/Cactus/ws/Cactus/integration/ant/target/cactus.integration.ant-1.8.2-SNAPSHOT.jar>
[INFO] [rat:check {execution: default}]
[INFO] Preparing checkstyle:check
[JENKINS] Archiving <https://hudson.apache.org/hudson/job/Cactus/ws/Cactus/integration/ant/pom.xml> to /home/hudson/hudson/jobs/Cactus/modules/org.apache.cactus$cactus.integration.ant/builds/2011-04-07_00-05-43/archive/org.apache.cactus/cactus.integration.ant/1.8.2-SNAPSHOT/pom.xml
[JENKINS] Archiving <https://hudson.apache.org/hudson/job/Cactus/ws/Cactus/integration/ant/target/cactus.integration.ant-1.8.2-SNAPSHOT.jar> to /home/hudson/hudson/jobs/Cactus/modules/org.apache.cactus$cactus.integration.ant/builds/2011-04-07_00-05-43/archive/org.apache.cactus/cactus.integration.ant/1.8.2-SNAPSHOT/cactus.integration.ant-1.8.2-SNAPSHOT.jar
[INFO] [checkstyle:checkstyle]
[WARNING] File encoding has not been set, using platform encoding ANSI_X3.4-1968, i.e. build is platform dependent!
[INFO] Starting audit...
<https://hudson.apache.org/hudson/job/Cactus/ws/Cactus/integration/ant/src/main/java/org/apache/cactus/integration/ant/container/GenericContainer.java>:321:15: warning: Redundant 'final' modifier.
<https://hudson.apache.org/hudson/job/Cactus/ws/Cactus/integration/ant/src/main/java/org/apache/cactus/integration/ant/container/GenericContainer.java>:330:12: warning: Redundant 'final' modifier.
<https://hudson.apache.org/hudson/job/Cactus/ws/Cactus/integration/ant/src/main/java/org/apache/cactus/integration/ant/CactifyWarTask.java>:1: warning: Line does not match expected header line of '/* '.
<https://hudson.apache.org/hudson/job/Cactus/ws/Cactus/integration/ant/src/main/java/org/apache/cactus/integration/ant/CactifyWarTask.java>:74:20: warning: Name 'FILE_NAME' must match pattern '^[a-z][a-zA-Z0-9]*$'.
<https://hudson.apache.org/hudson/job/Cactus/ws/Cactus/integration/ant/src/main/java/org/apache/cactus/integration/ant/CactusTask.java>:95: warning: Comment matches to-do format 'TODO:'.
Audit done.

[INFO] [checkstyle:check {execution: default}]
[INFO] [install:install]
[INFO] Installing <https://hudson.apache.org/hudson/job/Cactus/ws/Cactus/integration/ant/target/cactus.integration.ant-1.8.2-SNAPSHOT.jar> to /home/hudson/.m2/repository/org/apache/cactus/cactus.integration.ant/1.8.2-SNAPSHOT/cactus.integration.ant-1.8.2-SNAPSHOT.jar
[INFO] ------------------------------------------------------------------------
[INFO] Building Cactus Maven 1 Plugin
[INFO]    task-segment: [clean, install]
[INFO] ------------------------------------------------------------------------
[INFO] [clean:clean]
[INFO] Deleting directory <https://hudson.apache.org/hudson/job/Cactus/ws/Cactus/integration/maven/target>
[INFO] [remote-resources:process {execution: default}]
[WARNING] Attempting to build MavenProject instance for Artifact (commons-jelly:commons-jelly:20030902.160215) of type: jar; constructing POM artifact instead.
[WARNING] Attempting to build MavenProject instance for Artifact (commons-discovery:commons-discovery:20030211.213356) of type: jar; constructing POM artifact instead.
[INFO] [resources:resources]
[WARNING] Using platform encoding (ANSI_X3.4-1968 actually) to copy filtered resources, i.e. build is platform dependent!
[INFO] skip non existing resourceDirectory <https://hudson.apache.org/hudson/job/Cactus/ws/Cactus/integration/maven/src/main/resources>
[INFO] Copying 3 resources
[INFO] [compiler:compile]
[INFO] Compiling 3 source files to <https://hudson.apache.org/hudson/job/Cactus/ws/Cactus/integration/maven/target/classes>
[INFO] [resources:testResources]
[WARNING] Using platform encoding (ANSI_X3.4-1968 actually) to copy filtered resources, i.e. build is platform dependent!
[INFO] skip non existing resourceDirectory <https://hudson.apache.org/hudson/job/Cactus/ws/Cactus/integration/maven/src/test/resources>
[INFO] Copying 3 resources
[INFO] [compiler:testCompile]
[INFO] No sources to compile
[INFO] [surefire:test]
[INFO] Surefire report directory: <https://hudson.apache.org/hudson/job/Cactus/ws/Cactus/integration/maven/target/surefire-reports>

-------------------------------------------------------
 T E S T S
-------------------------------------------------------
There are no tests to run.

Results :

Tests run: 0, Failures: 0, Errors: 0, Skipped: 0

[JENKINS] Recording test results
[INFO] snapshot org.apache.maven.shared:maven-model-converter:2.3-SNAPSHOT: checking for updates from apache.snapshots
Downloading: http://repository.apache.org/snapshots/org/apache/maven/shared/maven-model-converter/2.3-SNAPSHOT/maven-model-converter-2.3-20110406.061436-27.pom
3K downloaded
Downloading: http://repository.apache.org/snapshots/org/apache/maven/shared/maven-model-converter/2.3-SNAPSHOT/maven-model-converter-2.3-20110406.061436-27.jar
72K downloaded
[INFO] [one:maven-one-plugin]
[INFO] Building jar: <https://hudson.apache.org/hudson/job/Cactus/ws/Cactus/integration/maven/target/cactus.maven1.plugin-1.8.2-SNAPSHOT.jar>
[INFO] [rat:check {execution: default}]
[INFO] Preparing checkstyle:check
[JENKINS] Archiving <https://hudson.apache.org/hudson/job/Cactus/ws/Cactus/integration/maven/pom.xml> to /home/hudson/hudson/jobs/Cactus/modules/org.apache.cactus$cactus.maven1.plugin/builds/2011-04-07_00-05-43/archive/org.apache.cactus/cactus.maven1.plugin/1.8.2-SNAPSHOT/pom.xml
[JENKINS] Archiving <https://hudson.apache.org/hudson/job/Cactus/ws/Cactus/integration/maven/target/cactus.maven1.plugin-1.8.2-SNAPSHOT.jar> to /home/hudson/hudson/jobs/Cactus/modules/org.apache.cactus$cactus.maven1.plugin/builds/2011-04-07_00-05-43/archive/org.apache.cactus/cactus.maven1.plugin/1.8.2-SNAPSHOT/cactus.maven1.plugin-1.8.2-SNAPSHOT.jar
[INFO] [checkstyle:checkstyle]
[WARNING] File encoding has not been set, using platform encoding ANSI_X3.4-1968, i.e. build is platform dependent!
[INFO] Starting audit...
Audit done.

[INFO] [checkstyle:check {execution: default}]
[INFO] [install:install]
[INFO] Installing <https://hudson.apache.org/hudson/job/Cactus/ws/Cactus/integration/maven/target/cactus.maven1.plugin-1.8.2-SNAPSHOT.jar> to /home/hudson/.m2/repository/org/apache/cactus/cactus.maven1.plugin/1.8.2-SNAPSHOT/cactus.maven1.plugin-1.8.2-SNAPSHOT.jar
[INFO] [one:install-maven-one-repository {execution: default}]
[INFO] Installing <https://hudson.apache.org/hudson/job/Cactus/ws/Cactus/integration/maven/target/cactus.maven1.plugin-1.8.2-SNAPSHOT.jar> to /home/hudson/.maven/repository/org.apache.cactus/plugins/cactus.maven1.plugin-1.8.2-SNAPSHOT.jar
[INFO] ------------------------------------------------------------------------
[INFO] Building Cactus Integration Maven2 - Plugin Project
[INFO]    task-segment: [clean, install]
[INFO] ------------------------------------------------------------------------
[INFO] [clean:clean]
[INFO] Deleting directory <https://hudson.apache.org/hudson/job/Cactus/ws/Cactus/integration/maven2/target>
[INFO] [plugin:descriptor]
[WARNING] 

Goal prefix is specified as: 'cactus'. Maven currently expects it to be 'cactus.integration.2'.

[INFO] Using 2 extractors.
[INFO] Applying extractor for language: java
[INFO] Extractor for language: java found 2 mojo descriptors.
[INFO] Applying extractor for language: bsh
[INFO] Extractor for language: bsh found 0 mojo descriptors.
[INFO] [remote-resources:process {execution: default}]
[INFO] [resources:resources]
[WARNING] Using platform encoding (ANSI_X3.4-1968 actually) to copy filtered resources, i.e. build is platform dependent!
[INFO] skip non existing resourceDirectory <https://hudson.apache.org/hudson/job/Cactus/ws/Cactus/integration/maven2/src/main/resources>
[INFO] Copying 3 resources
[INFO] [compiler:compile]
[INFO] Compiling 7 source files to <https://hudson.apache.org/hudson/job/Cactus/ws/Cactus/integration/maven2/target/classes>
[INFO] [resources:testResources]
[WARNING] Using platform encoding (ANSI_X3.4-1968 actually) to copy filtered resources, i.e. build is platform dependent!
[INFO] Copying 10 resources
[INFO] Copying 3 resources
[INFO] [compiler:testCompile]
[INFO] Compiling 4 source files to <https://hudson.apache.org/hudson/job/Cactus/ws/Cactus/integration/maven2/target/test-classes>
[INFO] [surefire:test]
[INFO] Surefire report directory: <https://hudson.apache.org/hudson/job/Cactus/ws/Cactus/integration/maven2/target/surefire-reports>

-------------------------------------------------------
 T E S T S
-------------------------------------------------------
Running org.apache.cactus.integration.maven2.test.TestCactifyEarMojo
Tests run: 1, Failures: 0, Errors: 0, Skipped: 0, Time elapsed: 0.431 sec
Running org.apache.cactus.integration.maven2.test.TestCactifyWarMojo
[INFO] Analyzing war: <https://hudson.apache.org/hudson/job/Cactus/ws/Cactus/integration/maven2>:/null
Tests run: 4, Failures: 0, Errors: 0, Skipped: 0, Time elapsed: 0.572 sec

Results :

Tests run: 5, Failures: 0, Errors: 0, Skipped: 0

[JENKINS] Recording test results
[INFO] [jar:jar]
[INFO] Building jar: <https://hudson.apache.org/hudson/job/Cactus/ws/Cactus/integration/maven2/target/cactus.integration.maven2-1.8.2-SNAPSHOT.jar>
[INFO] [plugin:addPluginArtifactMetadata]
[INFO] [rat:check {execution: default}]
[INFO] Preparing checkstyle:check
[JENKINS] Archiving <https://hudson.apache.org/hudson/job/Cactus/ws/Cactus/integration/maven2/pom.xml> to /home/hudson/hudson/jobs/Cactus/modules/org.apache.cactus$cactus.integration.maven2/builds/2011-04-07_00-05-43/archive/org.apache.cactus/cactus.integration.maven2/1.8.2-SNAPSHOT/pom.xml
[JENKINS] Archiving <https://hudson.apache.org/hudson/job/Cactus/ws/Cactus/integration/maven2/target/cactus.integration.maven2-1.8.2-SNAPSHOT.jar> to /home/hudson/hudson/jobs/Cactus/modules/org.apache.cactus$cactus.integration.maven2/builds/2011-04-07_00-05-43/archive/org.apache.cactus/cactus.integration.maven2/1.8.2-SNAPSHOT/cactus.integration.maven2-1.8.2-SNAPSHOT.jar
[INFO] [checkstyle:checkstyle]
[WARNING] File encoding has not been set, using platform encoding ANSI_X3.4-1968, i.e. build is platform dependent!
[INFO] Starting audit...
<https://hudson.apache.org/hudson/job/Cactus/ws/Cactus/integration/maven2/src/main/java/org/apache/cactus/maven2/mojos/CactifyWarMojo.java>:80:20: warning: Name 'FILE_NAME' must match pattern '^[a-z][a-zA-Z0-9]*$'.
<https://hudson.apache.org/hudson/job/Cactus/ws/Cactus/integration/maven2/src/main/java/org/apache/cactus/maven2/mojos/CactifyWarMojo.java>:259:5: warning: Method length is 169 lines (max allowed is 150).
Audit done.

[INFO] [checkstyle:check {execution: default}]
[INFO] [install:install]
[INFO] Installing <https://hudson.apache.org/hudson/job/Cactus/ws/Cactus/integration/maven2/target/cactus.integration.maven2-1.8.2-SNAPSHOT.jar> to /home/hudson/.m2/repository/org/apache/cactus/cactus.integration.maven2/1.8.2-SNAPSHOT/cactus.integration.maven2-1.8.2-SNAPSHOT.jar
[INFO] [plugin:updateRegistry]
[INFO] ------------------------------------------------------------------------
[INFO] Building Cactus Eclipse Integration
[INFO]    task-segment: [clean, install]
[INFO] ------------------------------------------------------------------------
[INFO] [clean:clean]
[INFO] Deleting directory <https://hudson.apache.org/hudson/job/Cactus/ws/Cactus/integration/eclipse/target>
[INFO] [remote-resources:process {execution: default}]
[INFO] [site:attach-descriptor]
[INFO] [rat:check {execution: default}]
[INFO] Preparing checkstyle:check
[JENKINS] Archiving <https://hudson.apache.org/hudson/job/Cactus/ws/Cactus/integration/eclipse/pom.xml> to /home/hudson/hudson/jobs/Cactus/modules/org.apache.cactus$cactus.integration.eclipse/builds/2011-04-07_00-05-43/archive/org.apache.cactus/cactus.integration.eclipse/1.8.2-SNAPSHOT/pom.xml
[INFO] [checkstyle:checkstyle]
[INFO] Source directory does not exist - skipping report.
[INFO] [checkstyle:check {execution: default}]
[INFO] Unable to perform checkstyle:check, unable to find checkstyle:checkstyle outputFile.
[INFO] [install:install]
[INFO] Installing <https://hudson.apache.org/hudson/job/Cactus/ws/Cactus/integration/eclipse/pom.xml> to /home/hudson/.m2/repository/org/apache/cactus/cactus.integration.eclipse/1.8.2-SNAPSHOT/cactus.integration.eclipse-1.8.2-SNAPSHOT.pom
[INFO] ------------------------------------------------------------------------
[INFO] Building Cactus Eclipse Integration - Webapp
[INFO]    task-segment: [clean, install]
[INFO] ------------------------------------------------------------------------
[INFO] [clean:clean]
[INFO] artifact org.eclipse.jdt:ui: checking for updates from central
[INFO] artifact org.eclipse.equinox:common: checking for updates from central
[INFO] artifact org.eclipse.equinox:app: checking for updates from central
[JENKINS] Archiving <https://hudson.apache.org/hudson/job/Cactus/ws/Cactus/integration/eclipse/org.apache.cactus.eclipse.webapp/pom.xml> to /home/hudson/hudson/jobs/Cactus/modules/org.apache.cactus$org.apache.cactus.eclipse.webapp/builds/2011-04-07_00-05-43/archive/org.apache.cactus/org.apache.cactus.eclipse.webapp/1.8.2-SNAPSHOT/pom.xml
[INFO] ------------------------------------------------------------------------
[ERROR] BUILD ERROR
[INFO] ------------------------------------------------------------------------
[INFO] Failed to resolve artifact.

Couldn't find a version in [1.0.0-v20070423, 1.0.0-v20070606] to match range [1.0.0,2.0.0)
  org.eclipse.equinox:app:jar:null

from the specified remote repositories:
  central (http://repo1.maven.org/maven2),
  maven.eclipse.plugin.repository (http://repo1.maven.org/eclipse/)

Path to dependency: 
	1) org.apache.cactus:org.apache.cactus.eclipse.webapp:jar:1.8.2-SNAPSHOT
	2) org.eclipse.jdt:ui:jar:3.3.0-v20070607-0010
	3) org.eclipse:ui:jar:3.3.0-I20070614-0800
	4) org.eclipse.core:runtime:jar:3.3.100-v20070530



[INFO] ------------------------------------------------------------------------
[INFO] For more information, run Maven with the -e switch
[INFO] ------------------------------------------------------------------------
[INFO] Total time: 2 minutes 19 seconds
[INFO] Finished at: Wed Apr 06 16:08:33 GMT-08:00 2011
[INFO] Final Memory: 57M/217M
[INFO] ------------------------------------------------------------------------
channel stopped


---------------------------------------------------------------------
To unsubscribe, e-mail: notifications-unsubscribe@jakarta.apache.org
For additional commands, e-mail: notifications-help@jakarta.apache.org


Build failed in Jenkins: Cactus #809

Posted by Apache Jenkins Server <hu...@hudson.apache.org>.
See <https://builds.apache.org/hudson/job/Cactus/809/>

------------------------------------------
Started by timer
Building remotely on solaris2
Updating http://svn.apache.org/repos/asf/jakarta/cactus/trunk
At revision 1096638
no change for http://svn.apache.org/repos/asf/jakarta/cactus/trunk since the previous build
Found mavenVersion 2.0.9 from file jar:file:/home/hudson/tools/maven/latest2/lib/maven-2.0.9-uber.jar!/META-INF/maven/org.apache.maven/maven-core/pom.properties
Parsing POMs
[Cactus] $ /home/hudson/tools/java/latest1.5/bin/java -cp /home/hudson/hudson-slave/maven-agent.jar:/home/hudson/hudson-slave/classworlds.jar hudson.maven.agent.Main /home/hudson/tools/maven/latest2 /zonestorage/hudson/home/hudson/hudson-slave/slave.jar /home/hudson/hudson-slave/maven-interceptor.jar 33752
<===[HUDSON REMOTING CAPACITY]===>   channel started
Executing Maven:  -B -f <https://builds.apache.org/hudson/job/Cactus/ws/Cactus/pom.xml> clean install
[INFO] Scanning for projects...
[INFO] Reactor build order: 
[INFO]   Cactus Parent Project
[INFO]   Cactus Build Tools
[INFO]   Cactus Framework - Parent Project
[INFO]   Cactus Framework - shared all versions
[INFO]   Cactus Framework - shared Java EE 1.3 and 1.4
[INFO]   Cactus Wrappers - Parent Project
[INFO]   Cactus Wrappers - Java EE 1.2
[INFO]   Cactus Wrappers - Java EE 1.3
[INFO]   Cactus Wrappers - Java EE 1.4
[INFO]   Cactus Uberjars - Parent Project
[INFO]   Cactus Uberjar - Java EE 1.2
[INFO]   Cactus Uberjar - Java EE 1.3
[INFO]   Cactus Uberjar - Java EE 1.4
[INFO]   Cactus Uberjar - Java EE 1.5
[INFO]   Cactus Integration - Parent Project
[INFO]   Cactus Shared API for the integration
[INFO]   Cactus Ant Integration
[INFO]   Cactus Maven 1 Plugin
[INFO]   Cactus Integration Maven2 - Plugin Project
[INFO]   Cactus Eclipse Integration
[INFO]   Cactus Eclipse Integration - Webapp
[INFO]   Cactus Eclipse Integration - Runner
[INFO]   Cactus Samples - Parent Project
[INFO]   Apache Cactus
[INFO]   Cactus Site Skin
[INFO] ------------------------------------------------------------------------
[ERROR] BUILD ERROR
[INFO] ------------------------------------------------------------------------
[INFO] Error building POM (may not be this project's POM).


Project ID: org.apache.maven.plugins:maven-one-plugin

Reason: Error getting POM for 'org.apache.maven.plugins:maven-one-plugin' from the repository: Unable to read local copy of metadata: Cannot read metadata from '/export/home/hudson/.m2/repository/org/apache/maven/plugins/maven-one-plugin/1.3-SNAPSHOT/maven-metadata-local.xml': expected START_TAG or END_TAG not TEXT (position: TEXT seen ...<extension>jar</... @13:25) 
  org.apache.maven.plugins:maven-one-plugin:pom:1.3-SNAPSHOT

 for project org.apache.maven.plugins:maven-one-plugin


[INFO] ------------------------------------------------------------------------
[INFO] For more information, run Maven with the -e switch
[INFO] ------------------------------------------------------------------------
[INFO] Total time: 3 seconds
[INFO] Finished at: Mon Apr 25 20:03:48 EDT 2011
[INFO] Final Memory: 6M/185M
[INFO] ------------------------------------------------------------------------
channel stopped


---------------------------------------------------------------------
To unsubscribe, e-mail: notifications-unsubscribe@jakarta.apache.org
For additional commands, e-mail: notifications-help@jakarta.apache.org


Build failed in Jenkins: Cactus #808

Posted by Apache Jenkins Server <hu...@hudson.apache.org>.
See <https://builds.apache.org/hudson/job/Cactus/808/>

------------------------------------------
Started by timer
Building remotely on solaris2
Updating http://svn.apache.org/repos/asf/jakarta/cactus/trunk
At revision 1096391
no change for http://svn.apache.org/repos/asf/jakarta/cactus/trunk since the previous build
Found mavenVersion 2.0.9 from file jar:file:/home/hudson/tools/maven/latest2/lib/maven-2.0.9-uber.jar!/META-INF/maven/org.apache.maven/maven-core/pom.properties
Parsing POMs
[Cactus] $ /home/hudson/tools/java/latest1.5/bin/java -cp /home/hudson/hudson-slave/maven-agent.jar:/home/hudson/hudson-slave/classworlds.jar hudson.maven.agent.Main /home/hudson/tools/maven/latest2 /zonestorage/hudson/home/hudson/hudson-slave/slave.jar /home/hudson/hudson-slave/maven-interceptor.jar 62040
<===[HUDSON REMOTING CAPACITY]===>   channel started
Executing Maven:  -B -f <https://builds.apache.org/hudson/job/Cactus/ws/Cactus/pom.xml> clean install
[INFO] Scanning for projects...
[INFO] Reactor build order: 
[INFO]   Cactus Parent Project
[INFO]   Cactus Build Tools
[INFO]   Cactus Framework - Parent Project
[INFO]   Cactus Framework - shared all versions
[INFO]   Cactus Framework - shared Java EE 1.3 and 1.4
[INFO]   Cactus Wrappers - Parent Project
[INFO]   Cactus Wrappers - Java EE 1.2
[INFO]   Cactus Wrappers - Java EE 1.3
[INFO]   Cactus Wrappers - Java EE 1.4
[INFO]   Cactus Uberjars - Parent Project
[INFO]   Cactus Uberjar - Java EE 1.2
[INFO]   Cactus Uberjar - Java EE 1.3
[INFO]   Cactus Uberjar - Java EE 1.4
[INFO]   Cactus Uberjar - Java EE 1.5
[INFO]   Cactus Integration - Parent Project
[INFO]   Cactus Shared API for the integration
[INFO]   Cactus Ant Integration
[INFO]   Cactus Maven 1 Plugin
[INFO]   Cactus Integration Maven2 - Plugin Project
[INFO]   Cactus Eclipse Integration
[INFO]   Cactus Eclipse Integration - Webapp
[INFO]   Cactus Eclipse Integration - Runner
[INFO]   Cactus Samples - Parent Project
[INFO]   Apache Cactus
[INFO]   Cactus Site Skin
[INFO] ------------------------------------------------------------------------
[ERROR] BUILD ERROR
[INFO] ------------------------------------------------------------------------
[INFO] Error building POM (may not be this project's POM).


Project ID: org.apache.maven.plugins:maven-one-plugin

Reason: Error getting POM for 'org.apache.maven.plugins:maven-one-plugin' from the repository: Unable to read local copy of metadata: Cannot read metadata from '/export/home/hudson/.m2/repository/org/apache/maven/plugins/maven-one-plugin/1.3-SNAPSHOT/maven-metadata-local.xml': expected START_TAG or END_TAG not TEXT (position: TEXT seen ...<extension>jar</... @13:25) 
  org.apache.maven.plugins:maven-one-plugin:pom:1.3-SNAPSHOT

 for project org.apache.maven.plugins:maven-one-plugin


[INFO] ------------------------------------------------------------------------
[INFO] For more information, run Maven with the -e switch
[INFO] ------------------------------------------------------------------------
[INFO] Total time: 3 seconds
[INFO] Finished at: Sun Apr 24 20:04:50 EDT 2011
[INFO] Final Memory: 6M/184M
[INFO] ------------------------------------------------------------------------
channel stopped


---------------------------------------------------------------------
To unsubscribe, e-mail: notifications-unsubscribe@jakarta.apache.org
For additional commands, e-mail: notifications-help@jakarta.apache.org


Build failed in Jenkins: Cactus #807

Posted by Apache Jenkins Server <hu...@hudson.apache.org>.
See <https://builds.apache.org/hudson/job/Cactus/807/>

------------------------------------------
Started by timer
Building remotely on solaris2
Updating http://svn.apache.org/repos/asf/jakarta/cactus/trunk
At revision 1096260
no change for http://svn.apache.org/repos/asf/jakarta/cactus/trunk since the previous build
Found mavenVersion 2.0.9 from file jar:file:/home/hudson/tools/maven/latest2/lib/maven-2.0.9-uber.jar!/META-INF/maven/org.apache.maven/maven-core/pom.properties
Parsing POMs
[Cactus] $ /home/hudson/tools/java/latest1.5/bin/java -cp /home/hudson/hudson-slave/maven-agent.jar:/home/hudson/hudson-slave/classworlds.jar hudson.maven.agent.Main /home/hudson/tools/maven/latest2 /zonestorage/hudson/home/hudson/hudson-slave/slave.jar /home/hudson/hudson-slave/maven-interceptor.jar 59062
<===[HUDSON REMOTING CAPACITY]===>channel started
   Executing Maven:  -B -f <https://builds.apache.org/hudson/job/Cactus/ws/Cactus/pom.xml> clean install
[INFO] Scanning for projects...
[INFO] Reactor build order: 
[INFO]   Cactus Parent Project
[INFO]   Cactus Build Tools
[INFO]   Cactus Framework - Parent Project
[INFO]   Cactus Framework - shared all versions
[INFO]   Cactus Framework - shared Java EE 1.3 and 1.4
[INFO]   Cactus Wrappers - Parent Project
[INFO]   Cactus Wrappers - Java EE 1.2
[INFO]   Cactus Wrappers - Java EE 1.3
[INFO]   Cactus Wrappers - Java EE 1.4
[INFO]   Cactus Uberjars - Parent Project
[INFO]   Cactus Uberjar - Java EE 1.2
[INFO]   Cactus Uberjar - Java EE 1.3
[INFO]   Cactus Uberjar - Java EE 1.4
[INFO]   Cactus Uberjar - Java EE 1.5
[INFO]   Cactus Integration - Parent Project
[INFO]   Cactus Shared API for the integration
[INFO]   Cactus Ant Integration
[INFO]   Cactus Maven 1 Plugin
[INFO]   Cactus Integration Maven2 - Plugin Project
[INFO]   Cactus Eclipse Integration
[INFO]   Cactus Eclipse Integration - Webapp
[INFO]   Cactus Eclipse Integration - Runner
[INFO]   Cactus Samples - Parent Project
[INFO]   Apache Cactus
[INFO]   Cactus Site Skin
[INFO] ------------------------------------------------------------------------
[ERROR] BUILD ERROR
[INFO] ------------------------------------------------------------------------
[INFO] Error building POM (may not be this project's POM).


Project ID: org.apache.maven.plugins:maven-one-plugin

Reason: Error getting POM for 'org.apache.maven.plugins:maven-one-plugin' from the repository: Unable to read local copy of metadata: Cannot read metadata from '/export/home/hudson/.m2/repository/org/apache/maven/plugins/maven-one-plugin/1.3-SNAPSHOT/maven-metadata-local.xml': expected START_TAG or END_TAG not TEXT (position: TEXT seen ...<extension>jar</... @13:25) 
  org.apache.maven.plugins:maven-one-plugin:pom:1.3-SNAPSHOT

 for project org.apache.maven.plugins:maven-one-plugin


[INFO] ------------------------------------------------------------------------
[INFO] For more information, run Maven with the -e switch
[INFO] ------------------------------------------------------------------------
[INFO] Total time: 3 seconds
[INFO] Finished at: Sat Apr 23 20:03:54 EDT 2011
[INFO] Final Memory: 6M/184M
[INFO] ------------------------------------------------------------------------
channel stopped


---------------------------------------------------------------------
To unsubscribe, e-mail: notifications-unsubscribe@jakarta.apache.org
For additional commands, e-mail: notifications-help@jakarta.apache.org


Build failed in Jenkins: Cactus #806

Posted by Apache Jenkins Server <hu...@hudson.apache.org>.
See <https://builds.apache.org/hudson/job/Cactus/806/>

------------------------------------------
Started by timer
Building remotely on solaris2
Updating http://svn.apache.org/repos/asf/jakarta/cactus/trunk
At revision 1096093
no change for http://svn.apache.org/repos/asf/jakarta/cactus/trunk since the previous build
Found mavenVersion 2.0.9 from file jar:file:/home/hudson/tools/maven/latest2/lib/maven-2.0.9-uber.jar!/META-INF/maven/org.apache.maven/maven-core/pom.properties
Parsing POMs
[Cactus] $ /home/hudson/tools/java/latest1.5/bin/java -cp /home/hudson/hudson-slave/maven-agent.jar:/home/hudson/hudson-slave/classworlds.jar hudson.maven.agent.Main /home/hudson/tools/maven/latest2 /zonestorage/hudson/home/hudson/hudson-slave/slave.jar /home/hudson/hudson-slave/maven-interceptor.jar 54697
<===[HUDSON REMOTING CAPACITY]===>   channel started
Executing Maven:  -B -f <https://builds.apache.org/hudson/job/Cactus/ws/Cactus/pom.xml> clean install
[INFO] Scanning for projects...
[INFO] Reactor build order: 
[INFO]   Cactus Parent Project
[INFO]   Cactus Build Tools
[INFO]   Cactus Framework - Parent Project
[INFO]   Cactus Framework - shared all versions
[INFO]   Cactus Framework - shared Java EE 1.3 and 1.4
[INFO]   Cactus Wrappers - Parent Project
[INFO]   Cactus Wrappers - Java EE 1.2
[INFO]   Cactus Wrappers - Java EE 1.3
[INFO]   Cactus Wrappers - Java EE 1.4
[INFO]   Cactus Uberjars - Parent Project
[INFO]   Cactus Uberjar - Java EE 1.2
[INFO]   Cactus Uberjar - Java EE 1.3
[INFO]   Cactus Uberjar - Java EE 1.4
[INFO]   Cactus Uberjar - Java EE 1.5
[INFO]   Cactus Integration - Parent Project
[INFO]   Cactus Shared API for the integration
[INFO]   Cactus Ant Integration
[INFO]   Cactus Maven 1 Plugin
[INFO]   Cactus Integration Maven2 - Plugin Project
[INFO]   Cactus Eclipse Integration
[INFO]   Cactus Eclipse Integration - Webapp
[INFO]   Cactus Eclipse Integration - Runner
[INFO]   Cactus Samples - Parent Project
[INFO]   Apache Cactus
[INFO]   Cactus Site Skin
[INFO] ------------------------------------------------------------------------
[ERROR] BUILD ERROR
[INFO] ------------------------------------------------------------------------
[INFO] Error building POM (may not be this project's POM).


Project ID: org.apache.maven.plugins:maven-one-plugin

Reason: Error getting POM for 'org.apache.maven.plugins:maven-one-plugin' from the repository: Unable to read local copy of metadata: Cannot read metadata from '/export/home/hudson/.m2/repository/org/apache/maven/plugins/maven-one-plugin/1.3-SNAPSHOT/maven-metadata-local.xml': expected START_TAG or END_TAG not TEXT (position: TEXT seen ...<extension>jar</... @13:25) 
  org.apache.maven.plugins:maven-one-plugin:pom:1.3-SNAPSHOT

 for project org.apache.maven.plugins:maven-one-plugin


[INFO] ------------------------------------------------------------------------
[INFO] For more information, run Maven with the -e switch
[INFO] ------------------------------------------------------------------------
[INFO] Total time: 2 seconds
[INFO] Finished at: Fri Apr 22 20:02:29 EDT 2011
[INFO] Final Memory: 6M/184M
[INFO] ------------------------------------------------------------------------
channel stopped


---------------------------------------------------------------------
To unsubscribe, e-mail: notifications-unsubscribe@jakarta.apache.org
For additional commands, e-mail: notifications-help@jakarta.apache.org


Build failed in Jenkins: Cactus #805

Posted by Apache Jenkins Server <hu...@hudson.apache.org>.
See <https://builds.apache.org/hudson/job/Cactus/805/>

------------------------------------------
Started by timer
Building remotely on solaris2
Updating http://svn.apache.org/repos/asf/jakarta/cactus/trunk
At revision 1095847
no change for http://svn.apache.org/repos/asf/jakarta/cactus/trunk since the previous build
Found mavenVersion 2.0.9 from file jar:file:/home/hudson/tools/maven/latest2/lib/maven-2.0.9-uber.jar!/META-INF/maven/org.apache.maven/maven-core/pom.properties
Parsing POMs
[Cactus] $ /home/hudson/tools/java/latest1.5/bin/java -cp /home/hudson/hudson-slave/maven-agent.jar:/home/hudson/hudson-slave/classworlds.jar hudson.maven.agent.Main /home/hudson/tools/maven/latest2 /zonestorage/hudson/home/hudson/hudson-slave/slave.jar /home/hudson/hudson-slave/maven-interceptor.jar 51792
<===[HUDSON REMOTING CAPACITY]===>channel started
   Executing Maven:  -B -f <https://builds.apache.org/hudson/job/Cactus/ws/Cactus/pom.xml> clean install
[INFO] Scanning for projects...
[INFO] Reactor build order: 
[INFO]   Cactus Parent Project
[INFO]   Cactus Build Tools
[INFO]   Cactus Framework - Parent Project
[INFO]   Cactus Framework - shared all versions
[INFO]   Cactus Framework - shared Java EE 1.3 and 1.4
[INFO]   Cactus Wrappers - Parent Project
[INFO]   Cactus Wrappers - Java EE 1.2
[INFO]   Cactus Wrappers - Java EE 1.3
[INFO]   Cactus Wrappers - Java EE 1.4
[INFO]   Cactus Uberjars - Parent Project
[INFO]   Cactus Uberjar - Java EE 1.2
[INFO]   Cactus Uberjar - Java EE 1.3
[INFO]   Cactus Uberjar - Java EE 1.4
[INFO]   Cactus Uberjar - Java EE 1.5
[INFO]   Cactus Integration - Parent Project
[INFO]   Cactus Shared API for the integration
[INFO]   Cactus Ant Integration
[INFO]   Cactus Maven 1 Plugin
[INFO]   Cactus Integration Maven2 - Plugin Project
[INFO]   Cactus Eclipse Integration
[INFO]   Cactus Eclipse Integration - Webapp
[INFO]   Cactus Eclipse Integration - Runner
[INFO]   Cactus Samples - Parent Project
[INFO]   Apache Cactus
[INFO]   Cactus Site Skin
[INFO] ------------------------------------------------------------------------
[ERROR] BUILD ERROR
[INFO] ------------------------------------------------------------------------
[INFO] Error building POM (may not be this project's POM).


Project ID: org.apache.maven.plugins:maven-one-plugin

Reason: Error getting POM for 'org.apache.maven.plugins:maven-one-plugin' from the repository: Unable to read local copy of metadata: Cannot read metadata from '/export/home/hudson/.m2/repository/org/apache/maven/plugins/maven-one-plugin/1.3-SNAPSHOT/maven-metadata-local.xml': expected START_TAG or END_TAG not TEXT (position: TEXT seen ...<extension>jar</... @13:25) 
  org.apache.maven.plugins:maven-one-plugin:pom:1.3-SNAPSHOT

 for project org.apache.maven.plugins:maven-one-plugin


[INFO] ------------------------------------------------------------------------
[INFO] For more information, run Maven with the -e switch
[INFO] ------------------------------------------------------------------------
[INFO] Total time: 3 seconds
[INFO] Finished at: Thu Apr 21 20:03:39 EDT 2011
[INFO] Final Memory: 6M/184M
[INFO] ------------------------------------------------------------------------
channel stopped


---------------------------------------------------------------------
To unsubscribe, e-mail: notifications-unsubscribe@jakarta.apache.org
For additional commands, e-mail: notifications-help@jakarta.apache.org


Build failed in Jenkins: Cactus #804

Posted by Apache Jenkins Server <hu...@hudson.apache.org>.
See <https://builds.apache.org/hudson/job/Cactus/804/>

------------------------------------------
Started by timer
Building remotely on solaris2
Updating http://svn.apache.org/repos/asf/jakarta/cactus/trunk
At revision 1095568
no change for http://svn.apache.org/repos/asf/jakarta/cactus/trunk since the previous build
Found mavenVersion 2.0.9 from file jar:file:/home/hudson/tools/maven/latest2/lib/maven-2.0.9-uber.jar!/META-INF/maven/org.apache.maven/maven-core/pom.properties
Parsing POMs
[Cactus] $ /home/hudson/tools/java/latest1.5/bin/java -cp /home/hudson/hudson-slave/maven-agent.jar:/home/hudson/hudson-slave/classworlds.jar hudson.maven.agent.Main /home/hudson/tools/maven/latest2 /zonestorage/hudson/home/hudson/hudson-slave/slave.jar /home/hudson/hudson-slave/maven-interceptor.jar 47768
<===[HUDSON REMOTING CAPACITY]===>   channel started
Executing Maven:  -B -f <https://builds.apache.org/hudson/job/Cactus/ws/Cactus/pom.xml> clean install
[INFO] Scanning for projects...
[INFO] Reactor build order: 
[INFO]   Cactus Parent Project
[INFO]   Cactus Build Tools
[INFO]   Cactus Framework - Parent Project
[INFO]   Cactus Framework - shared all versions
[INFO]   Cactus Framework - shared Java EE 1.3 and 1.4
[INFO]   Cactus Wrappers - Parent Project
[INFO]   Cactus Wrappers - Java EE 1.2
[INFO]   Cactus Wrappers - Java EE 1.3
[INFO]   Cactus Wrappers - Java EE 1.4
[INFO]   Cactus Uberjars - Parent Project
[INFO]   Cactus Uberjar - Java EE 1.2
[INFO]   Cactus Uberjar - Java EE 1.3
[INFO]   Cactus Uberjar - Java EE 1.4
[INFO]   Cactus Uberjar - Java EE 1.5
[INFO]   Cactus Integration - Parent Project
[INFO]   Cactus Shared API for the integration
[INFO]   Cactus Ant Integration
[INFO]   Cactus Maven 1 Plugin
[INFO]   Cactus Integration Maven2 - Plugin Project
[INFO]   Cactus Eclipse Integration
[INFO]   Cactus Eclipse Integration - Webapp
[INFO]   Cactus Eclipse Integration - Runner
[INFO]   Cactus Samples - Parent Project
[INFO]   Apache Cactus
[INFO]   Cactus Site Skin
[INFO] ------------------------------------------------------------------------
[ERROR] BUILD ERROR
[INFO] ------------------------------------------------------------------------
[INFO] Error building POM (may not be this project's POM).


Project ID: org.apache.maven.plugins:maven-one-plugin

Reason: Error getting POM for 'org.apache.maven.plugins:maven-one-plugin' from the repository: Unable to read local copy of metadata: Cannot read metadata from '/export/home/hudson/.m2/repository/org/apache/maven/plugins/maven-one-plugin/1.3-SNAPSHOT/maven-metadata-local.xml': expected START_TAG or END_TAG not TEXT (position: TEXT seen ...<extension>jar</... @13:25) 
  org.apache.maven.plugins:maven-one-plugin:pom:1.3-SNAPSHOT

 for project org.apache.maven.plugins:maven-one-plugin


[INFO] ------------------------------------------------------------------------
[INFO] For more information, run Maven with the -e switch
[INFO] ------------------------------------------------------------------------
[INFO] Total time: 2 seconds
[INFO] Finished at: Wed Apr 20 20:04:37 EDT 2011
[INFO] Final Memory: 6M/184M
[INFO] ------------------------------------------------------------------------
channel stopped


---------------------------------------------------------------------
To unsubscribe, e-mail: notifications-unsubscribe@jakarta.apache.org
For additional commands, e-mail: notifications-help@jakarta.apache.org


Build failed in Jenkins: Cactus #803

Posted by Apache Hudson Server <hu...@hudson.apache.org>.
See <https://hudson.apache.org/hudson/job/Cactus/803/>

------------------------------------------
Started by timer
Building remotely on solaris2
Updating http://svn.apache.org/repos/asf/jakarta/cactus/trunk
At revision 1095238
no change for http://svn.apache.org/repos/asf/jakarta/cactus/trunk since the previous build
Found mavenVersion 2.0.9 from file jar:file:/home/hudson/tools/maven/latest2/lib/maven-2.0.9-uber.jar!/META-INF/maven/org.apache.maven/maven-core/pom.properties
Parsing POMs
[Cactus] $ /home/hudson/tools/java/latest1.5/bin/java -cp /home/hudson/hudson-slave/maven-agent.jar:/home/hudson/hudson-slave/classworlds.jar hudson.maven.agent.Main /home/hudson/tools/maven/latest2 /zonestorage/hudson/home/hudson/hudson-slave/slave.jar /home/hudson/hudson-slave/maven-interceptor.jar 42400
<===[HUDSON REMOTING CAPACITY]===>   channel started
Executing Maven:  -B -f <https://hudson.apache.org/hudson/job/Cactus/ws/Cactus/pom.xml> clean install
[INFO] Scanning for projects...
[INFO] Reactor build order: 
[INFO]   Cactus Parent Project
[INFO]   Cactus Build Tools
[INFO]   Cactus Framework - Parent Project
[INFO]   Cactus Framework - shared all versions
[INFO]   Cactus Framework - shared Java EE 1.3 and 1.4
[INFO]   Cactus Wrappers - Parent Project
[INFO]   Cactus Wrappers - Java EE 1.2
[INFO]   Cactus Wrappers - Java EE 1.3
[INFO]   Cactus Wrappers - Java EE 1.4
[INFO]   Cactus Uberjars - Parent Project
[INFO]   Cactus Uberjar - Java EE 1.2
[INFO]   Cactus Uberjar - Java EE 1.3
[INFO]   Cactus Uberjar - Java EE 1.4
[INFO]   Cactus Uberjar - Java EE 1.5
[INFO]   Cactus Integration - Parent Project
[INFO]   Cactus Shared API for the integration
[INFO]   Cactus Ant Integration
[INFO]   Cactus Maven 1 Plugin
[INFO]   Cactus Integration Maven2 - Plugin Project
[INFO]   Cactus Eclipse Integration
[INFO]   Cactus Eclipse Integration - Webapp
[INFO]   Cactus Eclipse Integration - Runner
[INFO]   Cactus Samples - Parent Project
[INFO]   Apache Cactus
[INFO]   Cactus Site Skin
[INFO] ------------------------------------------------------------------------
[ERROR] BUILD ERROR
[INFO] ------------------------------------------------------------------------
[INFO] Error building POM (may not be this project's POM).


Project ID: org.apache.maven.plugins:maven-one-plugin

Reason: Error getting POM for 'org.apache.maven.plugins:maven-one-plugin' from the repository: Unable to read local copy of metadata: Cannot read metadata from '/export/home/hudson/.m2/repository/org/apache/maven/plugins/maven-one-plugin/1.3-SNAPSHOT/maven-metadata-local.xml': expected START_TAG or END_TAG not TEXT (position: TEXT seen ...<extension>jar</... @13:25) 
  org.apache.maven.plugins:maven-one-plugin:pom:1.3-SNAPSHOT

 for project org.apache.maven.plugins:maven-one-plugin


[INFO] ------------------------------------------------------------------------
[INFO] For more information, run Maven with the -e switch
[INFO] ------------------------------------------------------------------------
[INFO] Total time: 3 seconds
[INFO] Finished at: Tue Apr 19 20:04:38 EDT 2011
[INFO] Final Memory: 6M/185M
[INFO] ------------------------------------------------------------------------
channel stopped


---------------------------------------------------------------------
To unsubscribe, e-mail: notifications-unsubscribe@jakarta.apache.org
For additional commands, e-mail: notifications-help@jakarta.apache.org


Build failed in Jenkins: Cactus #802

Posted by Apache Hudson Server <hu...@hudson.apache.org>.
See <https://hudson.apache.org/hudson/job/Cactus/802/>

------------------------------------------
[...truncated 789 lines...]

[INFO] [checkstyle:check {execution: default}]
[INFO] [install:install]
[INFO] Installing <https://hudson.apache.org/hudson/job/Cactus/ws/Cactus/integration/shared-api/target/cactus.integration.shared.api-1.8.2-SNAPSHOT.jar> to /home/hudson/.m2/repository/org/apache/cactus/cactus.integration.shared.api/1.8.2-SNAPSHOT/cactus.integration.shared.api-1.8.2-SNAPSHOT.jar
[INFO] ------------------------------------------------------------------------
[INFO] Building Cactus Ant Integration
[INFO]    task-segment: [clean, install]
[INFO] ------------------------------------------------------------------------
[INFO] [clean:clean]
[INFO] Deleting directory <https://hudson.apache.org/hudson/job/Cactus/ws/Cactus/integration/ant/target>
[INFO] [remote-resources:process {execution: default}]
[INFO] [resources:resources]
[WARNING] Using platform encoding (ANSI_X3.4-1968 actually) to copy filtered resources, i.e. build is platform dependent!
[INFO] Copying 1 resource
[INFO] Copying 3 resources
[INFO] [compiler:compile]
[INFO] Compiling 12 source files to <https://hudson.apache.org/hudson/job/Cactus/ws/Cactus/integration/ant/target/classes>
[INFO] [resources:testResources]
[WARNING] Using platform encoding (ANSI_X3.4-1968 actually) to copy filtered resources, i.e. build is platform dependent!
[INFO] skip non existing resourceDirectory <https://hudson.apache.org/hudson/job/Cactus/ws/Cactus/integration/ant/src/test/resources>
[INFO] Copying 3 resources
[INFO] [compiler:testCompile]
[INFO] Compiling 16 source files to <https://hudson.apache.org/hudson/job/Cactus/ws/Cactus/integration/ant/target/test-classes>
[INFO] [surefire:test]
[INFO] Surefire report directory: <https://hudson.apache.org/hudson/job/Cactus/ws/Cactus/integration/ant/target/surefire-reports>

-------------------------------------------------------
 T E S T S
-------------------------------------------------------
Running org.apache.cactus.integration.ant.deployment.TestJarArchive
Tests run: 5, Failures: 0, Errors: 0, Skipped: 0, Time elapsed: 0.088 sec
Running org.apache.cactus.integration.ant.TestCactusTask
Tests run: 7, Failures: 0, Errors: 0, Skipped: 0, Time elapsed: 0.46 sec
Running org.apache.cactus.integration.ant.deployment.TestAll
Tests run: 0, Failures: 0, Errors: 0, Skipped: 0, Time elapsed: 0.003 sec
Running org.apache.cactus.integration.ant.TestCactusTestTask
Tests run: 7, Failures: 0, Errors: 0, Skipped: 0, Time elapsed: 0.089 sec
Running org.apache.cactus.integration.ant.deployment.application.TestApplicationXmlVersion
Tests run: 8, Failures: 0, Errors: 0, Skipped: 0, Time elapsed: 0.03 sec
Running org.apache.cactus.integration.ant.deployment.TestEarParser
Tests run: 2, Failures: 0, Errors: 0, Skipped: 0, Time elapsed: 0.113 sec
Running org.apache.cactus.integration.ant.deployment.webapp.TestWebXml
Tests run: 54, Failures: 0, Errors: 0, Skipped: 0, Time elapsed: 0.204 sec
Running org.apache.cactus.integration.ant.TestAll
Tests run: 0, Failures: 0, Errors: 0, Skipped: 0, Time elapsed: 0.002 sec
Running org.apache.cactus.integration.ant.TestCactifyEarTask
Tests run: 3, Failures: 0, Errors: 0, Skipped: 0, Time elapsed: 0.645 sec
Running org.apache.cactus.integration.ant.deployment.webapp.TestWebXmlVersion
Tests run: 8, Failures: 0, Errors: 0, Skipped: 0, Time elapsed: 0.007 sec
Running org.apache.cactus.integration.ant.deployment.webapp.TestWarArchive
Tests run: 3, Failures: 0, Errors: 0, Skipped: 0, Time elapsed: 0.008 sec
Running org.apache.cactus.integration.ant.deployment.application.TestApplicationXml
Tests run: 7, Failures: 0, Errors: 0, Skipped: 0, Time elapsed: 0.017 sec
Running org.apache.cactus.integration.ant.TestRunServerTestsTask
Tests run: 6, Failures: 0, Errors: 0, Skipped: 0, Time elapsed: 0.538 sec
Running org.apache.cactus.integration.ant.TestCactifyWarTask
Tests run: 21, Failures: 0, Errors: 0, Skipped: 0, Time elapsed: 2.336 sec

Results :

Tests run: 131, Failures: 0, Errors: 0, Skipped: 0

[JENKINS] Recording test results
[INFO] [jar:jar]
[INFO] Building jar: <https://hudson.apache.org/hudson/job/Cactus/ws/Cactus/integration/ant/target/cactus.integration.ant-1.8.2-SNAPSHOT.jar>
[INFO] [rat:check {execution: default}]
[INFO] Preparing checkstyle:check
[JENKINS] Archiving <https://hudson.apache.org/hudson/job/Cactus/ws/Cactus/integration/ant/pom.xml> to /home/hudson/hudson/jobs/Cactus/modules/org.apache.cactus$cactus.integration.ant/builds/2011-04-19_00-04-51/archive/org.apache.cactus/cactus.integration.ant/1.8.2-SNAPSHOT/cactus.integration.ant-1.8.2-SNAPSHOT.pom
[JENKINS] Archiving <https://hudson.apache.org/hudson/job/Cactus/ws/Cactus/integration/ant/target/cactus.integration.ant-1.8.2-SNAPSHOT.jar> to /home/hudson/hudson/jobs/Cactus/modules/org.apache.cactus$cactus.integration.ant/builds/2011-04-19_00-04-51/archive/org.apache.cactus/cactus.integration.ant/1.8.2-SNAPSHOT/cactus.integration.ant-1.8.2-SNAPSHOT.jar
[INFO] [checkstyle:checkstyle]
[WARNING] File encoding has not been set, using platform encoding ANSI_X3.4-1968, i.e. build is platform dependent!
[INFO] Starting audit...
<https://hudson.apache.org/hudson/job/Cactus/ws/Cactus/integration/ant/src/main/java/org/apache/cactus/integration/ant/container/GenericContainer.java>:321:15: warning: Redundant 'final' modifier.
<https://hudson.apache.org/hudson/job/Cactus/ws/Cactus/integration/ant/src/main/java/org/apache/cactus/integration/ant/container/GenericContainer.java>:330:12: warning: Redundant 'final' modifier.
<https://hudson.apache.org/hudson/job/Cactus/ws/Cactus/integration/ant/src/main/java/org/apache/cactus/integration/ant/CactifyWarTask.java>:1: warning: Line does not match expected header line of '/* '.
<https://hudson.apache.org/hudson/job/Cactus/ws/Cactus/integration/ant/src/main/java/org/apache/cactus/integration/ant/CactifyWarTask.java>:74:20: warning: Name 'FILE_NAME' must match pattern '^[a-z][a-zA-Z0-9]*$'.
<https://hudson.apache.org/hudson/job/Cactus/ws/Cactus/integration/ant/src/main/java/org/apache/cactus/integration/ant/CactusTask.java>:95: warning: Comment matches to-do format 'TODO:'.
Audit done.

[INFO] [checkstyle:check {execution: default}]
[INFO] [install:install]
[INFO] Installing <https://hudson.apache.org/hudson/job/Cactus/ws/Cactus/integration/ant/target/cactus.integration.ant-1.8.2-SNAPSHOT.jar> to /home/hudson/.m2/repository/org/apache/cactus/cactus.integration.ant/1.8.2-SNAPSHOT/cactus.integration.ant-1.8.2-SNAPSHOT.jar
[INFO] ------------------------------------------------------------------------
[INFO] Building Cactus Maven 1 Plugin
[INFO]    task-segment: [clean, install]
[INFO] ------------------------------------------------------------------------
[INFO] [clean:clean]
[INFO] Deleting directory <https://hudson.apache.org/hudson/job/Cactus/ws/Cactus/integration/maven/target>
[INFO] [remote-resources:process {execution: default}]
[WARNING] Attempting to build MavenProject instance for Artifact (commons-jelly:commons-jelly:20030902.160215) of type: jar; constructing POM artifact instead.
[WARNING] Attempting to build MavenProject instance for Artifact (commons-discovery:commons-discovery:20030211.213356) of type: jar; constructing POM artifact instead.
[INFO] [resources:resources]
[WARNING] Using platform encoding (ANSI_X3.4-1968 actually) to copy filtered resources, i.e. build is platform dependent!
[INFO] skip non existing resourceDirectory <https://hudson.apache.org/hudson/job/Cactus/ws/Cactus/integration/maven/src/main/resources>
[INFO] Copying 3 resources
[INFO] [compiler:compile]
[INFO] Compiling 3 source files to <https://hudson.apache.org/hudson/job/Cactus/ws/Cactus/integration/maven/target/classes>
[INFO] [resources:testResources]
[WARNING] Using platform encoding (ANSI_X3.4-1968 actually) to copy filtered resources, i.e. build is platform dependent!
[INFO] skip non existing resourceDirectory <https://hudson.apache.org/hudson/job/Cactus/ws/Cactus/integration/maven/src/test/resources>
[INFO] Copying 3 resources
[INFO] [compiler:testCompile]
[INFO] No sources to compile
[INFO] [surefire:test]
[INFO] Surefire report directory: <https://hudson.apache.org/hudson/job/Cactus/ws/Cactus/integration/maven/target/surefire-reports>

-------------------------------------------------------
 T E S T S
-------------------------------------------------------
There are no tests to run.

Results :

Tests run: 0, Failures: 0, Errors: 0, Skipped: 0

[JENKINS] Recording test results
[INFO] snapshot org.apache.maven.shared:maven-model-converter:2.3-SNAPSHOT: checking for updates from apache.snapshots
[INFO] [one:maven-one-plugin]
[INFO] Building jar: <https://hudson.apache.org/hudson/job/Cactus/ws/Cactus/integration/maven/target/cactus.maven1.plugin-1.8.2-SNAPSHOT.jar>
[INFO] [rat:check {execution: default}]
[INFO] Preparing checkstyle:check
[JENKINS] Archiving <https://hudson.apache.org/hudson/job/Cactus/ws/Cactus/integration/maven/pom.xml> to /home/hudson/hudson/jobs/Cactus/modules/org.apache.cactus$cactus.maven1.plugin/builds/2011-04-19_00-04-51/archive/org.apache.cactus/cactus.maven1.plugin/1.8.2-SNAPSHOT/cactus.maven1.plugin-1.8.2-SNAPSHOT.pom
[JENKINS] Archiving <https://hudson.apache.org/hudson/job/Cactus/ws/Cactus/integration/maven/target/cactus.maven1.plugin-1.8.2-SNAPSHOT.jar> to /home/hudson/hudson/jobs/Cactus/modules/org.apache.cactus$cactus.maven1.plugin/builds/2011-04-19_00-04-51/archive/org.apache.cactus/cactus.maven1.plugin/1.8.2-SNAPSHOT/cactus.maven1.plugin-1.8.2-SNAPSHOT.jar
[INFO] [checkstyle:checkstyle]
[WARNING] File encoding has not been set, using platform encoding ANSI_X3.4-1968, i.e. build is platform dependent!
[INFO] Starting audit...
Audit done.

[INFO] [checkstyle:check {execution: default}]
[INFO] [install:install]
[INFO] Installing <https://hudson.apache.org/hudson/job/Cactus/ws/Cactus/integration/maven/target/cactus.maven1.plugin-1.8.2-SNAPSHOT.jar> to /home/hudson/.m2/repository/org/apache/cactus/cactus.maven1.plugin/1.8.2-SNAPSHOT/cactus.maven1.plugin-1.8.2-SNAPSHOT.jar
[INFO] [one:install-maven-one-repository {execution: default}]
[INFO] Installing <https://hudson.apache.org/hudson/job/Cactus/ws/Cactus/integration/maven/target/cactus.maven1.plugin-1.8.2-SNAPSHOT.jar> to /home/hudson/.maven/repository/org.apache.cactus/plugins/cactus.maven1.plugin-1.8.2-SNAPSHOT.jar
[INFO] ------------------------------------------------------------------------
[INFO] Building Cactus Integration Maven2 - Plugin Project
[INFO]    task-segment: [clean, install]
[INFO] ------------------------------------------------------------------------
[INFO] [clean:clean]
[INFO] Deleting directory <https://hudson.apache.org/hudson/job/Cactus/ws/Cactus/integration/maven2/target>
[INFO] [plugin:descriptor]
[WARNING] 

Goal prefix is specified as: 'cactus'. Maven currently expects it to be 'cactus.integration.2'.

[INFO] Using 2 extractors.
[INFO] Applying extractor for language: java
[INFO] Extractor for language: java found 2 mojo descriptors.
[INFO] Applying extractor for language: bsh
[INFO] Extractor for language: bsh found 0 mojo descriptors.
[INFO] [remote-resources:process {execution: default}]
[INFO] [resources:resources]
[WARNING] Using platform encoding (ANSI_X3.4-1968 actually) to copy filtered resources, i.e. build is platform dependent!
[INFO] skip non existing resourceDirectory <https://hudson.apache.org/hudson/job/Cactus/ws/Cactus/integration/maven2/src/main/resources>
[INFO] Copying 3 resources
[INFO] [compiler:compile]
[INFO] Compiling 7 source files to <https://hudson.apache.org/hudson/job/Cactus/ws/Cactus/integration/maven2/target/classes>
[INFO] [resources:testResources]
[WARNING] Using platform encoding (ANSI_X3.4-1968 actually) to copy filtered resources, i.e. build is platform dependent!
[INFO] Copying 10 resources
[INFO] Copying 3 resources
[INFO] [compiler:testCompile]
[INFO] Compiling 4 source files to <https://hudson.apache.org/hudson/job/Cactus/ws/Cactus/integration/maven2/target/test-classes>
[INFO] [surefire:test]
[INFO] Surefire report directory: <https://hudson.apache.org/hudson/job/Cactus/ws/Cactus/integration/maven2/target/surefire-reports>

-------------------------------------------------------
 T E S T S
-------------------------------------------------------
Running org.apache.cactus.integration.maven2.test.TestCactifyEarMojo
Tests run: 1, Failures: 0, Errors: 0, Skipped: 0, Time elapsed: 0.425 sec
Running org.apache.cactus.integration.maven2.test.TestCactifyWarMojo
[INFO] Analyzing war: <https://hudson.apache.org/hudson/job/Cactus/ws/Cactus/integration/maven2>:/null
Tests run: 4, Failures: 0, Errors: 0, Skipped: 0, Time elapsed: 0.596 sec

Results :

Tests run: 5, Failures: 0, Errors: 0, Skipped: 0

[JENKINS] Recording test results
[INFO] [jar:jar]
[INFO] Building jar: <https://hudson.apache.org/hudson/job/Cactus/ws/Cactus/integration/maven2/target/cactus.integration.maven2-1.8.2-SNAPSHOT.jar>
[INFO] [plugin:addPluginArtifactMetadata]
[INFO] [rat:check {execution: default}]
[INFO] Preparing checkstyle:check
[JENKINS] Archiving <https://hudson.apache.org/hudson/job/Cactus/ws/Cactus/integration/maven2/pom.xml> to /home/hudson/hudson/jobs/Cactus/modules/org.apache.cactus$cactus.integration.maven2/builds/2011-04-19_00-04-51/archive/org.apache.cactus/cactus.integration.maven2/1.8.2-SNAPSHOT/cactus.integration.maven2-1.8.2-SNAPSHOT.pom
[JENKINS] Archiving <https://hudson.apache.org/hudson/job/Cactus/ws/Cactus/integration/maven2/target/cactus.integration.maven2-1.8.2-SNAPSHOT.jar> to /home/hudson/hudson/jobs/Cactus/modules/org.apache.cactus$cactus.integration.maven2/builds/2011-04-19_00-04-51/archive/org.apache.cactus/cactus.integration.maven2/1.8.2-SNAPSHOT/cactus.integration.maven2-1.8.2-SNAPSHOT.jar
[INFO] [checkstyle:checkstyle]
[WARNING] File encoding has not been set, using platform encoding ANSI_X3.4-1968, i.e. build is platform dependent!
[INFO] Starting audit...
<https://hudson.apache.org/hudson/job/Cactus/ws/Cactus/integration/maven2/src/main/java/org/apache/cactus/maven2/mojos/CactifyWarMojo.java>:80:20: warning: Name 'FILE_NAME' must match pattern '^[a-z][a-zA-Z0-9]*$'.
<https://hudson.apache.org/hudson/job/Cactus/ws/Cactus/integration/maven2/src/main/java/org/apache/cactus/maven2/mojos/CactifyWarMojo.java>:259:5: warning: Method length is 169 lines (max allowed is 150).
Audit done.

[INFO] [checkstyle:check {execution: default}]
[INFO] [install:install]
[INFO] Installing <https://hudson.apache.org/hudson/job/Cactus/ws/Cactus/integration/maven2/target/cactus.integration.maven2-1.8.2-SNAPSHOT.jar> to /home/hudson/.m2/repository/org/apache/cactus/cactus.integration.maven2/1.8.2-SNAPSHOT/cactus.integration.maven2-1.8.2-SNAPSHOT.jar
[INFO] [plugin:updateRegistry]
[INFO] ------------------------------------------------------------------------
[INFO] Building Cactus Eclipse Integration
[INFO]    task-segment: [clean, install]
[INFO] ------------------------------------------------------------------------
[INFO] [clean:clean]
[INFO] Deleting directory <https://hudson.apache.org/hudson/job/Cactus/ws/Cactus/integration/eclipse/target>
[INFO] [remote-resources:process {execution: default}]
[INFO] [site:attach-descriptor]
[INFO] [rat:check {execution: default}]
[INFO] Preparing checkstyle:check
[JENKINS] Archiving <https://hudson.apache.org/hudson/job/Cactus/ws/Cactus/integration/eclipse/pom.xml> to /home/hudson/hudson/jobs/Cactus/modules/org.apache.cactus$cactus.integration.eclipse/builds/2011-04-19_00-04-51/archive/org.apache.cactus/cactus.integration.eclipse/1.8.2-SNAPSHOT/cactus.integration.eclipse-1.8.2-SNAPSHOT.pom
[INFO] [checkstyle:checkstyle]
[INFO] Source directory does not exist - skipping report.
[INFO] [checkstyle:check {execution: default}]
[INFO] Unable to perform checkstyle:check, unable to find checkstyle:checkstyle outputFile.
[INFO] [install:install]
[INFO] Installing <https://hudson.apache.org/hudson/job/Cactus/ws/Cactus/integration/eclipse/pom.xml> to /home/hudson/.m2/repository/org/apache/cactus/cactus.integration.eclipse/1.8.2-SNAPSHOT/cactus.integration.eclipse-1.8.2-SNAPSHOT.pom
[INFO] ------------------------------------------------------------------------
[INFO] Building Cactus Eclipse Integration - Webapp
[INFO]    task-segment: [clean, install]
[INFO] ------------------------------------------------------------------------
[INFO] [clean:clean]
[INFO] artifact org.eclipse.jdt:ui: checking for updates from central
[JENKINS] Archiving <https://hudson.apache.org/hudson/job/Cactus/ws/Cactus/integration/eclipse/org.apache.cactus.eclipse.webapp/pom.xml> to /home/hudson/hudson/jobs/Cactus/modules/org.apache.cactus$org.apache.cactus.eclipse.webapp/builds/2011-04-19_00-04-51/archive/org.apache.cactus/org.apache.cactus.eclipse.webapp/1.8.2-SNAPSHOT/org.apache.cactus.eclipse.webapp-1.8.2-SNAPSHOT.pom
[INFO] ------------------------------------------------------------------------
[ERROR] BUILD ERROR
[INFO] ------------------------------------------------------------------------
[INFO] Failed to resolve artifact.

Couldn't find a version in [1.0.0-v20070423, 1.0.0-v20070606] to match range [1.0.0,2.0.0)
  org.eclipse.equinox:app:jar:null

from the specified remote repositories:
  central (http://repo1.maven.org/maven2),
  maven.eclipse.plugin.repository (http://repo1.maven.org/eclipse/)

Path to dependency: 
	1) org.apache.cactus:org.apache.cactus.eclipse.webapp:jar:1.8.2-SNAPSHOT
	2) org.eclipse.jdt:ui:jar:3.3.0-v20070607-0010
	3) org.eclipse:ui:jar:3.3.0-I20070614-0800
	4) org.eclipse.core:runtime:jar:3.3.100-v20070530



[INFO] ------------------------------------------------------------------------
[INFO] For more information, run Maven with the -e switch
[INFO] ------------------------------------------------------------------------
[INFO] Total time: 2 minutes 7 seconds
[INFO] Finished at: Mon Apr 18 16:07:27 GMT-08:00 2011
[INFO] Final Memory: 58M/222M
[INFO] ------------------------------------------------------------------------
channel stopped


---------------------------------------------------------------------
To unsubscribe, e-mail: notifications-unsubscribe@jakarta.apache.org
For additional commands, e-mail: notifications-help@jakarta.apache.org


Build failed in Jenkins: Cactus #801

Posted by Apache Hudson Server <hu...@hudson.apache.org>.
See <https://hudson.apache.org/hudson/job/Cactus/801/>

------------------------------------------
[...truncated 800 lines...]
[INFO] [resources:resources]
[WARNING] Using platform encoding (ANSI_X3.4-1968 actually) to copy filtered resources, i.e. build is platform dependent!
[INFO] Copying 1 resource
[INFO] Copying 3 resources
[INFO] [compiler:compile]
[INFO] Compiling 12 source files to <https://hudson.apache.org/hudson/job/Cactus/ws/Cactus/integration/ant/target/classes>
[INFO] [resources:testResources]
[WARNING] Using platform encoding (ANSI_X3.4-1968 actually) to copy filtered resources, i.e. build is platform dependent!
[INFO] skip non existing resourceDirectory <https://hudson.apache.org/hudson/job/Cactus/ws/Cactus/integration/ant/src/test/resources>
[INFO] Copying 3 resources
[INFO] [compiler:testCompile]
[INFO] Compiling 16 source files to <https://hudson.apache.org/hudson/job/Cactus/ws/Cactus/integration/ant/target/test-classes>
[INFO] [surefire:test]
[INFO] Surefire report directory: <https://hudson.apache.org/hudson/job/Cactus/ws/Cactus/integration/ant/target/surefire-reports>

-------------------------------------------------------
 T E S T S
-------------------------------------------------------
Running org.apache.cactus.integration.ant.deployment.TestJarArchive
Tests run: 5, Failures: 0, Errors: 0, Skipped: 0, Time elapsed: 0.09 sec
Running org.apache.cactus.integration.ant.TestCactusTask
Tests run: 7, Failures: 0, Errors: 0, Skipped: 0, Time elapsed: 0.465 sec
Running org.apache.cactus.integration.ant.deployment.TestAll
Tests run: 0, Failures: 0, Errors: 0, Skipped: 0, Time elapsed: 0.002 sec
Running org.apache.cactus.integration.ant.TestCactusTestTask
Tests run: 7, Failures: 0, Errors: 0, Skipped: 0, Time elapsed: 0.097 sec
Running org.apache.cactus.integration.ant.deployment.application.TestApplicationXmlVersion
Tests run: 8, Failures: 0, Errors: 0, Skipped: 0, Time elapsed: 0.03 sec
Running org.apache.cactus.integration.ant.deployment.TestEarParser
Tests run: 2, Failures: 0, Errors: 0, Skipped: 0, Time elapsed: 0.118 sec
Running org.apache.cactus.integration.ant.deployment.webapp.TestWebXml
Tests run: 54, Failures: 0, Errors: 0, Skipped: 0, Time elapsed: 0.215 sec
Running org.apache.cactus.integration.ant.TestAll
Tests run: 0, Failures: 0, Errors: 0, Skipped: 0, Time elapsed: 0.001 sec
Running org.apache.cactus.integration.ant.TestCactifyEarTask
Tests run: 3, Failures: 0, Errors: 0, Skipped: 0, Time elapsed: 0.67 sec
Running org.apache.cactus.integration.ant.deployment.webapp.TestWebXmlVersion
Tests run: 8, Failures: 0, Errors: 0, Skipped: 0, Time elapsed: 0.006 sec
Running org.apache.cactus.integration.ant.deployment.webapp.TestWarArchive
Tests run: 3, Failures: 0, Errors: 0, Skipped: 0, Time elapsed: 0.008 sec
Running org.apache.cactus.integration.ant.deployment.application.TestApplicationXml
Tests run: 7, Failures: 0, Errors: 0, Skipped: 0, Time elapsed: 0.018 sec
Running org.apache.cactus.integration.ant.TestRunServerTestsTask
Tests run: 6, Failures: 0, Errors: 0, Skipped: 0, Time elapsed: 0.542 sec
Running org.apache.cactus.integration.ant.TestCactifyWarTask
Tests run: 21, Failures: 0, Errors: 0, Skipped: 0, Time elapsed: 2.361 sec

Results :

Tests run: 131, Failures: 0, Errors: 0, Skipped: 0

[JENKINS] Recording test results
[INFO] [jar:jar]
[INFO] Building jar: <https://hudson.apache.org/hudson/job/Cactus/ws/Cactus/integration/ant/target/cactus.integration.ant-1.8.2-SNAPSHOT.jar>
[INFO] [rat:check {execution: default}]
[INFO] Preparing checkstyle:check
[JENKINS] Archiving <https://hudson.apache.org/hudson/job/Cactus/ws/Cactus/integration/ant/pom.xml> to /home/hudson/hudson/jobs/Cactus/modules/org.apache.cactus$cactus.integration.ant/builds/2011-04-17_00-06-09/archive/org.apache.cactus/cactus.integration.ant/1.8.2-SNAPSHOT/pom.xml
[JENKINS] Archiving <https://hudson.apache.org/hudson/job/Cactus/ws/Cactus/integration/ant/target/cactus.integration.ant-1.8.2-SNAPSHOT.jar> to /home/hudson/hudson/jobs/Cactus/modules/org.apache.cactus$cactus.integration.ant/builds/2011-04-17_00-06-09/archive/org.apache.cactus/cactus.integration.ant/1.8.2-SNAPSHOT/cactus.integration.ant-1.8.2-SNAPSHOT.jar
[INFO] [checkstyle:checkstyle]
[WARNING] File encoding has not been set, using platform encoding ANSI_X3.4-1968, i.e. build is platform dependent!
[INFO] Starting audit...
<https://hudson.apache.org/hudson/job/Cactus/ws/Cactus/integration/ant/src/main/java/org/apache/cactus/integration/ant/container/GenericContainer.java>:321:15: warning: Redundant 'final' modifier.
<https://hudson.apache.org/hudson/job/Cactus/ws/Cactus/integration/ant/src/main/java/org/apache/cactus/integration/ant/container/GenericContainer.java>:330:12: warning: Redundant 'final' modifier.
<https://hudson.apache.org/hudson/job/Cactus/ws/Cactus/integration/ant/src/main/java/org/apache/cactus/integration/ant/CactifyWarTask.java>:1: warning: Line does not match expected header line of '/* '.
<https://hudson.apache.org/hudson/job/Cactus/ws/Cactus/integration/ant/src/main/java/org/apache/cactus/integration/ant/CactifyWarTask.java>:74:20: warning: Name 'FILE_NAME' must match pattern '^[a-z][a-zA-Z0-9]*$'.
<https://hudson.apache.org/hudson/job/Cactus/ws/Cactus/integration/ant/src/main/java/org/apache/cactus/integration/ant/CactusTask.java>:95: warning: Comment matches to-do format 'TODO:'.
Audit done.

[INFO] [checkstyle:check {execution: default}]
[INFO] [install:install]
[INFO] Installing <https://hudson.apache.org/hudson/job/Cactus/ws/Cactus/integration/ant/target/cactus.integration.ant-1.8.2-SNAPSHOT.jar> to /home/hudson/.m2/repository/org/apache/cactus/cactus.integration.ant/1.8.2-SNAPSHOT/cactus.integration.ant-1.8.2-SNAPSHOT.jar
[INFO] ------------------------------------------------------------------------
[INFO] Building Cactus Maven 1 Plugin
[INFO]    task-segment: [clean, install]
[INFO] ------------------------------------------------------------------------
[INFO] [clean:clean]
[INFO] Deleting directory <https://hudson.apache.org/hudson/job/Cactus/ws/Cactus/integration/maven/target>
[INFO] [remote-resources:process {execution: default}]
[WARNING] Attempting to build MavenProject instance for Artifact (commons-jelly:commons-jelly:20030902.160215) of type: jar; constructing POM artifact instead.
[WARNING] Attempting to build MavenProject instance for Artifact (commons-discovery:commons-discovery:20030211.213356) of type: jar; constructing POM artifact instead.
[INFO] [resources:resources]
[WARNING] Using platform encoding (ANSI_X3.4-1968 actually) to copy filtered resources, i.e. build is platform dependent!
[INFO] skip non existing resourceDirectory <https://hudson.apache.org/hudson/job/Cactus/ws/Cactus/integration/maven/src/main/resources>
[INFO] Copying 3 resources
[INFO] [compiler:compile]
[INFO] Compiling 3 source files to <https://hudson.apache.org/hudson/job/Cactus/ws/Cactus/integration/maven/target/classes>
[INFO] [resources:testResources]
[WARNING] Using platform encoding (ANSI_X3.4-1968 actually) to copy filtered resources, i.e. build is platform dependent!
[INFO] skip non existing resourceDirectory <https://hudson.apache.org/hudson/job/Cactus/ws/Cactus/integration/maven/src/test/resources>
[INFO] Copying 3 resources
[INFO] [compiler:testCompile]
[INFO] No sources to compile
[INFO] [surefire:test]
[INFO] Surefire report directory: <https://hudson.apache.org/hudson/job/Cactus/ws/Cactus/integration/maven/target/surefire-reports>

-------------------------------------------------------
 T E S T S
-------------------------------------------------------
There are no tests to run.

Results :

Tests run: 0, Failures: 0, Errors: 0, Skipped: 0

[JENKINS] Recording test results
[INFO] snapshot org.apache.maven.shared:maven-model-converter:2.3-SNAPSHOT: checking for updates from apache.snapshots
Downloading: http://repository.apache.org/snapshots/org/apache/maven/shared/maven-model-converter/2.3-SNAPSHOT/maven-model-converter-2.3-20110416.063210-1085.pom
3K downloaded
Downloading: http://repository.apache.org/snapshots/org/apache/maven/shared/maven-model-converter/2.3-SNAPSHOT/maven-model-converter-2.3-20110416.063210-1085.jar
72K downloaded
[INFO] [one:maven-one-plugin]
[INFO] Building jar: <https://hudson.apache.org/hudson/job/Cactus/ws/Cactus/integration/maven/target/cactus.maven1.plugin-1.8.2-SNAPSHOT.jar>
[INFO] [rat:check {execution: default}]
[INFO] Preparing checkstyle:check
[JENKINS] Archiving <https://hudson.apache.org/hudson/job/Cactus/ws/Cactus/integration/maven/pom.xml> to /home/hudson/hudson/jobs/Cactus/modules/org.apache.cactus$cactus.maven1.plugin/builds/2011-04-17_00-06-09/archive/org.apache.cactus/cactus.maven1.plugin/1.8.2-SNAPSHOT/pom.xml
[JENKINS] Archiving <https://hudson.apache.org/hudson/job/Cactus/ws/Cactus/integration/maven/target/cactus.maven1.plugin-1.8.2-SNAPSHOT.jar> to /home/hudson/hudson/jobs/Cactus/modules/org.apache.cactus$cactus.maven1.plugin/builds/2011-04-17_00-06-09/archive/org.apache.cactus/cactus.maven1.plugin/1.8.2-SNAPSHOT/cactus.maven1.plugin-1.8.2-SNAPSHOT.jar
[INFO] [checkstyle:checkstyle]
[WARNING] File encoding has not been set, using platform encoding ANSI_X3.4-1968, i.e. build is platform dependent!
[INFO] Starting audit...
Audit done.

[INFO] [checkstyle:check {execution: default}]
[INFO] [install:install]
[INFO] Installing <https://hudson.apache.org/hudson/job/Cactus/ws/Cactus/integration/maven/target/cactus.maven1.plugin-1.8.2-SNAPSHOT.jar> to /home/hudson/.m2/repository/org/apache/cactus/cactus.maven1.plugin/1.8.2-SNAPSHOT/cactus.maven1.plugin-1.8.2-SNAPSHOT.jar
[INFO] [one:install-maven-one-repository {execution: default}]
[INFO] Installing <https://hudson.apache.org/hudson/job/Cactus/ws/Cactus/integration/maven/target/cactus.maven1.plugin-1.8.2-SNAPSHOT.jar> to /home/hudson/.maven/repository/org.apache.cactus/plugins/cactus.maven1.plugin-1.8.2-SNAPSHOT.jar
[INFO] ------------------------------------------------------------------------
[INFO] Building Cactus Integration Maven2 - Plugin Project
[INFO]    task-segment: [clean, install]
[INFO] ------------------------------------------------------------------------
[INFO] [clean:clean]
[INFO] Deleting directory <https://hudson.apache.org/hudson/job/Cactus/ws/Cactus/integration/maven2/target>
[INFO] [plugin:descriptor]
[WARNING] 

Goal prefix is specified as: 'cactus'. Maven currently expects it to be 'cactus.integration.2'.

[INFO] Using 2 extractors.
[INFO] Applying extractor for language: java
[INFO] Extractor for language: java found 2 mojo descriptors.
[INFO] Applying extractor for language: bsh
[INFO] Extractor for language: bsh found 0 mojo descriptors.
[INFO] [remote-resources:process {execution: default}]
[INFO] [resources:resources]
[WARNING] Using platform encoding (ANSI_X3.4-1968 actually) to copy filtered resources, i.e. build is platform dependent!
[INFO] skip non existing resourceDirectory <https://hudson.apache.org/hudson/job/Cactus/ws/Cactus/integration/maven2/src/main/resources>
[INFO] Copying 3 resources
[INFO] [compiler:compile]
[INFO] Compiling 7 source files to <https://hudson.apache.org/hudson/job/Cactus/ws/Cactus/integration/maven2/target/classes>
[INFO] [resources:testResources]
[WARNING] Using platform encoding (ANSI_X3.4-1968 actually) to copy filtered resources, i.e. build is platform dependent!
[INFO] Copying 10 resources
[INFO] Copying 3 resources
[INFO] [compiler:testCompile]
[INFO] Compiling 4 source files to <https://hudson.apache.org/hudson/job/Cactus/ws/Cactus/integration/maven2/target/test-classes>
[INFO] [surefire:test]
[INFO] Surefire report directory: <https://hudson.apache.org/hudson/job/Cactus/ws/Cactus/integration/maven2/target/surefire-reports>

-------------------------------------------------------
 T E S T S
-------------------------------------------------------
Running org.apache.cactus.integration.maven2.test.TestCactifyEarMojo
Tests run: 1, Failures: 0, Errors: 0, Skipped: 0, Time elapsed: 0.857 sec
Running org.apache.cactus.integration.maven2.test.TestCactifyWarMojo
[INFO] Analyzing war: <https://hudson.apache.org/hudson/job/Cactus/ws/Cactus/integration/maven2>:/null
Tests run: 4, Failures: 0, Errors: 0, Skipped: 0, Time elapsed: 2.086 sec

Results :

Tests run: 5, Failures: 0, Errors: 0, Skipped: 0

[JENKINS] Recording test results
[INFO] [jar:jar]
[INFO] Building jar: <https://hudson.apache.org/hudson/job/Cactus/ws/Cactus/integration/maven2/target/cactus.integration.maven2-1.8.2-SNAPSHOT.jar>
[INFO] [plugin:addPluginArtifactMetadata]
[INFO] [rat:check {execution: default}]
[INFO] Preparing checkstyle:check
[JENKINS] Archiving <https://hudson.apache.org/hudson/job/Cactus/ws/Cactus/integration/maven2/pom.xml> to /home/hudson/hudson/jobs/Cactus/modules/org.apache.cactus$cactus.integration.maven2/builds/2011-04-17_00-06-09/archive/org.apache.cactus/cactus.integration.maven2/1.8.2-SNAPSHOT/pom.xml
[JENKINS] Archiving <https://hudson.apache.org/hudson/job/Cactus/ws/Cactus/integration/maven2/target/cactus.integration.maven2-1.8.2-SNAPSHOT.jar> to /home/hudson/hudson/jobs/Cactus/modules/org.apache.cactus$cactus.integration.maven2/builds/2011-04-17_00-06-09/archive/org.apache.cactus/cactus.integration.maven2/1.8.2-SNAPSHOT/cactus.integration.maven2-1.8.2-SNAPSHOT.jar
[INFO] [checkstyle:checkstyle]
[WARNING] File encoding has not been set, using platform encoding ANSI_X3.4-1968, i.e. build is platform dependent!
[INFO] Starting audit...
<https://hudson.apache.org/hudson/job/Cactus/ws/Cactus/integration/maven2/src/main/java/org/apache/cactus/maven2/mojos/CactifyWarMojo.java>:80:20: warning: Name 'FILE_NAME' must match pattern '^[a-z][a-zA-Z0-9]*$'.
<https://hudson.apache.org/hudson/job/Cactus/ws/Cactus/integration/maven2/src/main/java/org/apache/cactus/maven2/mojos/CactifyWarMojo.java>:259:5: warning: Method length is 169 lines (max allowed is 150).
Audit done.

[INFO] [checkstyle:check {execution: default}]
[INFO] [install:install]
[INFO] Installing <https://hudson.apache.org/hudson/job/Cactus/ws/Cactus/integration/maven2/target/cactus.integration.maven2-1.8.2-SNAPSHOT.jar> to /home/hudson/.m2/repository/org/apache/cactus/cactus.integration.maven2/1.8.2-SNAPSHOT/cactus.integration.maven2-1.8.2-SNAPSHOT.jar
[INFO] [plugin:updateRegistry]
[INFO] ------------------------------------------------------------------------
[INFO] Building Cactus Eclipse Integration
[INFO]    task-segment: [clean, install]
[INFO] ------------------------------------------------------------------------
[INFO] [clean:clean]
[INFO] Deleting directory <https://hudson.apache.org/hudson/job/Cactus/ws/Cactus/integration/eclipse/target>
[INFO] [remote-resources:process {execution: default}]
[INFO] [site:attach-descriptor]
[INFO] [rat:check {execution: default}]
[INFO] Preparing checkstyle:check
[JENKINS] Archiving <https://hudson.apache.org/hudson/job/Cactus/ws/Cactus/integration/eclipse/pom.xml> to /home/hudson/hudson/jobs/Cactus/modules/org.apache.cactus$cactus.integration.eclipse/builds/2011-04-17_00-06-09/archive/org.apache.cactus/cactus.integration.eclipse/1.8.2-SNAPSHOT/pom.xml
[INFO] [checkstyle:checkstyle]
[INFO] Source directory does not exist - skipping report.
[INFO] [checkstyle:check {execution: default}]
[INFO] Unable to perform checkstyle:check, unable to find checkstyle:checkstyle outputFile.
[INFO] [install:install]
[INFO] Installing <https://hudson.apache.org/hudson/job/Cactus/ws/Cactus/integration/eclipse/pom.xml> to /home/hudson/.m2/repository/org/apache/cactus/cactus.integration.eclipse/1.8.2-SNAPSHOT/cactus.integration.eclipse-1.8.2-SNAPSHOT.pom
[INFO] ------------------------------------------------------------------------
[INFO] Building Cactus Eclipse Integration - Webapp
[INFO]    task-segment: [clean, install]
[INFO] ------------------------------------------------------------------------
[INFO] [clean:clean]
[INFO] artifact org.eclipse.jdt:ui: checking for updates from central
[INFO] artifact org.eclipse:osgi: checking for updates from central
[INFO] artifact org.eclipse.equinox:common: checking for updates from central
[INFO] artifact org.eclipse.core:jobs: checking for updates from central
[INFO] artifact org.eclipse.equinox:registry: checking for updates from central
[INFO] artifact org.eclipse.equinox:preferences: checking for updates from central
[INFO] artifact org.eclipse.core:contenttype: checking for updates from central
[INFO] artifact org.eclipse.equinox:app: checking for updates from central
[JENKINS] Archiving <https://hudson.apache.org/hudson/job/Cactus/ws/Cactus/integration/eclipse/org.apache.cactus.eclipse.webapp/pom.xml> to /home/hudson/hudson/jobs/Cactus/modules/org.apache.cactus$org.apache.cactus.eclipse.webapp/builds/2011-04-17_00-06-09/archive/org.apache.cactus/org.apache.cactus.eclipse.webapp/1.8.2-SNAPSHOT/pom.xml
[INFO] ------------------------------------------------------------------------
[ERROR] BUILD ERROR
[INFO] ------------------------------------------------------------------------
[INFO] Failed to resolve artifact.

Couldn't find a version in [1.0.0-v20070423, 1.0.0-v20070606] to match range [1.0.0,2.0.0)
  org.eclipse.equinox:app:jar:null

from the specified remote repositories:
  central (http://repo1.maven.org/maven2),
  maven.eclipse.plugin.repository (http://repo1.maven.org/eclipse/)

Path to dependency: 
	1) org.apache.cactus:org.apache.cactus.eclipse.webapp:jar:1.8.2-SNAPSHOT
	2) org.eclipse.jdt:ui:jar:3.3.0-v20070607-0010
	3) org.eclipse:ui:jar:3.3.0-I20070614-0800
	4) org.eclipse.core:runtime:jar:3.3.100-v20070530



[INFO] ------------------------------------------------------------------------
[INFO] For more information, run Maven with the -e switch
[INFO] ------------------------------------------------------------------------
[INFO] Total time: 2 minutes 22 seconds
[INFO] Finished at: Sat Apr 16 16:08:59 GMT-08:00 2011
[INFO] Final Memory: 57M/192M
[INFO] ------------------------------------------------------------------------
channel stopped


---------------------------------------------------------------------
To unsubscribe, e-mail: notifications-unsubscribe@jakarta.apache.org
For additional commands, e-mail: notifications-help@jakarta.apache.org


Build failed in Jenkins: Cactus #800

Posted by Apache Hudson Server <hu...@hudson.apache.org>.
See <https://hudson.apache.org/hudson/job/Cactus/800/>

------------------------------------------
[...truncated 986 lines...]
A         .classpath
A         descriptors
A         descriptors/licenses
AU        descriptors/licenses/mozilla-1.1.txt
AU        descriptors/licenses/epl-v10.html
AU        descriptors/licenses/mit.txt
AU        descriptors/licenses/cpl-1.0.txt
AU        descriptors/licenses/README.txt
AU        descriptors/licenses/apache-2.0.txt
AU        descriptors/pom.xml
A         samples
A         samples/jetty
AU        samples/jetty/ivy.xml
A         samples/jetty/src
A         samples/jetty/src/main
A         samples/jetty/src/main/java
A         samples/jetty/src/main/java/org
A         samples/jetty/src/main/java/org/apache
A         samples/jetty/src/main/java/org/apache/cactus
A         samples/jetty/src/main/java/org/apache/cactus/sample
A         samples/jetty/src/main/java/org/apache/cactus/sample/jetty
AU        samples/jetty/src/main/java/org/apache/cactus/sample/jetty/TestJettyAll.java
A         samples/jetty/src/main/resources
A         samples/jetty/src/main/resources/conf
A         samples/jetty/src/main/resources/conf/5x
AU        samples/jetty/src/main/resources/conf/5x/jetty.xml
A         samples/jetty/src/main/resources/conf/6x
AU        samples/jetty/src/main/resources/conf/6x/jetty-web.xml
AU        samples/jetty/src/main/resources/conf/6x/realm.properties
AU        samples/jetty/src/main/resources/conf/6x/jetty.xml
A         samples/jetty/src/main/webapp
A         samples/jetty/src/main/webapp/test
AU        samples/jetty/src/main/webapp/test/test.jsp
A         samples/jetty/src/main/webapp/WEB-INF
AU        samples/jetty/src/main/webapp/WEB-INF/web.xml
AU        samples/jetty/src/main/webapp/jspRedirector.jsp
AU        samples/jetty/pom.xml
AU        samples/jetty/README
AU        samples/jetty/build.xml
A         samples/ejb
AU        samples/ejb/ivy.xml
A         samples/ejb/src
A         samples/ejb/src/test
A         samples/ejb/src/test/java
A         samples/ejb/src/test/java/org
A         samples/ejb/src/test/java/org/apache
A         samples/ejb/src/test/java/org/apache/cactus
A         samples/ejb/src/test/java/org/apache/cactus/sample
A         samples/ejb/src/test/java/org/apache/cactus/sample/ejb
AU        samples/ejb/src/test/java/org/apache/cactus/sample/ejb/TestConverterEJB.java
A         samples/ejb/src/main
A         samples/ejb/src/main/app
AU        samples/ejb/src/main/app/application.xml
AU        samples/ejb/src/main/app/main.xml
A         samples/ejb/src/main/java
A         samples/ejb/src/main/java/org
A         samples/ejb/src/main/java/org/apache
A         samples/ejb/src/main/java/org/apache/cactus
A         samples/ejb/src/main/java/org/apache/cactus/sample
A         samples/ejb/src/main/java/org/apache/cactus/sample/ejb
AU        samples/ejb/src/main/java/org/apache/cactus/sample/ejb/ConverterHome.java
AU        samples/ejb/src/main/java/org/apache/cactus/sample/ejb/Converter.java
AU        samples/ejb/src/main/java/org/apache/cactus/sample/ejb/ConverterEJB.java
A         samples/ejb/src/main/resources
A         samples/ejb/src/main/resources/META-INF
AU        samples/ejb/src/main/resources/META-INF/ejb-jar.xml
AU        samples/ejb/src/main/resources/META-INF/README
AU        samples/ejb/src/main/resources/ejb-jar.xml
AU        samples/ejb/src/main/resources/README
A         samples/ejb/src/main/webapp
A         samples/ejb/src/main/webapp/WEB-INF
AU        samples/ejb/src/main/webapp/WEB-INF/cactus-web.xml
AU        samples/ejb/src/main/webapp/WEB-INF/web.xml
AU        samples/ejb/pom.xml
AU        samples/ejb/build.xml
A         samples/ejb3
AU        samples/ejb3/ivy.xml
A         samples/ejb3/src
A         samples/ejb3/src/test
A         samples/ejb3/src/test/java
A         samples/ejb3/src/test/java/org
A         samples/ejb3/src/test/java/org/apache
A         samples/ejb3/src/test/java/org/apache/cactus
A         samples/ejb3/src/test/java/org/apache/cactus/sample
A         samples/ejb3/src/test/java/org/apache/cactus/sample/ejb3
AU        samples/ejb3/src/test/java/org/apache/cactus/sample/ejb3/TestConverterEJB.java
A         samples/ejb3/src/main
A         samples/ejb3/src/main/app
AU        samples/ejb3/src/main/app/application.xml
AU        samples/ejb3/src/main/app/main.xml
A         samples/ejb3/src/main/java
A         samples/ejb3/src/main/java/org
A         samples/ejb3/src/main/java/org/apache
A         samples/ejb3/src/main/java/org/apache/cactus
A         samples/ejb3/src/main/java/org/apache/cactus/sample
A         samples/ejb3/src/main/java/org/apache/cactus/sample/ejb3
AU        samples/ejb3/src/main/java/org/apache/cactus/sample/ejb3/IConvertLocal.java
AU        samples/ejb3/src/main/java/org/apache/cactus/sample/ejb3/ConverterBean.java
A         samples/ejb3/src/main/resources
A         samples/ejb3/src/main/webapp
A         samples/ejb3/src/main/webapp/WEB-INF
AU        samples/ejb3/src/main/webapp/WEB-INF/cactus-web.xml
AU        samples/ejb3/src/main/webapp/WEB-INF/web.xml
AU        samples/ejb3/pom.xml
AU        samples/ejb3/build.xml
A         samples/servlet
AU        samples/servlet/ivy.xml
A         samples/servlet/src
A         samples/servlet/src/test
A         samples/servlet/src/test/java
A         samples/servlet/src/test/java/org
A         samples/servlet/src/test/java/org/apache
A         samples/servlet/src/test/java/org/apache/cactus
A         samples/servlet/src/test/java/org/apache/cactus/sample
A         samples/servlet/src/test/java/org/apache/cactus/sample/servlet
A         samples/servlet/src/test/java/org/apache/cactus/sample/servlet/unit
AU        samples/servlet/src/test/java/org/apache/cactus/sample/servlet/unit/TestRequestDispatcher.java
AU        samples/servlet/src/test/java/org/apache/cactus/sample/servlet/unit/TestTearDownException.java
AU        samples/servlet/src/test/java/org/apache/cactus/sample/servlet/unit/TestHttpParameters.java
AU        samples/servlet/src/test/java/org/apache/cactus/sample/servlet/unit/TestSetUpTearDown.java
AU        samples/servlet/src/test/java/org/apache/cactus/sample/servlet/unit/TestServletRedirectorOverride.java
AU        samples/servlet/src/test/java/org/apache/cactus/sample/servlet/unit/TestJspTagLifecycle.java
AU        samples/servlet/src/test/java/org/apache/cactus/sample/servlet/unit/TestAll.java
AU        samples/servlet/src/test/java/org/apache/cactus/sample/servlet/unit/TestHtmlUnitIntegration.java
AU        samples/servlet/src/test/java/org/apache/cactus/sample/servlet/unit/TestCookie.java
AU        samples/servlet/src/test/java/org/apache/cactus/sample/servlet/unit/TestServletConfig.java
AU        samples/servlet/src/test/java/org/apache/cactus/sample/servlet/unit/TestHttpHeaders.java
AU        samples/servlet/src/test/java/org/apache/cactus/sample/servlet/unit/TestServerSideExceptions.java
AU        samples/servlet/src/test/java/org/apache/cactus/sample/servlet/unit/TestSetURL.java
AU        samples/servlet/src/test/java/org/apache/cactus/sample/servlet/unit/TestBasicAuthentication.java
AU        samples/servlet/src/test/java/org/apache/cactus/sample/servlet/unit/TestFilterHttpHeaders.java
AU        samples/servlet/src/test/java/org/apache/cactus/sample/servlet/unit/TestHttpUnitIntegration.java
AU        samples/servlet/src/test/java/org/apache/cactus/sample/servlet/unit/TestHttpSession.java
AU        samples/servlet/src/test/java/org/apache/cactus/sample/servlet/unit/TestJspOut.java
AU        samples/servlet/src/test/java/org/apache/cactus/sample/servlet/unit/TestSetURLSpecific.java
AU        samples/servlet/src/test/java/org/apache/cactus/sample/servlet/unit/TestJUnitTestCaseWrapper.java
AU        samples/servlet/src/test/java/org/apache/cactus/sample/servlet/unit/TestClientServerSynchronization.java
AU        samples/servlet/src/test/java/org/apache/cactus/sample/servlet/unit/TestHttpRequest.java
AU        samples/servlet/src/test/java/org/apache/cactus/sample/servlet/unit/TestServletContext.java
AU        samples/servlet/src/test/java/org/apache/cactus/sample/servlet/unit/TestShareAll.java
AU        samples/servlet/src/test/java/org/apache/cactus/sample/servlet/unit/TestGlobalBeginEnd.java
AU        samples/servlet/src/test/java/org/apache/cactus/sample/servlet/unit/TestHttpResponse.java
AU        samples/servlet/src/test/java/org/apache/cactus/sample/servlet/unit/TestHttpRequestSpecific.java
AU        samples/servlet/src/test/java/org/apache/cactus/sample/servlet/unit/TestJspPageContext.java
AU        samples/servlet/src/test/java/org/apache/cactus/sample/servlet/TestSampleServlet.java
AU        samples/servlet/src/test/java/org/apache/cactus/sample/servlet/TestSampleFilter.java
AU        samples/servlet/src/test/java/org/apache/cactus/sample/servlet/TestSampleBodyTag.java
AU        samples/servlet/src/test/java/org/apache/cactus/sample/servlet/TestSampleServletConfig.java
AU        samples/servlet/src/test/java/org/apache/cactus/sample/servlet/TestSampleTag.java
A         samples/servlet/src/main
A         samples/servlet/src/main/java
A         samples/servlet/src/main/java/org
A         samples/servlet/src/main/java/org/apache
A         samples/servlet/src/main/java/org/apache/cactus
A         samples/servlet/src/main/java/org/apache/cactus/sample
A         samples/servlet/src/main/java/org/apache/cactus/sample/servlet
AU        samples/servlet/src/main/java/org/apache/cactus/sample/servlet/SampleServlet.java
AU        samples/servlet/src/main/java/org/apache/cactus/sample/servlet/SampleFilter.java
AU        samples/servlet/src/main/java/org/apache/cactus/sample/servlet/SampleBodyTag.java
AU        samples/servlet/src/main/java/org/apache/cactus/sample/servlet/SampleServletConfig.java
AU        samples/servlet/src/main/java/org/apache/cactus/sample/servlet/SampleTag.java
A         samples/servlet/src/main/java/org/apache/cactus/sample/servlet/util
AU        samples/servlet/src/main/java/org/apache/cactus/sample/servlet/util/FilterServletOutputStream.java
AU        samples/servlet/src/main/java/org/apache/cactus/sample/servlet/util/GenericResponseWrapper.java
A         samples/servlet/src/main/resources
A         samples/servlet/src/main/resources/conf
AU        samples/servlet/src/main/resources/conf/logging_client.properties
AU        samples/servlet/src/main/resources/conf/logging_server.properties
A         samples/servlet/src/main/resources/conf/jboss3x
AU        samples/servlet/src/main/resources/conf/jboss3x/roles.properties
AU        samples/servlet/src/main/resources/conf/jboss3x/jboss-web.xml
AU        samples/servlet/src/main/resources/conf/jboss3x/users.properties
A         samples/servlet/src/main/resources/scripts
AU        samples/servlet/src/main/resources/scripts/build.xml
AU        samples/servlet/src/main/resources/README
A         samples/servlet/src/main/webapp
A         samples/servlet/src/main/webapp/test
AU        samples/servlet/src/main/webapp/test/test.jsp
AU        samples/servlet/src/main/webapp/cactus-report.xsl
A         samples/servlet/src/main/webapp/WEB-INF
AU        samples/servlet/src/main/webapp/WEB-INF/cactus-report.xsl
AU        samples/servlet/src/main/webapp/WEB-INF/cactus-web.xml
AU        samples/servlet/src/main/webapp/WEB-INF/web.xml
AU        samples/servlet/pom.xml
AU        samples/servlet/build.xml
AU        samples/ivysettings.xml
AU        samples/build.properties
AU        samples/pom.xml
AU        cactus-bin-assembly.xml
AU        ANNOUNCEMENT.txt
AU        KEYS
AU        BUILDING.txt
 U        .
At revision 1092846
no change for http://svn.apache.org/repos/asf/jakarta/cactus/trunk since the previous build
Found mavenVersion 2.0.9 from file jar:file:/home/hudson/tools/maven/latest2/lib/maven-2.0.9-uber.jar!/META-INF/maven/org.apache.maven/maven-core/pom.properties
Parsing POMs
[Cactus] $ /home/hudson/tools/java/latest1.5/bin/java -cp /home/hudson/hudson-slave/maven-agent.jar:/home/hudson/hudson-slave/classworlds.jar hudson.maven.agent.Main /home/hudson/tools/maven/latest2 /zonestorage/hudson/home/hudson/hudson-slave/slave.jar /home/hudson/hudson-slave/maven-interceptor.jar 57890
<===[HUDSON REMOTING CAPACITY]===>channel started
   Executing Maven:  -B -f <https://hudson.apache.org/hudson/job/Cactus/ws/Cactus/pom.xml> clean install
[INFO] Scanning for projects...
[INFO] Reactor build order: 
[INFO]   Cactus Parent Project
[INFO]   Cactus Build Tools
[INFO]   Cactus Framework - Parent Project
[INFO]   Cactus Framework - shared all versions
[INFO]   Cactus Framework - shared Java EE 1.3 and 1.4
[INFO]   Cactus Wrappers - Parent Project
[INFO]   Cactus Wrappers - Java EE 1.2
[INFO]   Cactus Wrappers - Java EE 1.3
[INFO]   Cactus Wrappers - Java EE 1.4
[INFO]   Cactus Uberjars - Parent Project
[INFO]   Cactus Uberjar - Java EE 1.2
[INFO]   Cactus Uberjar - Java EE 1.3
[INFO]   Cactus Uberjar - Java EE 1.4
[INFO]   Cactus Uberjar - Java EE 1.5
[INFO]   Cactus Integration - Parent Project
[INFO]   Cactus Shared API for the integration
[INFO]   Cactus Ant Integration
[INFO]   Cactus Maven 1 Plugin
[INFO]   Cactus Integration Maven2 - Plugin Project
[INFO]   Cactus Eclipse Integration
[INFO]   Cactus Eclipse Integration - Webapp
[INFO]   Cactus Eclipse Integration - Runner
[INFO]   Cactus Samples - Parent Project
[INFO]   Apache Cactus
[INFO]   Cactus Site Skin
[INFO] ------------------------------------------------------------------------
[ERROR] BUILD ERROR
[INFO] ------------------------------------------------------------------------
[INFO] Error building POM (may not be this project's POM).


Project ID: org.apache.maven.plugins:maven-one-plugin

Reason: Error getting POM for 'org.apache.maven.plugins:maven-one-plugin' from the repository: Unable to read local copy of metadata: Cannot read metadata from '/export/home/hudson/.m2/repository/org/apache/maven/plugins/maven-one-plugin/1.3-SNAPSHOT/maven-metadata-local.xml': expected START_TAG or END_TAG not TEXT (position: TEXT seen ...<extension>jar</... @13:25) 
  org.apache.maven.plugins:maven-one-plugin:pom:1.3-SNAPSHOT

 for project org.apache.maven.plugins:maven-one-plugin


[INFO] ------------------------------------------------------------------------
[INFO] For more information, run Maven with the -e switch
[INFO] ------------------------------------------------------------------------
[INFO] Total time: 4 seconds
[INFO] Finished at: Fri Apr 15 20:05:06 EDT 2011
[INFO] Final Memory: 6M/184M
[INFO] ------------------------------------------------------------------------
channel stopped


---------------------------------------------------------------------
To unsubscribe, e-mail: notifications-unsubscribe@jakarta.apache.org
For additional commands, e-mail: notifications-help@jakarta.apache.org


Build failed in Jenkins: Cactus #799

Posted by Apache Hudson Server <hu...@hudson.apache.org>.
See <https://hudson.apache.org/hudson/job/Cactus/799/>

------------------------------------------
[...truncated 800 lines...]
[INFO] [resources:resources]
[WARNING] Using platform encoding (ANSI_X3.4-1968 actually) to copy filtered resources, i.e. build is platform dependent!
[INFO] Copying 1 resource
[INFO] Copying 3 resources
[INFO] [compiler:compile]
[INFO] Compiling 12 source files to <https://hudson.apache.org/hudson/job/Cactus/ws/Cactus/integration/ant/target/classes>
[INFO] [resources:testResources]
[WARNING] Using platform encoding (ANSI_X3.4-1968 actually) to copy filtered resources, i.e. build is platform dependent!
[INFO] skip non existing resourceDirectory <https://hudson.apache.org/hudson/job/Cactus/ws/Cactus/integration/ant/src/test/resources>
[INFO] Copying 3 resources
[INFO] [compiler:testCompile]
[INFO] Compiling 16 source files to <https://hudson.apache.org/hudson/job/Cactus/ws/Cactus/integration/ant/target/test-classes>
[INFO] [surefire:test]
[INFO] Surefire report directory: <https://hudson.apache.org/hudson/job/Cactus/ws/Cactus/integration/ant/target/surefire-reports>

-------------------------------------------------------
 T E S T S
-------------------------------------------------------
Running org.apache.cactus.integration.ant.deployment.TestJarArchive
Tests run: 5, Failures: 0, Errors: 0, Skipped: 0, Time elapsed: 0.088 sec
Running org.apache.cactus.integration.ant.TestCactusTask
Tests run: 7, Failures: 0, Errors: 0, Skipped: 0, Time elapsed: 0.487 sec
Running org.apache.cactus.integration.ant.deployment.TestAll
Tests run: 0, Failures: 0, Errors: 0, Skipped: 0, Time elapsed: 0.003 sec
Running org.apache.cactus.integration.ant.TestCactusTestTask
Tests run: 7, Failures: 0, Errors: 0, Skipped: 0, Time elapsed: 0.092 sec
Running org.apache.cactus.integration.ant.deployment.application.TestApplicationXmlVersion
Tests run: 8, Failures: 0, Errors: 0, Skipped: 0, Time elapsed: 0.028 sec
Running org.apache.cactus.integration.ant.deployment.TestEarParser
Tests run: 2, Failures: 0, Errors: 0, Skipped: 0, Time elapsed: 0.112 sec
Running org.apache.cactus.integration.ant.deployment.webapp.TestWebXml
Tests run: 54, Failures: 0, Errors: 0, Skipped: 0, Time elapsed: 0.203 sec
Running org.apache.cactus.integration.ant.TestAll
Tests run: 0, Failures: 0, Errors: 0, Skipped: 0, Time elapsed: 0.002 sec
Running org.apache.cactus.integration.ant.TestCactifyEarTask
Tests run: 3, Failures: 0, Errors: 0, Skipped: 0, Time elapsed: 0.637 sec
Running org.apache.cactus.integration.ant.deployment.webapp.TestWebXmlVersion
Tests run: 8, Failures: 0, Errors: 0, Skipped: 0, Time elapsed: 0.006 sec
Running org.apache.cactus.integration.ant.deployment.webapp.TestWarArchive
Tests run: 3, Failures: 0, Errors: 0, Skipped: 0, Time elapsed: 0.007 sec
Running org.apache.cactus.integration.ant.deployment.application.TestApplicationXml
Tests run: 7, Failures: 0, Errors: 0, Skipped: 0, Time elapsed: 0.015 sec
Running org.apache.cactus.integration.ant.TestRunServerTestsTask
Tests run: 6, Failures: 0, Errors: 0, Skipped: 0, Time elapsed: 0.536 sec
Running org.apache.cactus.integration.ant.TestCactifyWarTask
Tests run: 21, Failures: 0, Errors: 0, Skipped: 0, Time elapsed: 2.315 sec

Results :

Tests run: 131, Failures: 0, Errors: 0, Skipped: 0

[JENKINS] Recording test results
[INFO] [jar:jar]
[INFO] Building jar: <https://hudson.apache.org/hudson/job/Cactus/ws/Cactus/integration/ant/target/cactus.integration.ant-1.8.2-SNAPSHOT.jar>
[INFO] [rat:check {execution: default}]
[INFO] Preparing checkstyle:check
[JENKINS] Archiving <https://hudson.apache.org/hudson/job/Cactus/ws/Cactus/integration/ant/pom.xml> to /home/hudson/hudson/jobs/Cactus/modules/org.apache.cactus$cactus.integration.ant/builds/2011-04-15_00-05-08/archive/org.apache.cactus/cactus.integration.ant/1.8.2-SNAPSHOT/pom.xml
[JENKINS] Archiving <https://hudson.apache.org/hudson/job/Cactus/ws/Cactus/integration/ant/target/cactus.integration.ant-1.8.2-SNAPSHOT.jar> to /home/hudson/hudson/jobs/Cactus/modules/org.apache.cactus$cactus.integration.ant/builds/2011-04-15_00-05-08/archive/org.apache.cactus/cactus.integration.ant/1.8.2-SNAPSHOT/cactus.integration.ant-1.8.2-SNAPSHOT.jar
[INFO] [checkstyle:checkstyle]
[WARNING] File encoding has not been set, using platform encoding ANSI_X3.4-1968, i.e. build is platform dependent!
[INFO] Starting audit...
<https://hudson.apache.org/hudson/job/Cactus/ws/Cactus/integration/ant/src/main/java/org/apache/cactus/integration/ant/container/GenericContainer.java>:321:15: warning: Redundant 'final' modifier.
<https://hudson.apache.org/hudson/job/Cactus/ws/Cactus/integration/ant/src/main/java/org/apache/cactus/integration/ant/container/GenericContainer.java>:330:12: warning: Redundant 'final' modifier.
<https://hudson.apache.org/hudson/job/Cactus/ws/Cactus/integration/ant/src/main/java/org/apache/cactus/integration/ant/CactifyWarTask.java>:1: warning: Line does not match expected header line of '/* '.
<https://hudson.apache.org/hudson/job/Cactus/ws/Cactus/integration/ant/src/main/java/org/apache/cactus/integration/ant/CactifyWarTask.java>:74:20: warning: Name 'FILE_NAME' must match pattern '^[a-z][a-zA-Z0-9]*$'.
<https://hudson.apache.org/hudson/job/Cactus/ws/Cactus/integration/ant/src/main/java/org/apache/cactus/integration/ant/CactusTask.java>:95: warning: Comment matches to-do format 'TODO:'.
Audit done.

[INFO] [checkstyle:check {execution: default}]
[INFO] [install:install]
[INFO] Installing <https://hudson.apache.org/hudson/job/Cactus/ws/Cactus/integration/ant/target/cactus.integration.ant-1.8.2-SNAPSHOT.jar> to /home/hudson/.m2/repository/org/apache/cactus/cactus.integration.ant/1.8.2-SNAPSHOT/cactus.integration.ant-1.8.2-SNAPSHOT.jar
[INFO] ------------------------------------------------------------------------
[INFO] Building Cactus Maven 1 Plugin
[INFO]    task-segment: [clean, install]
[INFO] ------------------------------------------------------------------------
[INFO] [clean:clean]
[INFO] Deleting directory <https://hudson.apache.org/hudson/job/Cactus/ws/Cactus/integration/maven/target>
[INFO] [remote-resources:process {execution: default}]
[WARNING] Attempting to build MavenProject instance for Artifact (commons-jelly:commons-jelly:20030902.160215) of type: jar; constructing POM artifact instead.
[WARNING] Attempting to build MavenProject instance for Artifact (commons-discovery:commons-discovery:20030211.213356) of type: jar; constructing POM artifact instead.
[INFO] [resources:resources]
[WARNING] Using platform encoding (ANSI_X3.4-1968 actually) to copy filtered resources, i.e. build is platform dependent!
[INFO] skip non existing resourceDirectory <https://hudson.apache.org/hudson/job/Cactus/ws/Cactus/integration/maven/src/main/resources>
[INFO] Copying 3 resources
[INFO] [compiler:compile]
[INFO] Compiling 3 source files to <https://hudson.apache.org/hudson/job/Cactus/ws/Cactus/integration/maven/target/classes>
[INFO] [resources:testResources]
[WARNING] Using platform encoding (ANSI_X3.4-1968 actually) to copy filtered resources, i.e. build is platform dependent!
[INFO] skip non existing resourceDirectory <https://hudson.apache.org/hudson/job/Cactus/ws/Cactus/integration/maven/src/test/resources>
[INFO] Copying 3 resources
[INFO] [compiler:testCompile]
[INFO] No sources to compile
[INFO] [surefire:test]
[INFO] Surefire report directory: <https://hudson.apache.org/hudson/job/Cactus/ws/Cactus/integration/maven/target/surefire-reports>

-------------------------------------------------------
 T E S T S
-------------------------------------------------------
There are no tests to run.

Results :

Tests run: 0, Failures: 0, Errors: 0, Skipped: 0

[JENKINS] Recording test results
[INFO] snapshot org.apache.maven.shared:maven-model-converter:2.3-SNAPSHOT: checking for updates from apache.snapshots
Downloading: http://repository.apache.org/snapshots/org/apache/maven/shared/maven-model-converter/2.3-SNAPSHOT/maven-model-converter-2.3-20110414.061627-35.pom
3K downloaded
Downloading: http://repository.apache.org/snapshots/org/apache/maven/shared/maven-model-converter/2.3-SNAPSHOT/maven-model-converter-2.3-20110414.061627-35.jar
72K downloaded
[INFO] [one:maven-one-plugin]
[INFO] Building jar: <https://hudson.apache.org/hudson/job/Cactus/ws/Cactus/integration/maven/target/cactus.maven1.plugin-1.8.2-SNAPSHOT.jar>
[INFO] [rat:check {execution: default}]
[INFO] Preparing checkstyle:check
[JENKINS] Archiving <https://hudson.apache.org/hudson/job/Cactus/ws/Cactus/integration/maven/pom.xml> to /home/hudson/hudson/jobs/Cactus/modules/org.apache.cactus$cactus.maven1.plugin/builds/2011-04-15_00-05-08/archive/org.apache.cactus/cactus.maven1.plugin/1.8.2-SNAPSHOT/pom.xml
[JENKINS] Archiving <https://hudson.apache.org/hudson/job/Cactus/ws/Cactus/integration/maven/target/cactus.maven1.plugin-1.8.2-SNAPSHOT.jar> to /home/hudson/hudson/jobs/Cactus/modules/org.apache.cactus$cactus.maven1.plugin/builds/2011-04-15_00-05-08/archive/org.apache.cactus/cactus.maven1.plugin/1.8.2-SNAPSHOT/cactus.maven1.plugin-1.8.2-SNAPSHOT.jar
[INFO] [checkstyle:checkstyle]
[WARNING] File encoding has not been set, using platform encoding ANSI_X3.4-1968, i.e. build is platform dependent!
[INFO] Starting audit...
Audit done.

[INFO] [checkstyle:check {execution: default}]
[INFO] [install:install]
[INFO] Installing <https://hudson.apache.org/hudson/job/Cactus/ws/Cactus/integration/maven/target/cactus.maven1.plugin-1.8.2-SNAPSHOT.jar> to /home/hudson/.m2/repository/org/apache/cactus/cactus.maven1.plugin/1.8.2-SNAPSHOT/cactus.maven1.plugin-1.8.2-SNAPSHOT.jar
[INFO] [one:install-maven-one-repository {execution: default}]
[INFO] Installing <https://hudson.apache.org/hudson/job/Cactus/ws/Cactus/integration/maven/target/cactus.maven1.plugin-1.8.2-SNAPSHOT.jar> to /home/hudson/.maven/repository/org.apache.cactus/plugins/cactus.maven1.plugin-1.8.2-SNAPSHOT.jar
[INFO] ------------------------------------------------------------------------
[INFO] Building Cactus Integration Maven2 - Plugin Project
[INFO]    task-segment: [clean, install]
[INFO] ------------------------------------------------------------------------
[INFO] [clean:clean]
[INFO] Deleting directory <https://hudson.apache.org/hudson/job/Cactus/ws/Cactus/integration/maven2/target>
[INFO] [plugin:descriptor]
[WARNING] 

Goal prefix is specified as: 'cactus'. Maven currently expects it to be 'cactus.integration.2'.

[INFO] Using 2 extractors.
[INFO] Applying extractor for language: java
[INFO] Extractor for language: java found 2 mojo descriptors.
[INFO] Applying extractor for language: bsh
[INFO] Extractor for language: bsh found 0 mojo descriptors.
[INFO] [remote-resources:process {execution: default}]
[INFO] [resources:resources]
[WARNING] Using platform encoding (ANSI_X3.4-1968 actually) to copy filtered resources, i.e. build is platform dependent!
[INFO] skip non existing resourceDirectory <https://hudson.apache.org/hudson/job/Cactus/ws/Cactus/integration/maven2/src/main/resources>
[INFO] Copying 3 resources
[INFO] [compiler:compile]
[INFO] Compiling 7 source files to <https://hudson.apache.org/hudson/job/Cactus/ws/Cactus/integration/maven2/target/classes>
[INFO] [resources:testResources]
[WARNING] Using platform encoding (ANSI_X3.4-1968 actually) to copy filtered resources, i.e. build is platform dependent!
[INFO] Copying 10 resources
[INFO] Copying 3 resources
[INFO] [compiler:testCompile]
[INFO] Compiling 4 source files to <https://hudson.apache.org/hudson/job/Cactus/ws/Cactus/integration/maven2/target/test-classes>
[INFO] [surefire:test]
[INFO] Surefire report directory: <https://hudson.apache.org/hudson/job/Cactus/ws/Cactus/integration/maven2/target/surefire-reports>

-------------------------------------------------------
 T E S T S
-------------------------------------------------------
Running org.apache.cactus.integration.maven2.test.TestCactifyEarMojo
Tests run: 1, Failures: 0, Errors: 0, Skipped: 0, Time elapsed: 0.429 sec
Running org.apache.cactus.integration.maven2.test.TestCactifyWarMojo
[INFO] Analyzing war: <https://hudson.apache.org/hudson/job/Cactus/ws/Cactus/integration/maven2>:/null
Tests run: 4, Failures: 0, Errors: 0, Skipped: 0, Time elapsed: 0.584 sec

Results :

Tests run: 5, Failures: 0, Errors: 0, Skipped: 0

[JENKINS] Recording test results
[INFO] [jar:jar]
[INFO] Building jar: <https://hudson.apache.org/hudson/job/Cactus/ws/Cactus/integration/maven2/target/cactus.integration.maven2-1.8.2-SNAPSHOT.jar>
[INFO] [plugin:addPluginArtifactMetadata]
[INFO] [rat:check {execution: default}]
[INFO] Preparing checkstyle:check
[JENKINS] Archiving <https://hudson.apache.org/hudson/job/Cactus/ws/Cactus/integration/maven2/pom.xml> to /home/hudson/hudson/jobs/Cactus/modules/org.apache.cactus$cactus.integration.maven2/builds/2011-04-15_00-05-08/archive/org.apache.cactus/cactus.integration.maven2/1.8.2-SNAPSHOT/pom.xml
[JENKINS] Archiving <https://hudson.apache.org/hudson/job/Cactus/ws/Cactus/integration/maven2/target/cactus.integration.maven2-1.8.2-SNAPSHOT.jar> to /home/hudson/hudson/jobs/Cactus/modules/org.apache.cactus$cactus.integration.maven2/builds/2011-04-15_00-05-08/archive/org.apache.cactus/cactus.integration.maven2/1.8.2-SNAPSHOT/cactus.integration.maven2-1.8.2-SNAPSHOT.jar
[INFO] [checkstyle:checkstyle]
[WARNING] File encoding has not been set, using platform encoding ANSI_X3.4-1968, i.e. build is platform dependent!
[INFO] Starting audit...
<https://hudson.apache.org/hudson/job/Cactus/ws/Cactus/integration/maven2/src/main/java/org/apache/cactus/maven2/mojos/CactifyWarMojo.java>:80:20: warning: Name 'FILE_NAME' must match pattern '^[a-z][a-zA-Z0-9]*$'.
<https://hudson.apache.org/hudson/job/Cactus/ws/Cactus/integration/maven2/src/main/java/org/apache/cactus/maven2/mojos/CactifyWarMojo.java>:259:5: warning: Method length is 169 lines (max allowed is 150).
Audit done.

[INFO] [checkstyle:check {execution: default}]
[INFO] [install:install]
[INFO] Installing <https://hudson.apache.org/hudson/job/Cactus/ws/Cactus/integration/maven2/target/cactus.integration.maven2-1.8.2-SNAPSHOT.jar> to /home/hudson/.m2/repository/org/apache/cactus/cactus.integration.maven2/1.8.2-SNAPSHOT/cactus.integration.maven2-1.8.2-SNAPSHOT.jar
[INFO] [plugin:updateRegistry]
[INFO] ------------------------------------------------------------------------
[INFO] Building Cactus Eclipse Integration
[INFO]    task-segment: [clean, install]
[INFO] ------------------------------------------------------------------------
[INFO] [clean:clean]
[INFO] Deleting directory <https://hudson.apache.org/hudson/job/Cactus/ws/Cactus/integration/eclipse/target>
[INFO] [remote-resources:process {execution: default}]
[INFO] [site:attach-descriptor]
[INFO] [rat:check {execution: default}]
[INFO] Preparing checkstyle:check
[JENKINS] Archiving <https://hudson.apache.org/hudson/job/Cactus/ws/Cactus/integration/eclipse/pom.xml> to /home/hudson/hudson/jobs/Cactus/modules/org.apache.cactus$cactus.integration.eclipse/builds/2011-04-15_00-05-08/archive/org.apache.cactus/cactus.integration.eclipse/1.8.2-SNAPSHOT/pom.xml
[INFO] [checkstyle:checkstyle]
[INFO] Source directory does not exist - skipping report.
[INFO] [checkstyle:check {execution: default}]
[INFO] Unable to perform checkstyle:check, unable to find checkstyle:checkstyle outputFile.
[INFO] [install:install]
[INFO] Installing <https://hudson.apache.org/hudson/job/Cactus/ws/Cactus/integration/eclipse/pom.xml> to /home/hudson/.m2/repository/org/apache/cactus/cactus.integration.eclipse/1.8.2-SNAPSHOT/cactus.integration.eclipse-1.8.2-SNAPSHOT.pom
[INFO] ------------------------------------------------------------------------
[INFO] Building Cactus Eclipse Integration - Webapp
[INFO]    task-segment: [clean, install]
[INFO] ------------------------------------------------------------------------
[INFO] [clean:clean]
[INFO] artifact org.eclipse.jdt:ui: checking for updates from central
[INFO] artifact org.eclipse:osgi: checking for updates from central
[INFO] artifact org.eclipse.equinox:common: checking for updates from central
[INFO] artifact org.eclipse.core:jobs: checking for updates from central
[INFO] artifact org.eclipse.equinox:registry: checking for updates from central
[INFO] artifact org.eclipse.equinox:preferences: checking for updates from central
[INFO] artifact org.eclipse.core:contenttype: checking for updates from central
[INFO] artifact org.eclipse.equinox:app: checking for updates from central
[JENKINS] Archiving <https://hudson.apache.org/hudson/job/Cactus/ws/Cactus/integration/eclipse/org.apache.cactus.eclipse.webapp/pom.xml> to /home/hudson/hudson/jobs/Cactus/modules/org.apache.cactus$org.apache.cactus.eclipse.webapp/builds/2011-04-15_00-05-08/archive/org.apache.cactus/org.apache.cactus.eclipse.webapp/1.8.2-SNAPSHOT/pom.xml
[INFO] ------------------------------------------------------------------------
[ERROR] BUILD ERROR
[INFO] ------------------------------------------------------------------------
[INFO] Failed to resolve artifact.

Couldn't find a version in [1.0.0-v20070423, 1.0.0-v20070606] to match range [1.0.0,2.0.0)
  org.eclipse.equinox:app:jar:null

from the specified remote repositories:
  central (http://repo1.maven.org/maven2),
  maven.eclipse.plugin.repository (http://repo1.maven.org/eclipse/)

Path to dependency: 
	1) org.apache.cactus:org.apache.cactus.eclipse.webapp:jar:1.8.2-SNAPSHOT
	2) org.eclipse.jdt:ui:jar:3.3.0-v20070607-0010
	3) org.eclipse:ui:jar:3.3.0-I20070614-0800
	4) org.eclipse.core:runtime:jar:3.3.100-v20070530



[INFO] ------------------------------------------------------------------------
[INFO] For more information, run Maven with the -e switch
[INFO] ------------------------------------------------------------------------
[INFO] Total time: 2 minutes 17 seconds
[INFO] Finished at: Thu Apr 14 16:07:52 GMT-08:00 2011
[INFO] Final Memory: 57M/180M
[INFO] ------------------------------------------------------------------------
channel stopped


---------------------------------------------------------------------
To unsubscribe, e-mail: notifications-unsubscribe@jakarta.apache.org
For additional commands, e-mail: notifications-help@jakarta.apache.org


Build failed in Jenkins: Cactus #798

Posted by Apache Hudson Server <hu...@hudson.apache.org>.
See <https://hudson.apache.org/hudson/job/Cactus/798/>

------------------------------------------
Started by timer
Building remotely on ubuntu1
FATAL: cannot assign instance of hudson.model.StreamBuildListener to field hudson.scm.subversion.WorkspaceUpdater$UpdateTask.listener of type hudson.model.TaskListener in instance of hudson.scm.SubversionSCM$CheckOutTask
java.lang.ClassCastException: cannot assign instance of hudson.model.StreamBuildListener to field hudson.scm.subversion.WorkspaceUpdater$UpdateTask.listener of type hudson.model.TaskListener in instance of hudson.scm.SubversionSCM$CheckOutTask
	at java.io.ObjectStreamClass$FieldReflector.setObjFieldValues(ObjectStreamClass.java:2056)
	at java.io.ObjectStreamClass.setObjFieldValues(ObjectStreamClass.java:1229)
	at java.io.ObjectInputStream.defaultReadFields(ObjectInputStream.java:1969)
	at java.io.ObjectInputStream.readSerialData(ObjectInputStream.java:1887)
	at java.io.ObjectInputStream.readOrdinaryObject(ObjectInputStream.java:1770)
	at java.io.ObjectInputStream.readObject0(ObjectInputStream.java:1346)
	at java.io.ObjectInputStream.defaultReadFields(ObjectInputStream.java:1963)
	at java.io.ObjectInputStream.readSerialData(ObjectInputStream.java:1887)
	at java.io.ObjectInputStream.readOrdinaryObject(ObjectInputStream.java:1770)
	at java.io.ObjectInputStream.readObject0(ObjectInputStream.java:1346)
	at java.io.ObjectInputStream.readObject(ObjectInputStream.java:368)
	at hudson.remoting.UserRequest.deserialize(UserRequest.java:178)
	at hudson.remoting.UserRequest.perform(UserRequest.java:98)
	at hudson.remoting.UserRequest.perform(UserRequest.java:48)
	at hudson.remoting.Request$2.run(Request.java:270)
	at java.util.concurrent.Executors$RunnableAdapter.call(Executors.java:471)
	at java.util.concurrent.FutureTask$Sync.innerRun(FutureTask.java:334)
	at java.util.concurrent.FutureTask.run(FutureTask.java:166)
	at java.util.concurrent.ThreadPoolExecutor.runWorker(ThreadPoolExecutor.java:1110)
	at java.util.concurrent.ThreadPoolExecutor$Worker.run(ThreadPoolExecutor.java:603)
	at java.lang.Thread.run(Thread.java:636)


---------------------------------------------------------------------
To unsubscribe, e-mail: notifications-unsubscribe@jakarta.apache.org
For additional commands, e-mail: notifications-help@jakarta.apache.org


Build failed in Jenkins: Cactus #797

Posted by Apache Hudson Server <hu...@hudson.apache.org>.
See <https://hudson.apache.org/hudson/job/Cactus/797/>

------------------------------------------
Started by timer
Building remotely on ubuntu1
FATAL: cannot assign instance of hudson.model.StreamBuildListener to field hudson.scm.subversion.WorkspaceUpdater$UpdateTask.listener of type hudson.model.TaskListener in instance of hudson.scm.SubversionSCM$CheckOutTask
java.lang.ClassCastException: cannot assign instance of hudson.model.StreamBuildListener to field hudson.scm.subversion.WorkspaceUpdater$UpdateTask.listener of type hudson.model.TaskListener in instance of hudson.scm.SubversionSCM$CheckOutTask
	at java.io.ObjectStreamClass$FieldReflector.setObjFieldValues(ObjectStreamClass.java:2056)
	at java.io.ObjectStreamClass.setObjFieldValues(ObjectStreamClass.java:1229)
	at java.io.ObjectInputStream.defaultReadFields(ObjectInputStream.java:1969)
	at java.io.ObjectInputStream.readSerialData(ObjectInputStream.java:1887)
	at java.io.ObjectInputStream.readOrdinaryObject(ObjectInputStream.java:1770)
	at java.io.ObjectInputStream.readObject0(ObjectInputStream.java:1346)
	at java.io.ObjectInputStream.defaultReadFields(ObjectInputStream.java:1963)
	at java.io.ObjectInputStream.readSerialData(ObjectInputStream.java:1887)
	at java.io.ObjectInputStream.readOrdinaryObject(ObjectInputStream.java:1770)
	at java.io.ObjectInputStream.readObject0(ObjectInputStream.java:1346)
	at java.io.ObjectInputStream.readObject(ObjectInputStream.java:368)
	at hudson.remoting.UserRequest.deserialize(UserRequest.java:178)
	at hudson.remoting.UserRequest.perform(UserRequest.java:98)
	at hudson.remoting.UserRequest.perform(UserRequest.java:48)
	at hudson.remoting.Request$2.run(Request.java:270)
	at java.util.concurrent.Executors$RunnableAdapter.call(Executors.java:471)
	at java.util.concurrent.FutureTask$Sync.innerRun(FutureTask.java:334)
	at java.util.concurrent.FutureTask.run(FutureTask.java:166)
	at java.util.concurrent.ThreadPoolExecutor.runWorker(ThreadPoolExecutor.java:1110)
	at java.util.concurrent.ThreadPoolExecutor$Worker.run(ThreadPoolExecutor.java:603)
	at java.lang.Thread.run(Thread.java:636)


---------------------------------------------------------------------
To unsubscribe, e-mail: notifications-unsubscribe@jakarta.apache.org
For additional commands, e-mail: notifications-help@jakarta.apache.org


Build failed in Jenkins: Cactus #796

Posted by Apache Hudson Server <hu...@hudson.apache.org>.
See <https://hudson.apache.org/hudson/job/Cactus/796/>

------------------------------------------
Started by timer
Building remotely on solaris2
Updating http://svn.apache.org/repos/asf/jakarta/cactus/trunk
At revision 1091258
no change for http://svn.apache.org/repos/asf/jakarta/cactus/trunk since the previous build
Found mavenVersion 2.0.9 from file jar:file:/home/hudson/tools/maven/latest2/lib/maven-2.0.9-uber.jar!/META-INF/maven/org.apache.maven/maven-core/pom.properties
Parsing POMs
[Cactus] $ /home/hudson/tools/java/latest1.5/bin/java -cp /home/hudson/hudson-slave/maven-agent.jar:/home/hudson/hudson-slave/classworlds.jar hudson.maven.agent.Main /home/hudson/tools/maven/latest2 /zonestorage/hudson/home/hudson/hudson-slave/slave.jar /home/hudson/hudson-slave/maven-interceptor.jar 38960
<===[HUDSON REMOTING CAPACITY]===>   channel started
Executing Maven:  -B -f <https://hudson.apache.org/hudson/job/Cactus/ws/Cactus/pom.xml> clean install
[INFO] Scanning for projects...
[INFO] Reactor build order: 
[INFO]   Cactus Parent Project
[INFO]   Cactus Build Tools
[INFO]   Cactus Framework - Parent Project
[INFO]   Cactus Framework - shared all versions
[INFO]   Cactus Framework - shared Java EE 1.3 and 1.4
[INFO]   Cactus Wrappers - Parent Project
[INFO]   Cactus Wrappers - Java EE 1.2
[INFO]   Cactus Wrappers - Java EE 1.3
[INFO]   Cactus Wrappers - Java EE 1.4
[INFO]   Cactus Uberjars - Parent Project
[INFO]   Cactus Uberjar - Java EE 1.2
[INFO]   Cactus Uberjar - Java EE 1.3
[INFO]   Cactus Uberjar - Java EE 1.4
[INFO]   Cactus Uberjar - Java EE 1.5
[INFO]   Cactus Integration - Parent Project
[INFO]   Cactus Shared API for the integration
[INFO]   Cactus Ant Integration
[INFO]   Cactus Maven 1 Plugin
[INFO]   Cactus Integration Maven2 - Plugin Project
[INFO]   Cactus Eclipse Integration
[INFO]   Cactus Eclipse Integration - Webapp
[INFO]   Cactus Eclipse Integration - Runner
[INFO]   Cactus Samples - Parent Project
[INFO]   Apache Cactus
[INFO]   Cactus Site Skin
[INFO] ------------------------------------------------------------------------
[ERROR] BUILD ERROR
[INFO] ------------------------------------------------------------------------
[INFO] Error building POM (may not be this project's POM).


Project ID: org.apache.maven.plugins:maven-one-plugin

Reason: Error getting POM for 'org.apache.maven.plugins:maven-one-plugin' from the repository: Unable to read local copy of metadata: Cannot read metadata from '/export/home/hudson/.m2/repository/org/apache/maven/plugins/maven-one-plugin/1.3-SNAPSHOT/maven-metadata-local.xml': expected START_TAG or END_TAG not TEXT (position: TEXT seen ...<extension>jar</... @13:25) 
  org.apache.maven.plugins:maven-one-plugin:pom:1.3-SNAPSHOT

 for project org.apache.maven.plugins:maven-one-plugin


[INFO] ------------------------------------------------------------------------
[INFO] For more information, run Maven with the -e switch
[INFO] ------------------------------------------------------------------------
[INFO] Total time: 3 seconds
[INFO] Finished at: Mon Apr 11 20:04:16 EDT 2011
[INFO] Final Memory: 6M/184M
[INFO] ------------------------------------------------------------------------
channel stopped


---------------------------------------------------------------------
To unsubscribe, e-mail: notifications-unsubscribe@jakarta.apache.org
For additional commands, e-mail: notifications-help@jakarta.apache.org


Build failed in Jenkins: Cactus #795

Posted by Apache Hudson Server <hu...@hudson.apache.org>.
See <https://hudson.apache.org/hudson/job/Cactus/795/>

------------------------------------------
[...truncated 796 lines...]
[INFO] ------------------------------------------------------------------------
[INFO] [clean:clean]
[INFO] Deleting directory <https://hudson.apache.org/hudson/job/Cactus/ws/Cactus/integration/ant/target>
[INFO] [remote-resources:process {execution: default}]
[INFO] [resources:resources]
[WARNING] Using platform encoding (ANSI_X3.4-1968 actually) to copy filtered resources, i.e. build is platform dependent!
[INFO] Copying 1 resource
[INFO] Copying 3 resources
[INFO] [compiler:compile]
[INFO] Compiling 12 source files to <https://hudson.apache.org/hudson/job/Cactus/ws/Cactus/integration/ant/target/classes>
[INFO] [resources:testResources]
[WARNING] Using platform encoding (ANSI_X3.4-1968 actually) to copy filtered resources, i.e. build is platform dependent!
[INFO] skip non existing resourceDirectory <https://hudson.apache.org/hudson/job/Cactus/ws/Cactus/integration/ant/src/test/resources>
[INFO] Copying 3 resources
[INFO] [compiler:testCompile]
[INFO] Compiling 16 source files to <https://hudson.apache.org/hudson/job/Cactus/ws/Cactus/integration/ant/target/test-classes>
[INFO] [surefire:test]
[INFO] Surefire report directory: <https://hudson.apache.org/hudson/job/Cactus/ws/Cactus/integration/ant/target/surefire-reports>

-------------------------------------------------------
 T E S T S
-------------------------------------------------------
Running org.apache.cactus.integration.ant.deployment.TestJarArchive
Tests run: 5, Failures: 0, Errors: 0, Skipped: 0, Time elapsed: 0.088 sec
Running org.apache.cactus.integration.ant.TestCactusTask
Tests run: 7, Failures: 0, Errors: 0, Skipped: 0, Time elapsed: 0.459 sec
Running org.apache.cactus.integration.ant.deployment.TestAll
Tests run: 0, Failures: 0, Errors: 0, Skipped: 0, Time elapsed: 0.003 sec
Running org.apache.cactus.integration.ant.TestCactusTestTask
Tests run: 7, Failures: 0, Errors: 0, Skipped: 0, Time elapsed: 0.091 sec
Running org.apache.cactus.integration.ant.deployment.application.TestApplicationXmlVersion
Tests run: 8, Failures: 0, Errors: 0, Skipped: 0, Time elapsed: 0.028 sec
Running org.apache.cactus.integration.ant.deployment.TestEarParser
Tests run: 2, Failures: 0, Errors: 0, Skipped: 0, Time elapsed: 0.385 sec
Running org.apache.cactus.integration.ant.deployment.webapp.TestWebXml
Tests run: 54, Failures: 0, Errors: 0, Skipped: 0, Time elapsed: 0.201 sec
Running org.apache.cactus.integration.ant.TestAll
Tests run: 0, Failures: 0, Errors: 0, Skipped: 0, Time elapsed: 0.002 sec
Running org.apache.cactus.integration.ant.TestCactifyEarTask
Tests run: 3, Failures: 0, Errors: 0, Skipped: 0, Time elapsed: 0.648 sec
Running org.apache.cactus.integration.ant.deployment.webapp.TestWebXmlVersion
Tests run: 8, Failures: 0, Errors: 0, Skipped: 0, Time elapsed: 0.006 sec
Running org.apache.cactus.integration.ant.deployment.webapp.TestWarArchive
Tests run: 3, Failures: 0, Errors: 0, Skipped: 0, Time elapsed: 0.008 sec
Running org.apache.cactus.integration.ant.deployment.application.TestApplicationXml
Tests run: 7, Failures: 0, Errors: 0, Skipped: 0, Time elapsed: 0.015 sec
Running org.apache.cactus.integration.ant.TestRunServerTestsTask
Tests run: 6, Failures: 0, Errors: 0, Skipped: 0, Time elapsed: 0.536 sec
Running org.apache.cactus.integration.ant.TestCactifyWarTask
Tests run: 21, Failures: 0, Errors: 0, Skipped: 0, Time elapsed: 2.35 sec

Results :

Tests run: 131, Failures: 0, Errors: 0, Skipped: 0

[JENKINS] Recording test results
[INFO] [jar:jar]
[INFO] Building jar: <https://hudson.apache.org/hudson/job/Cactus/ws/Cactus/integration/ant/target/cactus.integration.ant-1.8.2-SNAPSHOT.jar>
[INFO] [rat:check {execution: default}]
[INFO] Preparing checkstyle:check
[JENKINS] Archiving <https://hudson.apache.org/hudson/job/Cactus/ws/Cactus/integration/ant/pom.xml> to /home/hudson/hudson/jobs/Cactus/modules/org.apache.cactus$cactus.integration.ant/builds/2011-04-11_00-03-42/archive/org.apache.cactus/cactus.integration.ant/1.8.2-SNAPSHOT/pom.xml
[JENKINS] Archiving <https://hudson.apache.org/hudson/job/Cactus/ws/Cactus/integration/ant/target/cactus.integration.ant-1.8.2-SNAPSHOT.jar> to /home/hudson/hudson/jobs/Cactus/modules/org.apache.cactus$cactus.integration.ant/builds/2011-04-11_00-03-42/archive/org.apache.cactus/cactus.integration.ant/1.8.2-SNAPSHOT/cactus.integration.ant-1.8.2-SNAPSHOT.jar
[INFO] [checkstyle:checkstyle]
[WARNING] File encoding has not been set, using platform encoding ANSI_X3.4-1968, i.e. build is platform dependent!
[INFO] Starting audit...
<https://hudson.apache.org/hudson/job/Cactus/ws/Cactus/integration/ant/src/main/java/org/apache/cactus/integration/ant/container/GenericContainer.java>:321:15: warning: Redundant 'final' modifier.
<https://hudson.apache.org/hudson/job/Cactus/ws/Cactus/integration/ant/src/main/java/org/apache/cactus/integration/ant/container/GenericContainer.java>:330:12: warning: Redundant 'final' modifier.
<https://hudson.apache.org/hudson/job/Cactus/ws/Cactus/integration/ant/src/main/java/org/apache/cactus/integration/ant/CactifyWarTask.java>:1: warning: Line does not match expected header line of '/* '.
<https://hudson.apache.org/hudson/job/Cactus/ws/Cactus/integration/ant/src/main/java/org/apache/cactus/integration/ant/CactifyWarTask.java>:74:20: warning: Name 'FILE_NAME' must match pattern '^[a-z][a-zA-Z0-9]*$'.
<https://hudson.apache.org/hudson/job/Cactus/ws/Cactus/integration/ant/src/main/java/org/apache/cactus/integration/ant/CactusTask.java>:95: warning: Comment matches to-do format 'TODO:'.
Audit done.

[INFO] [checkstyle:check {execution: default}]
[INFO] [install:install]
[INFO] Installing <https://hudson.apache.org/hudson/job/Cactus/ws/Cactus/integration/ant/target/cactus.integration.ant-1.8.2-SNAPSHOT.jar> to /home/hudson/.m2/repository/org/apache/cactus/cactus.integration.ant/1.8.2-SNAPSHOT/cactus.integration.ant-1.8.2-SNAPSHOT.jar
[INFO] ------------------------------------------------------------------------
[INFO] Building Cactus Maven 1 Plugin
[INFO]    task-segment: [clean, install]
[INFO] ------------------------------------------------------------------------
[INFO] [clean:clean]
[INFO] Deleting directory <https://hudson.apache.org/hudson/job/Cactus/ws/Cactus/integration/maven/target>
[INFO] [remote-resources:process {execution: default}]
[WARNING] Attempting to build MavenProject instance for Artifact (commons-jelly:commons-jelly:20030902.160215) of type: jar; constructing POM artifact instead.
[WARNING] Attempting to build MavenProject instance for Artifact (commons-discovery:commons-discovery:20030211.213356) of type: jar; constructing POM artifact instead.
[INFO] [resources:resources]
[WARNING] Using platform encoding (ANSI_X3.4-1968 actually) to copy filtered resources, i.e. build is platform dependent!
[INFO] skip non existing resourceDirectory <https://hudson.apache.org/hudson/job/Cactus/ws/Cactus/integration/maven/src/main/resources>
[INFO] Copying 3 resources
[INFO] [compiler:compile]
[INFO] Compiling 3 source files to <https://hudson.apache.org/hudson/job/Cactus/ws/Cactus/integration/maven/target/classes>
[INFO] [resources:testResources]
[WARNING] Using platform encoding (ANSI_X3.4-1968 actually) to copy filtered resources, i.e. build is platform dependent!
[INFO] skip non existing resourceDirectory <https://hudson.apache.org/hudson/job/Cactus/ws/Cactus/integration/maven/src/test/resources>
[INFO] Copying 3 resources
[INFO] [compiler:testCompile]
[INFO] No sources to compile
[INFO] [surefire:test]
[INFO] Surefire report directory: <https://hudson.apache.org/hudson/job/Cactus/ws/Cactus/integration/maven/target/surefire-reports>

-------------------------------------------------------
 T E S T S
-------------------------------------------------------
There are no tests to run.

Results :

Tests run: 0, Failures: 0, Errors: 0, Skipped: 0

[JENKINS] Recording test results
[INFO] snapshot org.apache.maven.shared:maven-model-converter:2.3-SNAPSHOT: checking for updates from apache.snapshots
[INFO] [one:maven-one-plugin]
[INFO] Building jar: <https://hudson.apache.org/hudson/job/Cactus/ws/Cactus/integration/maven/target/cactus.maven1.plugin-1.8.2-SNAPSHOT.jar>
[INFO] [rat:check {execution: default}]
[INFO] Preparing checkstyle:check
[JENKINS] Archiving <https://hudson.apache.org/hudson/job/Cactus/ws/Cactus/integration/maven/pom.xml> to /home/hudson/hudson/jobs/Cactus/modules/org.apache.cactus$cactus.maven1.plugin/builds/2011-04-11_00-03-42/archive/org.apache.cactus/cactus.maven1.plugin/1.8.2-SNAPSHOT/pom.xml
[JENKINS] Archiving <https://hudson.apache.org/hudson/job/Cactus/ws/Cactus/integration/maven/target/cactus.maven1.plugin-1.8.2-SNAPSHOT.jar> to /home/hudson/hudson/jobs/Cactus/modules/org.apache.cactus$cactus.maven1.plugin/builds/2011-04-11_00-03-42/archive/org.apache.cactus/cactus.maven1.plugin/1.8.2-SNAPSHOT/cactus.maven1.plugin-1.8.2-SNAPSHOT.jar
[INFO] [checkstyle:checkstyle]
[WARNING] File encoding has not been set, using platform encoding ANSI_X3.4-1968, i.e. build is platform dependent!
[INFO] Starting audit...
Audit done.

[INFO] [checkstyle:check {execution: default}]
[INFO] [install:install]
[INFO] Installing <https://hudson.apache.org/hudson/job/Cactus/ws/Cactus/integration/maven/target/cactus.maven1.plugin-1.8.2-SNAPSHOT.jar> to /home/hudson/.m2/repository/org/apache/cactus/cactus.maven1.plugin/1.8.2-SNAPSHOT/cactus.maven1.plugin-1.8.2-SNAPSHOT.jar
[INFO] [one:install-maven-one-repository {execution: default}]
[INFO] Installing <https://hudson.apache.org/hudson/job/Cactus/ws/Cactus/integration/maven/target/cactus.maven1.plugin-1.8.2-SNAPSHOT.jar> to /home/hudson/.maven/repository/org.apache.cactus/plugins/cactus.maven1.plugin-1.8.2-SNAPSHOT.jar
[INFO] ------------------------------------------------------------------------
[INFO] Building Cactus Integration Maven2 - Plugin Project
[INFO]    task-segment: [clean, install]
[INFO] ------------------------------------------------------------------------
[INFO] [clean:clean]
[INFO] Deleting directory <https://hudson.apache.org/hudson/job/Cactus/ws/Cactus/integration/maven2/target>
[INFO] [plugin:descriptor]
[WARNING] 

Goal prefix is specified as: 'cactus'. Maven currently expects it to be 'cactus.integration.2'.

[INFO] Using 2 extractors.
[INFO] Applying extractor for language: java
[INFO] Extractor for language: java found 2 mojo descriptors.
[INFO] Applying extractor for language: bsh
[INFO] Extractor for language: bsh found 0 mojo descriptors.
[INFO] [remote-resources:process {execution: default}]
[INFO] [resources:resources]
[WARNING] Using platform encoding (ANSI_X3.4-1968 actually) to copy filtered resources, i.e. build is platform dependent!
[INFO] skip non existing resourceDirectory <https://hudson.apache.org/hudson/job/Cactus/ws/Cactus/integration/maven2/src/main/resources>
[INFO] Copying 3 resources
[INFO] [compiler:compile]
[INFO] Compiling 7 source files to <https://hudson.apache.org/hudson/job/Cactus/ws/Cactus/integration/maven2/target/classes>
[INFO] [resources:testResources]
[WARNING] Using platform encoding (ANSI_X3.4-1968 actually) to copy filtered resources, i.e. build is platform dependent!
[INFO] Copying 10 resources
[INFO] Copying 3 resources
[INFO] [compiler:testCompile]
[INFO] Compiling 4 source files to <https://hudson.apache.org/hudson/job/Cactus/ws/Cactus/integration/maven2/target/test-classes>
[INFO] [surefire:test]
[INFO] Surefire report directory: <https://hudson.apache.org/hudson/job/Cactus/ws/Cactus/integration/maven2/target/surefire-reports>

-------------------------------------------------------
 T E S T S
-------------------------------------------------------
Running org.apache.cactus.integration.maven2.test.TestCactifyEarMojo
Tests run: 1, Failures: 0, Errors: 0, Skipped: 0, Time elapsed: 0.425 sec
Running org.apache.cactus.integration.maven2.test.TestCactifyWarMojo
[INFO] Analyzing war: <https://hudson.apache.org/hudson/job/Cactus/ws/Cactus/integration/maven2>:/null
Tests run: 4, Failures: 0, Errors: 0, Skipped: 0, Time elapsed: 0.603 sec

Results :

Tests run: 5, Failures: 0, Errors: 0, Skipped: 0

[JENKINS] Recording test results
[INFO] [jar:jar]
[INFO] Building jar: <https://hudson.apache.org/hudson/job/Cactus/ws/Cactus/integration/maven2/target/cactus.integration.maven2-1.8.2-SNAPSHOT.jar>
[INFO] [plugin:addPluginArtifactMetadata]
[INFO] [rat:check {execution: default}]
[INFO] Preparing checkstyle:check
[JENKINS] Archiving <https://hudson.apache.org/hudson/job/Cactus/ws/Cactus/integration/maven2/pom.xml> to /home/hudson/hudson/jobs/Cactus/modules/org.apache.cactus$cactus.integration.maven2/builds/2011-04-11_00-03-42/archive/org.apache.cactus/cactus.integration.maven2/1.8.2-SNAPSHOT/pom.xml
[JENKINS] Archiving <https://hudson.apache.org/hudson/job/Cactus/ws/Cactus/integration/maven2/target/cactus.integration.maven2-1.8.2-SNAPSHOT.jar> to /home/hudson/hudson/jobs/Cactus/modules/org.apache.cactus$cactus.integration.maven2/builds/2011-04-11_00-03-42/archive/org.apache.cactus/cactus.integration.maven2/1.8.2-SNAPSHOT/cactus.integration.maven2-1.8.2-SNAPSHOT.jar
[INFO] [checkstyle:checkstyle]
[WARNING] File encoding has not been set, using platform encoding ANSI_X3.4-1968, i.e. build is platform dependent!
[INFO] Starting audit...
<https://hudson.apache.org/hudson/job/Cactus/ws/Cactus/integration/maven2/src/main/java/org/apache/cactus/maven2/mojos/CactifyWarMojo.java>:80:20: warning: Name 'FILE_NAME' must match pattern '^[a-z][a-zA-Z0-9]*$'.
<https://hudson.apache.org/hudson/job/Cactus/ws/Cactus/integration/maven2/src/main/java/org/apache/cactus/maven2/mojos/CactifyWarMojo.java>:259:5: warning: Method length is 169 lines (max allowed is 150).
Audit done.

[INFO] [checkstyle:check {execution: default}]
[INFO] [install:install]
[INFO] Installing <https://hudson.apache.org/hudson/job/Cactus/ws/Cactus/integration/maven2/target/cactus.integration.maven2-1.8.2-SNAPSHOT.jar> to /home/hudson/.m2/repository/org/apache/cactus/cactus.integration.maven2/1.8.2-SNAPSHOT/cactus.integration.maven2-1.8.2-SNAPSHOT.jar
[INFO] [plugin:updateRegistry]
[INFO] ------------------------------------------------------------------------
[INFO] Building Cactus Eclipse Integration
[INFO]    task-segment: [clean, install]
[INFO] ------------------------------------------------------------------------
[INFO] [clean:clean]
[INFO] Deleting directory <https://hudson.apache.org/hudson/job/Cactus/ws/Cactus/integration/eclipse/target>
[INFO] [remote-resources:process {execution: default}]
[INFO] [site:attach-descriptor]
[INFO] [rat:check {execution: default}]
[INFO] Preparing checkstyle:check
[JENKINS] Archiving <https://hudson.apache.org/hudson/job/Cactus/ws/Cactus/integration/eclipse/pom.xml> to /home/hudson/hudson/jobs/Cactus/modules/org.apache.cactus$cactus.integration.eclipse/builds/2011-04-11_00-03-42/archive/org.apache.cactus/cactus.integration.eclipse/1.8.2-SNAPSHOT/pom.xml
[INFO] [checkstyle:checkstyle]
[INFO] Source directory does not exist - skipping report.
[INFO] [checkstyle:check {execution: default}]
[INFO] Unable to perform checkstyle:check, unable to find checkstyle:checkstyle outputFile.
[INFO] [install:install]
[INFO] Installing <https://hudson.apache.org/hudson/job/Cactus/ws/Cactus/integration/eclipse/pom.xml> to /home/hudson/.m2/repository/org/apache/cactus/cactus.integration.eclipse/1.8.2-SNAPSHOT/cactus.integration.eclipse-1.8.2-SNAPSHOT.pom
[INFO] ------------------------------------------------------------------------
[INFO] Building Cactus Eclipse Integration - Webapp
[INFO]    task-segment: [clean, install]
[INFO] ------------------------------------------------------------------------
[INFO] [clean:clean]
[INFO] artifact org.eclipse.jdt:ui: checking for updates from central
[INFO] artifact org.eclipse:osgi: checking for updates from central
[INFO] artifact org.eclipse.equinox:common: checking for updates from central
[INFO] artifact org.eclipse.core:jobs: checking for updates from central
[INFO] artifact org.eclipse.equinox:registry: checking for updates from central
[INFO] artifact org.eclipse.equinox:preferences: checking for updates from central
[INFO] artifact org.eclipse.core:contenttype: checking for updates from central
[INFO] artifact org.eclipse.equinox:app: checking for updates from central
[JENKINS] Archiving <https://hudson.apache.org/hudson/job/Cactus/ws/Cactus/integration/eclipse/org.apache.cactus.eclipse.webapp/pom.xml> to /home/hudson/hudson/jobs/Cactus/modules/org.apache.cactus$org.apache.cactus.eclipse.webapp/builds/2011-04-11_00-03-42/archive/org.apache.cactus/org.apache.cactus.eclipse.webapp/1.8.2-SNAPSHOT/pom.xml
[INFO] ------------------------------------------------------------------------
[ERROR] BUILD ERROR
[INFO] ------------------------------------------------------------------------
[INFO] Failed to resolve artifact.

Couldn't find a version in [1.0.0-v20070423, 1.0.0-v20070606] to match range [1.0.0,2.0.0)
  org.eclipse.equinox:app:jar:null

from the specified remote repositories:
  central (http://repo1.maven.org/maven2),
  maven.eclipse.plugin.repository (http://repo1.maven.org/eclipse/)

Path to dependency: 
	1) org.apache.cactus:org.apache.cactus.eclipse.webapp:jar:1.8.2-SNAPSHOT
	2) org.eclipse.jdt:ui:jar:3.3.0-v20070607-0010
	3) org.eclipse:ui:jar:3.3.0-I20070614-0800
	4) org.eclipse.core:runtime:jar:3.3.100-v20070530



[INFO] ------------------------------------------------------------------------
[INFO] For more information, run Maven with the -e switch
[INFO] ------------------------------------------------------------------------
[INFO] Total time: 2 minutes 34 seconds
[INFO] Finished at: Sun Apr 10 16:06:48 GMT-08:00 2011
[INFO] Final Memory: 57M/221M
[INFO] ------------------------------------------------------------------------
channel stopped


---------------------------------------------------------------------
To unsubscribe, e-mail: notifications-unsubscribe@jakarta.apache.org
For additional commands, e-mail: notifications-help@jakarta.apache.org


Build failed in Jenkins: Cactus #794

Posted by Apache Hudson Server <hu...@hudson.apache.org>.
See <https://hudson.apache.org/hudson/job/Cactus/794/>

------------------------------------------
[...truncated 800 lines...]
[INFO] [resources:resources]
[WARNING] Using platform encoding (ANSI_X3.4-1968 actually) to copy filtered resources, i.e. build is platform dependent!
[INFO] Copying 1 resource
[INFO] Copying 3 resources
[INFO] [compiler:compile]
[INFO] Compiling 12 source files to <https://hudson.apache.org/hudson/job/Cactus/ws/Cactus/integration/ant/target/classes>
[INFO] [resources:testResources]
[WARNING] Using platform encoding (ANSI_X3.4-1968 actually) to copy filtered resources, i.e. build is platform dependent!
[INFO] skip non existing resourceDirectory <https://hudson.apache.org/hudson/job/Cactus/ws/Cactus/integration/ant/src/test/resources>
[INFO] Copying 3 resources
[INFO] [compiler:testCompile]
[INFO] Compiling 16 source files to <https://hudson.apache.org/hudson/job/Cactus/ws/Cactus/integration/ant/target/test-classes>
[INFO] [surefire:test]
[INFO] Surefire report directory: <https://hudson.apache.org/hudson/job/Cactus/ws/Cactus/integration/ant/target/surefire-reports>

-------------------------------------------------------
 T E S T S
-------------------------------------------------------
Running org.apache.cactus.integration.ant.deployment.TestJarArchive
Tests run: 5, Failures: 0, Errors: 0, Skipped: 0, Time elapsed: 0.088 sec
Running org.apache.cactus.integration.ant.TestCactusTask
Tests run: 7, Failures: 0, Errors: 0, Skipped: 0, Time elapsed: 0.463 sec
Running org.apache.cactus.integration.ant.deployment.TestAll
Tests run: 0, Failures: 0, Errors: 0, Skipped: 0, Time elapsed: 0.003 sec
Running org.apache.cactus.integration.ant.TestCactusTestTask
Tests run: 7, Failures: 0, Errors: 0, Skipped: 0, Time elapsed: 0.11 sec
Running org.apache.cactus.integration.ant.deployment.application.TestApplicationXmlVersion
Tests run: 8, Failures: 0, Errors: 0, Skipped: 0, Time elapsed: 0.031 sec
Running org.apache.cactus.integration.ant.deployment.TestEarParser
Tests run: 2, Failures: 0, Errors: 0, Skipped: 0, Time elapsed: 0.117 sec
Running org.apache.cactus.integration.ant.deployment.webapp.TestWebXml
Tests run: 54, Failures: 0, Errors: 0, Skipped: 0, Time elapsed: 0.225 sec
Running org.apache.cactus.integration.ant.TestAll
Tests run: 0, Failures: 0, Errors: 0, Skipped: 0, Time elapsed: 0.002 sec
Running org.apache.cactus.integration.ant.TestCactifyEarTask
Tests run: 3, Failures: 0, Errors: 0, Skipped: 0, Time elapsed: 0.667 sec
Running org.apache.cactus.integration.ant.deployment.webapp.TestWebXmlVersion
Tests run: 8, Failures: 0, Errors: 0, Skipped: 0, Time elapsed: 0.007 sec
Running org.apache.cactus.integration.ant.deployment.webapp.TestWarArchive
Tests run: 3, Failures: 0, Errors: 0, Skipped: 0, Time elapsed: 0.008 sec
Running org.apache.cactus.integration.ant.deployment.application.TestApplicationXml
Tests run: 7, Failures: 0, Errors: 0, Skipped: 0, Time elapsed: 0.016 sec
Running org.apache.cactus.integration.ant.TestRunServerTestsTask
Tests run: 6, Failures: 0, Errors: 0, Skipped: 0, Time elapsed: 0.539 sec
Running org.apache.cactus.integration.ant.TestCactifyWarTask
Tests run: 21, Failures: 0, Errors: 0, Skipped: 0, Time elapsed: 2.332 sec

Results :

Tests run: 131, Failures: 0, Errors: 0, Skipped: 0

[JENKINS] Recording test results
[INFO] [jar:jar]
[INFO] Building jar: <https://hudson.apache.org/hudson/job/Cactus/ws/Cactus/integration/ant/target/cactus.integration.ant-1.8.2-SNAPSHOT.jar>
[INFO] [rat:check {execution: default}]
[INFO] Preparing checkstyle:check
[JENKINS] Archiving <https://hudson.apache.org/hudson/job/Cactus/ws/Cactus/integration/ant/pom.xml> to /home/hudson/hudson/jobs/Cactus/modules/org.apache.cactus$cactus.integration.ant/builds/2011-04-10_00-04-16/archive/org.apache.cactus/cactus.integration.ant/1.8.2-SNAPSHOT/pom.xml
[JENKINS] Archiving <https://hudson.apache.org/hudson/job/Cactus/ws/Cactus/integration/ant/target/cactus.integration.ant-1.8.2-SNAPSHOT.jar> to /home/hudson/hudson/jobs/Cactus/modules/org.apache.cactus$cactus.integration.ant/builds/2011-04-10_00-04-16/archive/org.apache.cactus/cactus.integration.ant/1.8.2-SNAPSHOT/cactus.integration.ant-1.8.2-SNAPSHOT.jar
[INFO] [checkstyle:checkstyle]
[WARNING] File encoding has not been set, using platform encoding ANSI_X3.4-1968, i.e. build is platform dependent!
[INFO] Starting audit...
<https://hudson.apache.org/hudson/job/Cactus/ws/Cactus/integration/ant/src/main/java/org/apache/cactus/integration/ant/container/GenericContainer.java>:321:15: warning: Redundant 'final' modifier.
<https://hudson.apache.org/hudson/job/Cactus/ws/Cactus/integration/ant/src/main/java/org/apache/cactus/integration/ant/container/GenericContainer.java>:330:12: warning: Redundant 'final' modifier.
<https://hudson.apache.org/hudson/job/Cactus/ws/Cactus/integration/ant/src/main/java/org/apache/cactus/integration/ant/CactifyWarTask.java>:1: warning: Line does not match expected header line of '/* '.
<https://hudson.apache.org/hudson/job/Cactus/ws/Cactus/integration/ant/src/main/java/org/apache/cactus/integration/ant/CactifyWarTask.java>:74:20: warning: Name 'FILE_NAME' must match pattern '^[a-z][a-zA-Z0-9]*$'.
<https://hudson.apache.org/hudson/job/Cactus/ws/Cactus/integration/ant/src/main/java/org/apache/cactus/integration/ant/CactusTask.java>:95: warning: Comment matches to-do format 'TODO:'.
Audit done.

[INFO] [checkstyle:check {execution: default}]
[INFO] [install:install]
[INFO] Installing <https://hudson.apache.org/hudson/job/Cactus/ws/Cactus/integration/ant/target/cactus.integration.ant-1.8.2-SNAPSHOT.jar> to /home/hudson/.m2/repository/org/apache/cactus/cactus.integration.ant/1.8.2-SNAPSHOT/cactus.integration.ant-1.8.2-SNAPSHOT.jar
[INFO] ------------------------------------------------------------------------
[INFO] Building Cactus Maven 1 Plugin
[INFO]    task-segment: [clean, install]
[INFO] ------------------------------------------------------------------------
[INFO] [clean:clean]
[INFO] Deleting directory <https://hudson.apache.org/hudson/job/Cactus/ws/Cactus/integration/maven/target>
[INFO] [remote-resources:process {execution: default}]
[WARNING] Attempting to build MavenProject instance for Artifact (commons-jelly:commons-jelly:20030902.160215) of type: jar; constructing POM artifact instead.
[WARNING] Attempting to build MavenProject instance for Artifact (commons-discovery:commons-discovery:20030211.213356) of type: jar; constructing POM artifact instead.
[INFO] [resources:resources]
[WARNING] Using platform encoding (ANSI_X3.4-1968 actually) to copy filtered resources, i.e. build is platform dependent!
[INFO] skip non existing resourceDirectory <https://hudson.apache.org/hudson/job/Cactus/ws/Cactus/integration/maven/src/main/resources>
[INFO] Copying 3 resources
[INFO] [compiler:compile]
[INFO] Compiling 3 source files to <https://hudson.apache.org/hudson/job/Cactus/ws/Cactus/integration/maven/target/classes>
[INFO] [resources:testResources]
[WARNING] Using platform encoding (ANSI_X3.4-1968 actually) to copy filtered resources, i.e. build is platform dependent!
[INFO] skip non existing resourceDirectory <https://hudson.apache.org/hudson/job/Cactus/ws/Cactus/integration/maven/src/test/resources>
[INFO] Copying 3 resources
[INFO] [compiler:testCompile]
[INFO] No sources to compile
[INFO] [surefire:test]
[INFO] Surefire report directory: <https://hudson.apache.org/hudson/job/Cactus/ws/Cactus/integration/maven/target/surefire-reports>

-------------------------------------------------------
 T E S T S
-------------------------------------------------------
There are no tests to run.

Results :

Tests run: 0, Failures: 0, Errors: 0, Skipped: 0

[JENKINS] Recording test results[INFO] snapshot org.apache.maven.shared:maven-model-converter:2.3-SNAPSHOT: checking for updates from apache.snapshots

Downloading: http://repository.apache.org/snapshots/org/apache/maven/shared/maven-model-converter/2.3-SNAPSHOT/maven-model-converter-2.3-20110408.091812-30.pom
3K downloaded
Downloading: http://repository.apache.org/snapshots/org/apache/maven/shared/maven-model-converter/2.3-SNAPSHOT/maven-model-converter-2.3-20110408.091812-30.jar
72K downloaded
[INFO] [one:maven-one-plugin]
[INFO] Building jar: <https://hudson.apache.org/hudson/job/Cactus/ws/Cactus/integration/maven/target/cactus.maven1.plugin-1.8.2-SNAPSHOT.jar>
[INFO] [rat:check {execution: default}]
[INFO] Preparing checkstyle:check
[JENKINS] Archiving <https://hudson.apache.org/hudson/job/Cactus/ws/Cactus/integration/maven/pom.xml> to /home/hudson/hudson/jobs/Cactus/modules/org.apache.cactus$cactus.maven1.plugin/builds/2011-04-10_00-04-16/archive/org.apache.cactus/cactus.maven1.plugin/1.8.2-SNAPSHOT/pom.xml
[JENKINS] Archiving <https://hudson.apache.org/hudson/job/Cactus/ws/Cactus/integration/maven/target/cactus.maven1.plugin-1.8.2-SNAPSHOT.jar> to /home/hudson/hudson/jobs/Cactus/modules/org.apache.cactus$cactus.maven1.plugin/builds/2011-04-10_00-04-16/archive/org.apache.cactus/cactus.maven1.plugin/1.8.2-SNAPSHOT/cactus.maven1.plugin-1.8.2-SNAPSHOT.jar
[INFO] [checkstyle:checkstyle]
[WARNING] File encoding has not been set, using platform encoding ANSI_X3.4-1968, i.e. build is platform dependent!
[INFO] Starting audit...
Audit done.

[INFO] [checkstyle:check {execution: default}]
[INFO] [install:install]
[INFO] Installing <https://hudson.apache.org/hudson/job/Cactus/ws/Cactus/integration/maven/target/cactus.maven1.plugin-1.8.2-SNAPSHOT.jar> to /home/hudson/.m2/repository/org/apache/cactus/cactus.maven1.plugin/1.8.2-SNAPSHOT/cactus.maven1.plugin-1.8.2-SNAPSHOT.jar
[INFO] [one:install-maven-one-repository {execution: default}]
[INFO] Installing <https://hudson.apache.org/hudson/job/Cactus/ws/Cactus/integration/maven/target/cactus.maven1.plugin-1.8.2-SNAPSHOT.jar> to /home/hudson/.maven/repository/org.apache.cactus/plugins/cactus.maven1.plugin-1.8.2-SNAPSHOT.jar
[INFO] ------------------------------------------------------------------------
[INFO] Building Cactus Integration Maven2 - Plugin Project
[INFO]    task-segment: [clean, install]
[INFO] ------------------------------------------------------------------------
[INFO] [clean:clean]
[INFO] Deleting directory <https://hudson.apache.org/hudson/job/Cactus/ws/Cactus/integration/maven2/target>
[INFO] [plugin:descriptor]
[WARNING] 

Goal prefix is specified as: 'cactus'. Maven currently expects it to be 'cactus.integration.2'.

[INFO] Using 2 extractors.
[INFO] Applying extractor for language: java
[INFO] Extractor for language: java found 2 mojo descriptors.
[INFO] Applying extractor for language: bsh
[INFO] Extractor for language: bsh found 0 mojo descriptors.
[INFO] [remote-resources:process {execution: default}]
[INFO] [resources:resources]
[WARNING] Using platform encoding (ANSI_X3.4-1968 actually) to copy filtered resources, i.e. build is platform dependent!
[INFO] skip non existing resourceDirectory <https://hudson.apache.org/hudson/job/Cactus/ws/Cactus/integration/maven2/src/main/resources>
[INFO] Copying 3 resources
[INFO] [compiler:compile]
[INFO] Compiling 7 source files to <https://hudson.apache.org/hudson/job/Cactus/ws/Cactus/integration/maven2/target/classes>
[INFO] [resources:testResources]
[WARNING] Using platform encoding (ANSI_X3.4-1968 actually) to copy filtered resources, i.e. build is platform dependent!
[INFO] Copying 10 resources
[INFO] Copying 3 resources
[INFO] [compiler:testCompile]
[INFO] Compiling 4 source files to <https://hudson.apache.org/hudson/job/Cactus/ws/Cactus/integration/maven2/target/test-classes>
[INFO] [surefire:test]
[INFO] Surefire report directory: <https://hudson.apache.org/hudson/job/Cactus/ws/Cactus/integration/maven2/target/surefire-reports>

-------------------------------------------------------
 T E S T S
-------------------------------------------------------
Running org.apache.cactus.integration.maven2.test.TestCactifyEarMojo
Tests run: 1, Failures: 0, Errors: 0, Skipped: 0, Time elapsed: 0.424 sec
Running org.apache.cactus.integration.maven2.test.TestCactifyWarMojo
[INFO] Analyzing war: <https://hudson.apache.org/hudson/job/Cactus/ws/Cactus/integration/maven2>:/null
Tests run: 4, Failures: 0, Errors: 0, Skipped: 0, Time elapsed: 0.708 sec

Results :

Tests run: 5, Failures: 0, Errors: 0, Skipped: 0

[JENKINS] Recording test results
[INFO] [jar:jar]
[INFO] Building jar: <https://hudson.apache.org/hudson/job/Cactus/ws/Cactus/integration/maven2/target/cactus.integration.maven2-1.8.2-SNAPSHOT.jar>
[INFO] [plugin:addPluginArtifactMetadata]
[INFO] [rat:check {execution: default}]
[INFO] Preparing checkstyle:check
[JENKINS] Archiving <https://hudson.apache.org/hudson/job/Cactus/ws/Cactus/integration/maven2/pom.xml> to /home/hudson/hudson/jobs/Cactus/modules/org.apache.cactus$cactus.integration.maven2/builds/2011-04-10_00-04-16/archive/org.apache.cactus/cactus.integration.maven2/1.8.2-SNAPSHOT/pom.xml
[JENKINS] Archiving <https://hudson.apache.org/hudson/job/Cactus/ws/Cactus/integration/maven2/target/cactus.integration.maven2-1.8.2-SNAPSHOT.jar> to /home/hudson/hudson/jobs/Cactus/modules/org.apache.cactus$cactus.integration.maven2/builds/2011-04-10_00-04-16/archive/org.apache.cactus/cactus.integration.maven2/1.8.2-SNAPSHOT/cactus.integration.maven2-1.8.2-SNAPSHOT.jar
[INFO] [checkstyle:checkstyle]
[WARNING] File encoding has not been set, using platform encoding ANSI_X3.4-1968, i.e. build is platform dependent!
[INFO] Starting audit...
<https://hudson.apache.org/hudson/job/Cactus/ws/Cactus/integration/maven2/src/main/java/org/apache/cactus/maven2/mojos/CactifyWarMojo.java>:80:20: warning: Name 'FILE_NAME' must match pattern '^[a-z][a-zA-Z0-9]*$'.
<https://hudson.apache.org/hudson/job/Cactus/ws/Cactus/integration/maven2/src/main/java/org/apache/cactus/maven2/mojos/CactifyWarMojo.java>:259:5: warning: Method length is 169 lines (max allowed is 150).
Audit done.

[INFO] [checkstyle:check {execution: default}]
[INFO] [install:install]
[INFO] Installing <https://hudson.apache.org/hudson/job/Cactus/ws/Cactus/integration/maven2/target/cactus.integration.maven2-1.8.2-SNAPSHOT.jar> to /home/hudson/.m2/repository/org/apache/cactus/cactus.integration.maven2/1.8.2-SNAPSHOT/cactus.integration.maven2-1.8.2-SNAPSHOT.jar
[INFO] [plugin:updateRegistry]
[INFO] ------------------------------------------------------------------------
[INFO] Building Cactus Eclipse Integration
[INFO]    task-segment: [clean, install]
[INFO] ------------------------------------------------------------------------
[INFO] [clean:clean]
[INFO] Deleting directory <https://hudson.apache.org/hudson/job/Cactus/ws/Cactus/integration/eclipse/target>
[INFO] [remote-resources:process {execution: default}]
[INFO] [site:attach-descriptor]
[INFO] [rat:check {execution: default}]
[INFO] Preparing checkstyle:check
[JENKINS] Archiving <https://hudson.apache.org/hudson/job/Cactus/ws/Cactus/integration/eclipse/pom.xml> to /home/hudson/hudson/jobs/Cactus/modules/org.apache.cactus$cactus.integration.eclipse/builds/2011-04-10_00-04-16/archive/org.apache.cactus/cactus.integration.eclipse/1.8.2-SNAPSHOT/pom.xml
[INFO] [checkstyle:checkstyle]
[INFO] Source directory does not exist - skipping report.
[INFO] [checkstyle:check {execution: default}]
[INFO] Unable to perform checkstyle:check, unable to find checkstyle:checkstyle outputFile.
[INFO] [install:install]
[INFO] Installing <https://hudson.apache.org/hudson/job/Cactus/ws/Cactus/integration/eclipse/pom.xml> to /home/hudson/.m2/repository/org/apache/cactus/cactus.integration.eclipse/1.8.2-SNAPSHOT/cactus.integration.eclipse-1.8.2-SNAPSHOT.pom
[INFO] ------------------------------------------------------------------------
[INFO] Building Cactus Eclipse Integration - Webapp
[INFO]    task-segment: [clean, install]
[INFO] ------------------------------------------------------------------------
[INFO] [clean:clean]
[INFO] artifact org.eclipse.jdt:ui: checking for updates from central
[INFO] artifact org.eclipse:osgi: checking for updates from central
[INFO] artifact org.eclipse.equinox:common: checking for updates from central
[INFO] artifact org.eclipse.core:jobs: checking for updates from central
[INFO] artifact org.eclipse.equinox:registry: checking for updates from central
[INFO] artifact org.eclipse.equinox:preferences: checking for updates from central
[INFO] artifact org.eclipse.core:contenttype: checking for updates from central
[INFO] artifact org.eclipse.equinox:app: checking for updates from central
[JENKINS] Archiving <https://hudson.apache.org/hudson/job/Cactus/ws/Cactus/integration/eclipse/org.apache.cactus.eclipse.webapp/pom.xml> to /home/hudson/hudson/jobs/Cactus/modules/org.apache.cactus$org.apache.cactus.eclipse.webapp/builds/2011-04-10_00-04-16/archive/org.apache.cactus/org.apache.cactus.eclipse.webapp/1.8.2-SNAPSHOT/pom.xml
[INFO] ------------------------------------------------------------------------
[ERROR] BUILD ERROR
[INFO] ------------------------------------------------------------------------
[INFO] Failed to resolve artifact.

Couldn't find a version in [1.0.0-v20070423, 1.0.0-v20070606] to match range [1.0.0,2.0.0)
  org.eclipse.equinox:app:jar:null

from the specified remote repositories:
  central (http://repo1.maven.org/maven2),
  maven.eclipse.plugin.repository (http://repo1.maven.org/eclipse/)

Path to dependency: 
	1) org.apache.cactus:org.apache.cactus.eclipse.webapp:jar:1.8.2-SNAPSHOT
	2) org.eclipse.jdt:ui:jar:3.3.0-v20070607-0010
	3) org.eclipse:ui:jar:3.3.0-I20070614-0800
	4) org.eclipse.core:runtime:jar:3.3.100-v20070530



[INFO] ------------------------------------------------------------------------
[INFO] For more information, run Maven with the -e switch
[INFO] ------------------------------------------------------------------------
[INFO] Total time: 2 minutes 27 seconds
[INFO] Finished at: Sat Apr 09 16:07:12 GMT-08:00 2011
[INFO] Final Memory: 57M/221M
[INFO] ------------------------------------------------------------------------
channel stopped


---------------------------------------------------------------------
To unsubscribe, e-mail: notifications-unsubscribe@jakarta.apache.org
For additional commands, e-mail: notifications-help@jakarta.apache.org


Build failed in Jenkins: Cactus #793

Posted by Apache Hudson Server <hu...@hudson.apache.org>.
See <https://hudson.apache.org/hudson/job/Cactus/793/>

------------------------------------------
Started by timer
Building remotely on ubuntu1
Updating http://svn.apache.org/repos/asf/jakarta/cactus/trunk
At revision 1090492
no change for http://svn.apache.org/repos/asf/jakarta/cactus/trunk since the previous build
Found mavenVersion 2.0.10 from file jar:file:/home/hudson/tools/maven/latest2/lib/maven-2.0.10-uber.jar!/META-INF/maven/org.apache.maven/maven-core/pom.properties
Parsing POMs
ERROR: Processing failed due to a bug in the code. Please report this to jenkins-users@googlegroups.com
java.lang.ClassCastException: cannot assign instance of hudson.model.StreamBuildListener to field hudson.maven.MavenModuleSetBuild$PomParser.listener of type hudson.model.BuildListener in instance of hudson.maven.MavenModuleSetBuild$PomParser
	at java.io.ObjectStreamClass$FieldReflector.setObjFieldValues(ObjectStreamClass.java:2056)
	at java.io.ObjectStreamClass.setObjFieldValues(ObjectStreamClass.java:1229)
	at java.io.ObjectInputStream.defaultReadFields(ObjectInputStream.java:1969)
	at java.io.ObjectInputStream.readSerialData(ObjectInputStream.java:1887)
	at java.io.ObjectInputStream.readOrdinaryObject(ObjectInputStream.java:1770)
	at java.io.ObjectInputStream.readObject0(ObjectInputStream.java:1346)
	at java.io.ObjectInputStream.defaultReadFields(ObjectInputStream.java:1963)
	at java.io.ObjectInputStream.readSerialData(ObjectInputStream.java:1887)
	at java.io.ObjectInputStream.readOrdinaryObject(ObjectInputStream.java:1770)
	at java.io.ObjectInputStream.readObject0(ObjectInputStream.java:1346)
	at java.io.ObjectInputStream.readObject(ObjectInputStream.java:368)
	at hudson.remoting.UserRequest.deserialize(UserRequest.java:178)
	at hudson.remoting.UserRequest.perform(UserRequest.java:98)
	at hudson.remoting.UserRequest.perform(UserRequest.java:48)
	at hudson.remoting.Request$2.run(Request.java:270)
	at java.util.concurrent.Executors$RunnableAdapter.call(Executors.java:471)
	at java.util.concurrent.FutureTask$Sync.innerRun(FutureTask.java:334)
	at java.util.concurrent.FutureTask.run(FutureTask.java:166)
	at java.util.concurrent.ThreadPoolExecutor.runWorker(ThreadPoolExecutor.java:1110)
	at java.util.concurrent.ThreadPoolExecutor$Worker.run(ThreadPoolExecutor.java:603)
	at java.lang.Thread.run(Thread.java:636)
project=hudson.maven.MavenModuleSet@1efb2d90[Cactus]
project.getModules()=[hudson.maven.MavenModule@5b36cbd0[Cactus/org.apache.cactus:cactus][Cactus/org.apache.cactus:cactus][relativePath:], hudson.maven.MavenModule@715387c8[Cactus/org.apache.cactus:cactus-site][Cactus/org.apache.cactus:cactus-site][relativePath:cactus-site], hudson.maven.MavenModule@49606c14[Cactus/org.apache.cactus:cactus.build.tools][Cactus/org.apache.cactus:cactus.build.tools][relativePath:build-tools], hudson.maven.MavenModule@6e084dd9[Cactus/org.apache.cactus:cactus.core.framework][Cactus/org.apache.cactus:cactus.core.framework][relativePath:framework], hudson.maven.MavenModule@5c1c49d4[Cactus/org.apache.cactus:cactus.core.framework.javaEE.12-13-14][Cactus/org.apache.cactus:cactus.core.framework.javaEE.12-13-14][relativePath:framework/framework-12-13-14], hudson.maven.MavenModule@24158c28[Cactus/org.apache.cactus:cactus.core.framework.javaEE.13-14][Cactus/org.apache.cactus:cactus.core.framework.javaEE.13-14][relativePath:framework/framework-13-14], hudson.maven.MavenModule@208ee9c9[Cactus/org.apache.cactus:cactus.core.framework.uberjar.javaEE.12][Cactus/org.apache.cactus:cactus.core.framework.uberjar.javaEE.12][relativePath:framework/framework-uberjars/javaEE-12-uberjar], hudson.maven.MavenModule@58342475[Cactus/org.apache.cactus:cactus.core.framework.uberjar.javaEE.13][Cactus/org.apache.cactus:cactus.core.framework.uberjar.javaEE.13][relativePath:framework/framework-uberjars/javaEE-13-uberjar], hudson.maven.MavenModule@580ddf89[Cactus/org.apache.cactus:cactus.core.framework.uberjar.javaEE.14][Cactus/org.apache.cactus:cactus.core.framework.uberjar.javaEE.14][relativePath:framework/framework-uberjars/javaEE-14-uberjar], hudson.maven.MavenModule@1621a02b[Cactus/org.apache.cactus:cactus.core.framework.uberjar.javaEE.15][Cactus/org.apache.cactus:cactus.core.framework.uberjar.javaEE.15][relativePath:framework/framework-uberjars/javaEE-15-uberjar], hudson.maven.MavenModule@6048cca4[Cactus/org.apache.cactus:cactus.core.framework.uberjars][Cactus/org.apache.cactus:cactus.core.framework.uberjars][relativePath:framework/framework-uberjars], hudson.maven.MavenModule@56882e24[Cactus/org.apache.cactus:cactus.core.framework.wrapper.javaEE.12][Cactus/org.apache.cactus:cactus.core.framework.wrapper.javaEE.12][relativePath:framework/framework-wrappers/wrapper-javaEE-12], hudson.maven.MavenModule@7594035c[Cactus/org.apache.cactus:cactus.core.framework.wrapper.javaEE.13][Cactus/org.apache.cactus:cactus.core.framework.wrapper.javaEE.13][relativePath:framework/framework-wrappers/wrapper-javaEE-13], hudson.maven.MavenModule@1e3c1a28[Cactus/org.apache.cactus:cactus.core.framework.wrapper.javaEE.14][Cactus/org.apache.cactus:cactus.core.framework.wrapper.javaEE.14][relativePath:framework/framework-wrappers/wrapper-javaEE-14], hudson.maven.MavenModule@7ff24292[Cactus/org.apache.cactus:cactus.core.framework.wrappers][Cactus/org.apache.cactus:cactus.core.framework.wrappers][relativePath:framework/framework-wrappers], hudson.maven.MavenModule@237c8a9c[Cactus/org.apache.cactus:cactus.integration][Cactus/org.apache.cactus:cactus.integration][relativePath:integration], hudson.maven.MavenModule@32da5a84[Cactus/org.apache.cactus:cactus.integration.ant][Cactus/org.apache.cactus:cactus.integration.ant][relativePath:integration/ant], hudson.maven.MavenModule@1758ba40[Cactus/org.apache.cactus:cactus.integration.eclipse][Cactus/org.apache.cactus:cactus.integration.eclipse][relativePath:integration/eclipse], hudson.maven.MavenModule@4937c653[Cactus/org.apache.cactus:cactus.integration.maven2][Cactus/org.apache.cactus:cactus.integration.maven2][relativePath:integration/maven2], hudson.maven.MavenModule@4446d7c4[Cactus/org.apache.cactus:cactus.integration.shared.api][Cactus/org.apache.cactus:cactus.integration.shared.api][relativePath:integration/shared-api], hudson.maven.MavenModule@795ee430[Cactus/org.apache.cactus:cactus.maven.skin][Cactus/org.apache.cactus:cactus.maven.skin][relativePath:cactus-maven-skin], hudson.maven.MavenModule@591c486a[Cactus/org.apache.cactus:cactus.maven1.plugin][Cactus/org.apache.cactus:cactus.maven1.plugin][relativePath:integration/maven], hudson.maven.MavenModule@55aa7971[Cactus/org.apache.cactus:cactus.samples][Cactus/org.apache.cactus:cactus.samples][relativePath:samples], hudson.maven.MavenModule@18d35e27[Cactus/org.apache.cactus:org.apache.cactus.eclipse.runner][Cactus/org.apache.cactus:org.apache.cactus.eclipse.runner][relativePath:integration/eclipse/org.apache.cactus.eclipse.runner], hudson.maven.MavenModule@83602ca[Cactus/org.apache.cactus:org.apache.cactus.eclipse.webapp][Cactus/org.apache.cactus:org.apache.cactus.eclipse.webapp][relativePath:integration/eclipse/org.apache.cactus.eclipse.webapp]]
project.getRootModule()=hudson.maven.MavenModule@5b36cbd0[Cactus/org.apache.cactus:cactus][Cactus/org.apache.cactus:cactus][relativePath:]
FATAL: cannot assign instance of hudson.model.StreamBuildListener to field hudson.maven.MavenModuleSetBuild$PomParser.listener of type hudson.model.BuildListener in instance of hudson.maven.MavenModuleSetBuild$PomParser
java.lang.ClassCastException: cannot assign instance of hudson.model.StreamBuildListener to field hudson.maven.MavenModuleSetBuild$PomParser.listener of type hudson.model.BuildListener in instance of hudson.maven.MavenModuleSetBuild$PomParser
	at java.io.ObjectStreamClass$FieldReflector.setObjFieldValues(ObjectStreamClass.java:2056)
	at java.io.ObjectStreamClass.setObjFieldValues(ObjectStreamClass.java:1229)
	at java.io.ObjectInputStream.defaultReadFields(ObjectInputStream.java:1969)
	at java.io.ObjectInputStream.readSerialData(ObjectInputStream.java:1887)
	at java.io.ObjectInputStream.readOrdinaryObject(ObjectInputStream.java:1770)
	at java.io.ObjectInputStream.readObject0(ObjectInputStream.java:1346)
	at java.io.ObjectInputStream.defaultReadFields(ObjectInputStream.java:1963)
	at java.io.ObjectInputStream.readSerialData(ObjectInputStream.java:1887)
	at java.io.ObjectInputStream.readOrdinaryObject(ObjectInputStream.java:1770)
	at java.io.ObjectInputStream.readObject0(ObjectInputStream.java:1346)
	at java.io.ObjectInputStream.readObject(ObjectInputStream.java:368)
	at hudson.remoting.UserRequest.deserialize(UserRequest.java:178)
	at hudson.remoting.UserRequest.perform(UserRequest.java:98)
	at hudson.remoting.UserRequest.perform(UserRequest.java:48)
	at hudson.remoting.Request$2.run(Request.java:270)
	at java.util.concurrent.Executors$RunnableAdapter.call(Executors.java:471)
	at java.util.concurrent.FutureTask$Sync.innerRun(FutureTask.java:334)
	at java.util.concurrent.FutureTask.run(FutureTask.java:166)
	at java.util.concurrent.ThreadPoolExecutor.runWorker(ThreadPoolExecutor.java:1110)
	at java.util.concurrent.ThreadPoolExecutor$Worker.run(ThreadPoolExecutor.java:603)
	at java.lang.Thread.run(Thread.java:636)


---------------------------------------------------------------------
To unsubscribe, e-mail: notifications-unsubscribe@jakarta.apache.org
For additional commands, e-mail: notifications-help@jakarta.apache.org


Build failed in Jenkins: Cactus #792

Posted by Apache Hudson Server <hu...@hudson.apache.org>.
See <https://hudson.apache.org/hudson/job/Cactus/792/>

------------------------------------------
Started by timer
Building remotely on solaris2
Updating http://svn.apache.org/repos/asf/jakarta/cactus/trunk
At revision 1090065
no change for http://svn.apache.org/repos/asf/jakarta/cactus/trunk since the previous build
Found mavenVersion 2.0.9 from file jar:file:/home/hudson/tools/maven/latest2/lib/maven-2.0.9-uber.jar!/META-INF/maven/org.apache.maven/maven-core/pom.properties
Parsing POMs
[Cactus] $ /home/hudson/tools/java/latest1.5/bin/java -cp /home/hudson/hudson-slave/maven-agent.jar:/home/hudson/hudson-slave/classworlds.jar hudson.maven.agent.Main /home/hudson/tools/maven/latest2 /zonestorage/hudson/home/hudson/hudson-slave/slave.jar /home/hudson/hudson-slave/maven-interceptor.jar 52531
<===[HUDSON REMOTING CAPACITY]===>   channel started
[INFO] Scanning for projects...
Executing Maven:  -B -f <https://hudson.apache.org/hudson/job/Cactus/ws/Cactus/pom.xml> clean install
[INFO] Reactor build order: 
[INFO]   Cactus Parent Project
[INFO]   Cactus Build Tools
[INFO]   Cactus Framework - Parent Project
[INFO]   Cactus Framework - shared all versions
[INFO]   Cactus Framework - shared Java EE 1.3 and 1.4
[INFO]   Cactus Wrappers - Parent Project
[INFO]   Cactus Wrappers - Java EE 1.2
[INFO]   Cactus Wrappers - Java EE 1.3
[INFO]   Cactus Wrappers - Java EE 1.4
[INFO]   Cactus Uberjars - Parent Project
[INFO]   Cactus Uberjar - Java EE 1.2
[INFO]   Cactus Uberjar - Java EE 1.3
[INFO]   Cactus Uberjar - Java EE 1.4
[INFO]   Cactus Uberjar - Java EE 1.5
[INFO]   Cactus Integration - Parent Project
[INFO]   Cactus Shared API for the integration
[INFO]   Cactus Ant Integration
[INFO]   Cactus Maven 1 Plugin
[INFO]   Cactus Integration Maven2 - Plugin Project
[INFO]   Cactus Eclipse Integration
[INFO]   Cactus Eclipse Integration - Webapp
[INFO]   Cactus Eclipse Integration - Runner
[INFO]   Cactus Samples - Parent Project
[INFO]   Apache Cactus
[INFO]   Cactus Site Skin
[INFO] ------------------------------------------------------------------------
[ERROR] BUILD ERROR
[INFO] ------------------------------------------------------------------------
[INFO] Error building POM (may not be this project's POM).


Project ID: org.apache.maven.plugins:maven-one-plugin

Reason: Error getting POM for 'org.apache.maven.plugins:maven-one-plugin' from the repository: Unable to read local copy of metadata: Cannot read metadata from '/export/home/hudson/.m2/repository/org/apache/maven/plugins/maven-one-plugin/1.3-SNAPSHOT/maven-metadata-local.xml': expected START_TAG or END_TAG not TEXT (position: TEXT seen ...<extension>jar</... @13:25) 
  org.apache.maven.plugins:maven-one-plugin:pom:1.3-SNAPSHOT

 for project org.apache.maven.plugins:maven-one-plugin


[INFO] ------------------------------------------------------------------------
[INFO] For more information, run Maven with the -e switch
[INFO] ------------------------------------------------------------------------
[INFO] Total time: 1 second
[INFO] Finished at: Thu Apr 07 20:02:22 EDT 2011
[INFO] Final Memory: 6M/184M
[INFO] ------------------------------------------------------------------------
channel stopped


---------------------------------------------------------------------
To unsubscribe, e-mail: notifications-unsubscribe@jakarta.apache.org
For additional commands, e-mail: notifications-help@jakarta.apache.org