You are viewing a plain text version of this content. The canonical link for it is here.
Posted to builds@beam.apache.org by Apache Jenkins Server <je...@builds.apache.org> on 2023/02/25 09:53:44 UTC

Build failed in Jenkins: beam_PostCommit_Python39 #1507

See <https://ci-beam.apache.org/job/beam_PostCommit_Python39/1507/display/redirect>

Changes:


------------------------------------------
[...truncated 10.80 MB...]
apache_beam/typehints/pandas_type_compatibility_test.py:91
apache_beam/typehints/pandas_type_compatibility_test.py:91
  <https://ci-beam.apache.org/job/beam_PostCommit_Python39/ws/src/sdks/python/apache_beam/typehints/pandas_type_compatibility_test.py>:91: FutureWarning: pandas.Int64Index is deprecated and will be removed from pandas in a future version. Use pandas.Index with the appropriate dtype instead.
    pd.Int64Index(range(475, 575), name='another_index'),

apache_beam/dataframe/io_it_test.py: 3 warnings
apache_beam/examples/cookbook/bigquery_tornadoes_it_test.py: 1 warning
apache_beam/io/gcp/big_query_query_to_table_it_test.py: 4 warnings
apache_beam/examples/dataframe/flight_delays_it_test.py: 1 warning
apache_beam/io/gcp/bigquery_io_read_it_test.py: 2 warnings
apache_beam/io/gcp/bigquery_read_it_test.py: 7 warnings
apache_beam/io/gcp/bigquery_json_it_test.py: 3 warnings
  <https://ci-beam.apache.org/job/beam_PostCommit_Python39/ws/src/sdks/python/apache_beam/io/gcp/bigquery.py>:2485: BeamDeprecationWarning: options is deprecated since First stable release. References to <pipeline>.options will not be supported
    temp_location = pcoll.pipeline.options.view_as(

apache_beam/dataframe/io_it_test.py: 3 warnings
apache_beam/examples/cookbook/bigquery_tornadoes_it_test.py: 1 warning
apache_beam/io/gcp/big_query_query_to_table_it_test.py: 4 warnings
apache_beam/examples/dataframe/flight_delays_it_test.py: 1 warning
apache_beam/io/gcp/bigquery_io_read_it_test.py: 2 warnings
apache_beam/io/gcp/bigquery_read_it_test.py: 7 warnings
apache_beam/io/gcp/bigquery_json_it_test.py: 3 warnings
  <https://ci-beam.apache.org/job/beam_PostCommit_Python39/ws/src/sdks/python/apache_beam/io/gcp/bigquery.py>:2487: BeamDeprecationWarning: options is deprecated since First stable release. References to <pipeline>.options will not be supported
    job_name = pcoll.pipeline.options.view_as(GoogleCloudOptions).job_name

apache_beam/dataframe/io_it_test.py: 3 warnings
apache_beam/examples/cookbook/bigquery_tornadoes_it_test.py: 1 warning
apache_beam/io/gcp/big_query_query_to_table_it_test.py: 4 warnings
apache_beam/examples/dataframe/flight_delays_it_test.py: 1 warning
apache_beam/io/gcp/bigquery_io_read_it_test.py: 2 warnings
apache_beam/io/gcp/bigquery_read_it_test.py: 7 warnings
apache_beam/io/gcp/bigquery_json_it_test.py: 3 warnings
  <https://ci-beam.apache.org/job/beam_PostCommit_Python39/ws/src/sdks/python/apache_beam/io/gcp/bigquery.py>:2511: BeamDeprecationWarning: options is deprecated since First stable release. References to <pipeline>.options will not be supported
    pipeline_options=pcoll.pipeline.options,

apache_beam/examples/complete/game/game_stats_it_test.py::GameStatsIT::test_game_stats_it
apache_beam/examples/complete/game/hourly_team_score_it_test.py::HourlyTeamScoreIT::test_hourly_team_score_it
apache_beam/examples/complete/game/leader_board_it_test.py::LeaderBoardIT::test_leader_board_it
apache_beam/io/gcp/bigquery_test.py::PubSubBigQueryIT::test_file_loads
apache_beam/io/gcp/bigquery_test.py::PubSubBigQueryIT::test_streaming_inserts
  <https://ci-beam.apache.org/job/beam_PostCommit_Python39/ws/src/sdks/python/apache_beam/io/gcp/tests/utils.py>:63: PendingDeprecationWarning: Client.dataset is deprecated and will be removed in a future version. Use a string like 'my_project.my_dataset' or a cloud.google.bigquery.DatasetReference object, instead.
    dataset_ref = client.dataset(unique_dataset_name, project=project)

apache_beam/examples/complete/game/game_stats_it_test.py: 2 warnings
apache_beam/examples/cookbook/bigquery_tornadoes_it_test.py: 1 warning
apache_beam/examples/complete/game/hourly_team_score_it_test.py: 1 warning
apache_beam/io/gcp/big_query_query_to_table_it_test.py: 4 warnings
apache_beam/examples/complete/game/leader_board_it_test.py: 2 warnings
apache_beam/io/gcp/bigquery_file_loads_test.py: 3 warnings
apache_beam/io/gcp/bigquery_test.py: 6 warnings
apache_beam/io/gcp/bigquery_json_it_test.py: 2 warnings
apache_beam/io/gcp/bigquery_write_it_test.py: 4 warnings
  <https://ci-beam.apache.org/job/beam_PostCommit_Python39/ws/src/sdks/python/apache_beam/io/gcp/bigquery.py>:1992: BeamDeprecationWarning: options is deprecated since First stable release. References to <pipeline>.options will not be supported
    is_streaming_pipeline = p.options.view_as(StandardOptions).streaming

apache_beam/examples/complete/game/game_stats_it_test.py: 2 warnings
apache_beam/examples/cookbook/bigquery_tornadoes_it_test.py: 1 warning
apache_beam/examples/complete/game/hourly_team_score_it_test.py: 1 warning
apache_beam/io/gcp/big_query_query_to_table_it_test.py: 4 warnings
apache_beam/examples/complete/game/leader_board_it_test.py: 2 warnings
apache_beam/io/gcp/bigquery_file_loads_test.py: 3 warnings
apache_beam/io/gcp/bigquery_test.py: 6 warnings
apache_beam/io/gcp/bigquery_json_it_test.py: 2 warnings
apache_beam/io/gcp/bigquery_write_it_test.py: 4 warnings
  <https://ci-beam.apache.org/job/beam_PostCommit_Python39/ws/src/sdks/python/apache_beam/io/gcp/bigquery.py>:1998: BeamDeprecationWarning: options is deprecated since First stable release. References to <pipeline>.options will not be supported
    experiments = p.options.view_as(DebugOptions).experiments or []

apache_beam/dataframe/io_it_test.py: 2 warnings
apache_beam/io/gcp/bigquery_json_it_test.py: 1 warning
apache_beam/io/gcp/bigquery_read_it_test.py: 9 warnings
  <https://ci-beam.apache.org/job/beam_PostCommit_Python39/ws/src/sdks/python/apache_beam/io/gcp/bigquery.py>:2529: BeamDeprecationWarning: options is deprecated since First stable release. References to <pipeline>.options will not be supported
    project_id = pcoll.pipeline.options.view_as(GoogleCloudOptions).project

apache_beam/dataframe/io_it_test.py: 2 warnings
apache_beam/io/gcp/bigquery_json_it_test.py: 1 warning
apache_beam/io/gcp/bigquery_read_it_test.py: 9 warnings
  <https://ci-beam.apache.org/job/beam_PostCommit_Python39/ws/src/sdks/python/apache_beam/io/gcp/bigquery.py>:2550: BeamDeprecationWarning: options is deprecated since First stable release. References to <pipeline>.options will not be supported
    pipeline_options=pcoll.pipeline.options,

apache_beam/examples/cookbook/bigquery_tornadoes_it_test.py: 1 warning
apache_beam/io/gcp/big_query_query_to_table_it_test.py: 4 warnings
apache_beam/io/gcp/bigquery_test.py: 2 warnings
apache_beam/io/gcp/bigquery_write_it_test.py: 4 warnings
  <https://ci-beam.apache.org/job/beam_PostCommit_Python39/ws/src/sdks/python/apache_beam/io/gcp/bigquery.py>:1988: BeamDeprecationWarning: options is deprecated since First stable release. References to <pipeline>.options will not be supported
    self.table_reference.projectId = pcoll.pipeline.options.view_as(

apache_beam/examples/cookbook/bigquery_tornadoes_it_test.py: 1 warning
apache_beam/io/gcp/big_query_query_to_table_it_test.py: 4 warnings
apache_beam/io/gcp/bigquery_file_loads_test.py: 3 warnings
apache_beam/io/gcp/bigquery_test.py: 3 warnings
apache_beam/io/gcp/bigquery_write_it_test.py: 3 warnings
  <https://ci-beam.apache.org/job/beam_PostCommit_Python39/ws/src/sdks/python/apache_beam/io/gcp/bigquery_file_loads.py>:1166: BeamDeprecationWarning: options is deprecated since First stable release. References to <pipeline>.options will not be supported
    self.project = self.project or p.options.view_as(GoogleCloudOptions).project

apache_beam/examples/cookbook/bigquery_tornadoes_it_test.py: 1 warning
apache_beam/examples/complete/game/hourly_team_score_it_test.py: 1 warning
apache_beam/io/gcp/big_query_query_to_table_it_test.py: 4 warnings
apache_beam/io/gcp/bigquery_file_loads_test.py: 3 warnings
apache_beam/io/gcp/bigquery_test.py: 3 warnings
apache_beam/io/gcp/bigquery_write_it_test.py: 3 warnings
  <https://ci-beam.apache.org/job/beam_PostCommit_Python39/ws/src/sdks/python/apache_beam/io/gcp/bigquery_file_loads.py>:1173: BeamDeprecationWarning: options is deprecated since First stable release. References to <pipeline>.options will not be supported
    temp_location = p.options.view_as(GoogleCloudOptions).temp_location

apache_beam/examples/cookbook/bigquery_tornadoes_it_test.py: 1 warning
apache_beam/examples/complete/game/hourly_team_score_it_test.py: 1 warning
apache_beam/io/gcp/big_query_query_to_table_it_test.py: 4 warnings
apache_beam/io/gcp/bigquery_file_loads_test.py: 3 warnings
apache_beam/io/gcp/bigquery_test.py: 3 warnings
apache_beam/io/gcp/bigquery_write_it_test.py: 3 warnings
  <https://ci-beam.apache.org/job/beam_PostCommit_Python39/ws/src/sdks/python/apache_beam/io/gcp/bigquery_file_loads.py>:1175: BeamDeprecationWarning: options is deprecated since First stable release. References to <pipeline>.options will not be supported
    p.options.view_as(GoogleCloudOptions).job_name or 'AUTOMATIC_JOB_NAME')

apache_beam/examples/cookbook/bigquery_tornadoes_it_test.py::BigqueryTornadoesIT::test_bigquery_tornadoes_it
  <https://ci-beam.apache.org/job/beam_PostCommit_Python39/ws/src/sdks/python/apache_beam/io/gcp/tests/utils.py>:100: PendingDeprecationWarning: Client.dataset is deprecated and will be removed in a future version. Use a string like 'my_project.my_dataset' or a cloud.google.bigquery.DatasetReference object, instead.
    table_ref = client.dataset(dataset_id).table(table_id)

apache_beam/examples/dataframe/flight_delays_it_test.py::FlightDelaysTest::test_flight_delays
  <https://ci-beam.apache.org/job/beam_PostCommit_Python39/ws/src/sdks/python/apache_beam/examples/dataframe/flight_delays.py>:47: FutureWarning: The default value of numeric_only in DataFrame.mean is deprecated. In a future version, it will default to False. In addition, specifying 'numeric_only=None' is deprecated. Select only valid columns or specify the value of numeric_only to silence this warning.
    return airline_df[at_top_airports].mean()

apache_beam/examples/dataframe/flight_delays_it_test.py::FlightDelaysTest::test_flight_delays
apache_beam/examples/dataframe/taxiride_it_test.py::TaxirideIT::test_aggregation
apache_beam/examples/dataframe/taxiride_it_test.py::TaxirideIT::test_enrich
  <https://ci-beam.apache.org/job/beam_PostCommit_Python39/ws/src/sdks/python/apache_beam/dataframe/io.py>:659: FutureWarning: WriteToFiles is experimental.
    return pcoll | fileio.WriteToFiles(

apache_beam/examples/dataframe/flight_delays_it_test.py::FlightDelaysTest::test_flight_delays
apache_beam/examples/dataframe/taxiride_it_test.py::TaxirideIT::test_aggregation
apache_beam/examples/dataframe/taxiride_it_test.py::TaxirideIT::test_enrich
  <https://ci-beam.apache.org/job/beam_PostCommit_Python39/ws/src/sdks/python/apache_beam/io/fileio.py>:593: BeamDeprecationWarning: options is deprecated since First stable release. References to <pipeline>.options will not be supported
    p.options.view_as(GoogleCloudOptions).temp_location or

apache_beam/io/gcp/bigquery_test.py::BigQueryStreamingInsertTransformIntegrationTests::test_multiple_destinations_transform
  <https://ci-beam.apache.org/job/beam_PostCommit_Python39/ws/src/sdks/python/apache_beam/io/gcp/bigquery_test.py>:1690: BeamDeprecationWarning: options is deprecated since First stable release. References to <pipeline>.options will not be supported
    streaming = self.test_pipeline.options.view_as(StandardOptions).streaming

apache_beam/io/gcp/bigquery_read_it_test.py::ReadTests::test_native_source
  <https://ci-beam.apache.org/job/beam_PostCommit_Python39/ws/src/sdks/python/apache_beam/io/gcp/bigquery_read_it_test.py>:170: BeamDeprecationWarning: BigQuerySource is deprecated since 2.25.0. Use ReadFromBigQuery instead.
    beam.io.BigQuerySource(query=self.query, use_standard_sql=True)))

apache_beam/ml/gcp/cloud_dlp_it_test.py::CloudDLPIT::test_deidentification
  <https://ci-beam.apache.org/job/beam_PostCommit_Python39/ws/src/sdks/python/apache_beam/ml/gcp/cloud_dlp_it_test.py>:74: FutureWarning: MaskDetectedDetails is experimental.
    | MaskDetectedDetails(

apache_beam/ml/gcp/cloud_dlp_it_test.py::CloudDLPIT::test_inspection
  <https://ci-beam.apache.org/job/beam_PostCommit_Python39/ws/src/sdks/python/apache_beam/ml/gcp/cloud_dlp_it_test.py>:85: FutureWarning: InspectForDetails is experimental.
    | InspectForDetails(

apache_beam/ml/inference/sklearn_inference_it_test.py::SklearnInference::test_sklearn_regression
  <https://ci-beam.apache.org/job/beam_PostCommit_Python39/ws/src/sdks/python/apache_beam/examples/inference/sklearn_japanese_housing_regression.py>:128: FutureWarning: SklearnModelHandlerPandas is experimental. No backwards-compatibility guarantees.
    model_loader = SklearnModelHandlerPandas(

apache_beam/ml/inference/sklearn_inference_it_test.py::SklearnInference::test_sklearn_regression
  <https://ci-beam.apache.org/job/beam_PostCommit_Python39/ws/src/build/gradleenv/-1734967050/lib/python3.9/site-packages/dill/_dill.py>:472: FutureWarning: SklearnModelHandlerPandas is experimental. No backwards-compatibility guarantees.
    obj = StockUnpickler.load(self)

apache_beam/io/gcp/bigquery_read_it_test.py::ReadNewTypesTests::test_native_source
  <https://ci-beam.apache.org/job/beam_PostCommit_Python39/ws/src/sdks/python/apache_beam/io/gcp/bigquery_read_it_test.py>:693: BeamDeprecationWarning: BigQuerySource is deprecated since 2.25.0. Use ReadFromBigQuery instead.
    beam.io.BigQuerySource(query=self.query, use_standard_sql=True)))

apache_beam/io/gcp/bigquery_read_it_test.py::ReadAllBQTests::test_read_queries
  <https://ci-beam.apache.org/job/beam_PostCommit_Python39/ws/src/sdks/python/apache_beam/io/gcp/bigquery_read_it_test.py>:808: FutureWarning: ReadAllFromBigQuery is experimental.
    | beam.io.ReadAllFromBigQuery())

apache_beam/io/gcp/bigquery_read_it_test.py::ReadAllBQTests::test_read_queries
  <https://ci-beam.apache.org/job/beam_PostCommit_Python39/ws/src/sdks/python/apache_beam/io/gcp/bigquery.py>:2658: BeamDeprecationWarning: options is deprecated since First stable release. References to <pipeline>.options will not be supported
    job_name = pcoll.pipeline.options.view_as(GoogleCloudOptions).job_name

apache_beam/io/gcp/bigquery_read_it_test.py::ReadAllBQTests::test_read_queries
  <https://ci-beam.apache.org/job/beam_PostCommit_Python39/ws/src/sdks/python/apache_beam/io/gcp/bigquery.py>:2659: BeamDeprecationWarning: options is deprecated since First stable release. References to <pipeline>.options will not be supported
    project = pcoll.pipeline.options.view_as(GoogleCloudOptions).project

apache_beam/io/gcp/bigquery_read_it_test.py::ReadAllBQTests::test_read_queries
  <https://ci-beam.apache.org/job/beam_PostCommit_Python39/ws/src/sdks/python/apache_beam/io/gcp/bigquery.py>:2672: BeamDeprecationWarning: options is deprecated since First stable release. References to <pipeline>.options will not be supported
    options=pcoll.pipeline.options,

-- Docs: https://docs.pytest.org/en/stable/how-to/capture-warnings.html
- generated xml file: <https://ci-beam.apache.org/job/beam_PostCommit_Python39/ws/src/sdks/python/pytest_postCommitIT-df-py39.xml> -
=========================== short test summary info ============================
FAILED apache_beam/io/gcp/big_query_query_to_table_it_test.py::BigQueryQueryToTableIT::test_big_query_standard_sql - AssertionError: 
Expected: (Test pipeline expected terminated in state: DONE and Expected checksum is 158a8ea1c254fcf40d4ed3e7c0242c3ea0a29e72)
     but: Test pipeline expected terminated in state: DONE Test pipeline job terminated in state: RUNNING
===== 1 failed, 84 passed, 28 skipped, 608 warnings in 13209.19s (3:40:09) =====

> Task :sdks:python:test-suites:dataflow:py39:postCommitIT FAILED

FAILURE: Build completed with 3 failures.

1: Task failed with an exception.
-----------
* Where:
Script '<https://ci-beam.apache.org/job/beam_PostCommit_Python39/ws/src/sdks/python/test-suites/direct/common.gradle'> line: 304

* What went wrong:
Execution failed for task ':sdks:python:test-suites:direct:py39:tensorflowInferenceTest'.
> Process 'command 'sh'' finished with non-zero exit value 1

* Try:
> Run with --stacktrace option to get the stack trace.
> Run with --info or --debug option to get more log output.
==============================================================================

2: Task failed with an exception.
-----------
* Where:
Script '<https://ci-beam.apache.org/job/beam_PostCommit_Python39/ws/src/sdks/python/test-suites/portable/common.gradle'> line: 326

* What went wrong:
Execution failed for task ':sdks:python:test-suites:portable:py39:postCommitPy39IT'.
> Process 'command 'sh'' finished with non-zero exit value 1

* Try:
> Run with --stacktrace option to get the stack trace.
> Run with --info or --debug option to get more log output.
==============================================================================

3: Task failed with an exception.
-----------
* Where:
Script '<https://ci-beam.apache.org/job/beam_PostCommit_Python39/ws/src/sdks/python/test-suites/dataflow/common.gradle'> line: 111

* What went wrong:
Execution failed for task ':sdks:python:test-suites:dataflow:py39:postCommitIT'.
> Process 'command 'sh'' finished with non-zero exit value 1

* Try:
> Run with --stacktrace option to get the stack trace.
> Run with --info or --debug option to get more log output.
==============================================================================

* Get more help at https://help.gradle.org

Deprecated Gradle features were used in this build, making it incompatible with Gradle 8.0.

You can use '--warning-mode all' to show the individual deprecation warnings and determine if they come from your own scripts or plugins.

See https://docs.gradle.org/7.5.1/userguide/command_line_interface.html#sec:command_line_warnings

Execution optimizations have been disabled for 1 invalid unit(s) of work during this build to ensure correctness.
Please consult deprecation warnings for more details.

BUILD FAILED in 3h 42m 19s
211 actionable tasks: 146 executed, 59 from cache, 6 up-to-date

Publishing build scan...
https://gradle.com/s/latxpceomzy6y

Build step 'Invoke Gradle script' changed build result to FAILURE
Build step 'Invoke Gradle script' marked build as failure

---------------------------------------------------------------------
To unsubscribe, e-mail: builds-unsubscribe@beam.apache.org
For additional commands, e-mail: builds-help@beam.apache.org


Jenkins build is back to normal : beam_PostCommit_Python39 #1510

Posted by Apache Jenkins Server <je...@builds.apache.org>.
See <https://ci-beam.apache.org/job/beam_PostCommit_Python39/1510/display/redirect>


---------------------------------------------------------------------
To unsubscribe, e-mail: builds-unsubscribe@beam.apache.org
For additional commands, e-mail: builds-help@beam.apache.org


Build failed in Jenkins: beam_PostCommit_Python39 #1509

Posted by Apache Jenkins Server <je...@builds.apache.org>.
See <https://ci-beam.apache.org/job/beam_PostCommit_Python39/1509/display/redirect>

Changes:


------------------------------------------
[...truncated 8.42 MB...]
INFO:apache_beam.runners.portability.fn_api_runner.translations:==================== <function sort_stages at 0x7f67d58d1ca0> ====================
INFO:apache_beam.utils.subprocess_server:Starting service with ['java' '-jar' '<https://ci-beam.apache.org/job/beam_PostCommit_Python39/ws/src/runners/spark/3/job-server/build/libs/beam-runners-spark-3-job-server-2.47.0-SNAPSHOT.jar'> '--spark-master-url' 'local[4]' '--artifacts-dir' '/tmp/beam-temp006onoqd/artifactsgwo7k_0l' '--job-port' '41033' '--artifact-port' '0' '--expansion-port' '0']
INFO:apache_beam.utils.subprocess_server:23/02/25 18:25:41 WARN software.amazon.awssdk.regions.internal.util.EC2MetadataUtils: Unable to retrieve the requested metadata.
INFO:apache_beam.utils.subprocess_server:23/02/25 18:25:42 INFO org.apache.beam.runners.jobsubmission.JobServerDriver: ArtifactStagingService started on localhost:41073
INFO:apache_beam.utils.subprocess_server:23/02/25 18:25:42 INFO org.apache.beam.runners.jobsubmission.JobServerDriver: Java ExpansionService started on localhost:33175
INFO:apache_beam.utils.subprocess_server:23/02/25 18:25:42 INFO org.apache.beam.runners.jobsubmission.JobServerDriver: JobService started on localhost:41033
INFO:apache_beam.utils.subprocess_server:23/02/25 18:25:42 INFO org.apache.beam.runners.jobsubmission.JobServerDriver: Job server now running, terminate with Ctrl+C
WARNING:root:Waiting for grpc channel to be ready at localhost:41033.
INFO:apache_beam.utils.subprocess_server:23/02/25 18:25:43 INFO org.apache.beam.runners.fnexecution.artifact.ArtifactStagingService: Staging artifacts for job_1d492e3a-3418-4155-8335-ead1f1b01275.
INFO:apache_beam.utils.subprocess_server:23/02/25 18:25:43 INFO org.apache.beam.runners.fnexecution.artifact.ArtifactStagingService: Resolving artifacts for job_1d492e3a-3418-4155-8335-ead1f1b01275.ref_Environment_default_environment_1.
INFO:apache_beam.utils.subprocess_server:23/02/25 18:25:43 INFO org.apache.beam.runners.fnexecution.artifact.ArtifactStagingService: Getting 1 artifacts for job_1d492e3a-3418-4155-8335-ead1f1b01275.null.
INFO:apache_beam.utils.subprocess_server:23/02/25 18:25:43 INFO org.apache.beam.runners.fnexecution.artifact.ArtifactStagingService: Artifacts fully staged for job_1d492e3a-3418-4155-8335-ead1f1b01275.
INFO:apache_beam.utils.subprocess_server:23/02/25 18:25:44 INFO org.apache.beam.runners.spark.SparkJobInvoker: Invoking job BeamApp-jenkins-0225182544-c5d4bdc1_72d9c4b6-197a-48af-b62e-6503c02bb97c
INFO:apache_beam.utils.subprocess_server:23/02/25 18:25:44 INFO org.apache.beam.runners.jobsubmission.JobInvocation: Starting job invocation BeamApp-jenkins-0225182544-c5d4bdc1_72d9c4b6-197a-48af-b62e-6503c02bb97c
INFO:apache_beam.runners.portability.portable_runner:Environment "LOOPBACK" has started a component necessary for the execution. Be sure to run the pipeline using
  with Pipeline() as p:
    p.apply(..)
This ensures that the pipeline finishes before this program exits.
INFO:apache_beam.runners.portability.portable_runner:Job state changed to STOPPED
INFO:apache_beam.runners.portability.portable_runner:Job state changed to STARTING
INFO:apache_beam.runners.portability.portable_runner:Job state changed to RUNNING
INFO:apache_beam.utils.subprocess_server:23/02/25 18:25:44 INFO org.apache.beam.runners.spark.translation.SparkContextFactory: Creating a brand new Spark Context.
INFO:apache_beam.utils.subprocess_server:23/02/25 18:25:45 WARN org.apache.hadoop.util.NativeCodeLoader: Unable to load native-hadoop library for your platform... using builtin-java classes where applicable
INFO:apache_beam.utils.subprocess_server:23/02/25 18:25:46 INFO org.sparkproject.jetty.util.log: Logging initialized @8865ms to org.sparkproject.jetty.util.log.Slf4jLog
INFO:apache_beam.utils.subprocess_server:23/02/25 18:25:47 INFO org.sparkproject.jetty.server.Server: jetty-9.4.40.v20210413; built: 2021-04-13T20:42:42.668Z; git: b881a572662e1943a14ae12e7e1207989f218b74; jvm 1.8.0_352-8u352-ga-1~20.04-b08
INFO:apache_beam.utils.subprocess_server:23/02/25 18:25:47 INFO org.sparkproject.jetty.server.Server: Started @9145ms
INFO:apache_beam.utils.subprocess_server:23/02/25 18:25:47 INFO org.sparkproject.jetty.server.AbstractConnector: Started ServerConnector@3ad052e5{HTTP/1.1, (http/1.1)}{127.0.0.1:4040}
INFO:apache_beam.utils.subprocess_server:23/02/25 18:25:47 INFO org.sparkproject.jetty.server.handler.ContextHandler: Started o.s.j.s.ServletContextHandler@3a1c771a{/jobs,null,AVAILABLE,@Spark}
INFO:apache_beam.utils.subprocess_server:23/02/25 18:25:47 INFO org.sparkproject.jetty.server.handler.ContextHandler: Started o.s.j.s.ServletContextHandler@66a8bebd{/jobs/json,null,AVAILABLE,@Spark}
INFO:apache_beam.utils.subprocess_server:23/02/25 18:25:47 INFO org.sparkproject.jetty.server.handler.ContextHandler: Started o.s.j.s.ServletContextHandler@2bde1d19{/jobs/job,null,AVAILABLE,@Spark}
INFO:apache_beam.utils.subprocess_server:23/02/25 18:25:47 INFO org.sparkproject.jetty.server.handler.ContextHandler: Started o.s.j.s.ServletContextHandler@66c520fe{/jobs/job/json,null,AVAILABLE,@Spark}
INFO:apache_beam.utils.subprocess_server:23/02/25 18:25:47 INFO org.sparkproject.jetty.server.handler.ContextHandler: Started o.s.j.s.ServletContextHandler@781cf7b4{/stages,null,AVAILABLE,@Spark}
INFO:apache_beam.utils.subprocess_server:23/02/25 18:25:47 INFO org.sparkproject.jetty.server.handler.ContextHandler: Started o.s.j.s.ServletContextHandler@2115b009{/stages/json,null,AVAILABLE,@Spark}
INFO:apache_beam.utils.subprocess_server:23/02/25 18:25:47 INFO org.sparkproject.jetty.server.handler.ContextHandler: Started o.s.j.s.ServletContextHandler@450711fa{/stages/stage,null,AVAILABLE,@Spark}
INFO:apache_beam.utils.subprocess_server:23/02/25 18:25:47 INFO org.sparkproject.jetty.server.handler.ContextHandler: Started o.s.j.s.ServletContextHandler@a691d49{/stages/stage/json,null,AVAILABLE,@Spark}
INFO:apache_beam.utils.subprocess_server:23/02/25 18:25:47 INFO org.sparkproject.jetty.server.handler.ContextHandler: Started o.s.j.s.ServletContextHandler@4d36a37f{/stages/pool,null,AVAILABLE,@Spark}
INFO:apache_beam.utils.subprocess_server:23/02/25 18:25:47 INFO org.sparkproject.jetty.server.handler.ContextHandler: Started o.s.j.s.ServletContextHandler@1a2a7d8b{/stages/pool/json,null,AVAILABLE,@Spark}
INFO:apache_beam.utils.subprocess_server:23/02/25 18:25:47 INFO org.sparkproject.jetty.server.handler.ContextHandler: Started o.s.j.s.ServletContextHandler@c31e16d{/storage,null,AVAILABLE,@Spark}
INFO:apache_beam.utils.subprocess_server:23/02/25 18:25:47 INFO org.sparkproject.jetty.server.handler.ContextHandler: Started o.s.j.s.ServletContextHandler@40d49d94{/storage/json,null,AVAILABLE,@Spark}
INFO:apache_beam.utils.subprocess_server:23/02/25 18:25:47 INFO org.sparkproject.jetty.server.handler.ContextHandler: Started o.s.j.s.ServletContextHandler@13973f9b{/storage/rdd,null,AVAILABLE,@Spark}
INFO:apache_beam.utils.subprocess_server:23/02/25 18:25:47 INFO org.sparkproject.jetty.server.handler.ContextHandler: Started o.s.j.s.ServletContextHandler@253a749a{/storage/rdd/json,null,AVAILABLE,@Spark}
INFO:apache_beam.utils.subprocess_server:23/02/25 18:25:47 INFO org.sparkproject.jetty.server.handler.ContextHandler: Started o.s.j.s.ServletContextHandler@6b42f7c5{/environment,null,AVAILABLE,@Spark}
INFO:apache_beam.utils.subprocess_server:23/02/25 18:25:47 INFO org.sparkproject.jetty.server.handler.ContextHandler: Started o.s.j.s.ServletContextHandler@6f766cae{/environment/json,null,AVAILABLE,@Spark}
INFO:apache_beam.utils.subprocess_server:23/02/25 18:25:47 INFO org.sparkproject.jetty.server.handler.ContextHandler: Started o.s.j.s.ServletContextHandler@4933604e{/executors,null,AVAILABLE,@Spark}
INFO:apache_beam.utils.subprocess_server:23/02/25 18:25:47 INFO org.sparkproject.jetty.server.handler.ContextHandler: Started o.s.j.s.ServletContextHandler@7e240ce9{/executors/json,null,AVAILABLE,@Spark}
INFO:apache_beam.utils.subprocess_server:23/02/25 18:25:47 INFO org.sparkproject.jetty.server.handler.ContextHandler: Started o.s.j.s.ServletContextHandler@3747176{/executors/threadDump,null,AVAILABLE,@Spark}
INFO:apache_beam.utils.subprocess_server:23/02/25 18:25:47 INFO org.sparkproject.jetty.server.handler.ContextHandler: Started o.s.j.s.ServletContextHandler@27c01d2f{/executors/threadDump/json,null,AVAILABLE,@Spark}
INFO:apache_beam.utils.subprocess_server:23/02/25 18:25:47 INFO org.sparkproject.jetty.server.handler.ContextHandler: Started o.s.j.s.ServletContextHandler@6c33736d{/static,null,AVAILABLE,@Spark}
INFO:apache_beam.utils.subprocess_server:23/02/25 18:25:47 INFO org.sparkproject.jetty.server.handler.ContextHandler: Started o.s.j.s.ServletContextHandler@6391f12c{/,null,AVAILABLE,@Spark}
INFO:apache_beam.utils.subprocess_server:23/02/25 18:25:47 INFO org.sparkproject.jetty.server.handler.ContextHandler: Started o.s.j.s.ServletContextHandler@46b16f17{/api,null,AVAILABLE,@Spark}
INFO:apache_beam.utils.subprocess_server:23/02/25 18:25:47 INFO org.sparkproject.jetty.server.handler.ContextHandler: Started o.s.j.s.ServletContextHandler@c57640d{/jobs/job/kill,null,AVAILABLE,@Spark}
INFO:apache_beam.utils.subprocess_server:23/02/25 18:25:47 INFO org.sparkproject.jetty.server.handler.ContextHandler: Started o.s.j.s.ServletContextHandler@2fafd4f3{/stages/stage/kill,null,AVAILABLE,@Spark}
INFO:apache_beam.utils.subprocess_server:23/02/25 18:25:47 INFO org.sparkproject.jetty.server.handler.ContextHandler: Started o.s.j.s.ServletContextHandler@2e89706c{/metrics/json,null,AVAILABLE,@Spark}
INFO:apache_beam.utils.subprocess_server:23/02/25 18:25:47 INFO org.apache.beam.runners.spark.metrics.MetricsAccumulator: Instantiated metrics accumulator: MetricQueryResults()
INFO:apache_beam.utils.subprocess_server:23/02/25 18:25:47 WARN software.amazon.awssdk.regions.internal.util.EC2MetadataUtils: Unable to retrieve the requested metadata.
INFO:apache_beam.utils.subprocess_server:23/02/25 18:25:47 INFO org.apache.beam.runners.spark.SparkPipelineRunner: Running job BeamApp-jenkins-0225182544-c5d4bdc1_72d9c4b6-197a-48af-b62e-6503c02bb97c on Spark master local[4]
INFO:apache_beam.utils.subprocess_server:23/02/25 18:25:48 WARN software.amazon.awssdk.regions.internal.util.EC2MetadataUtils: Unable to retrieve the requested metadata.
INFO:apache_beam.utils.subprocess_server:23/02/25 18:25:48 WARN software.amazon.awssdk.regions.internal.util.EC2MetadataUtils: Unable to retrieve the requested metadata.
INFO:apache_beam.utils.subprocess_server:23/02/25 18:25:48 WARN software.amazon.awssdk.regions.internal.util.EC2MetadataUtils: Unable to retrieve the requested metadata.
INFO:apache_beam.utils.subprocess_server:23/02/25 18:25:48 WARN software.amazon.awssdk.regions.internal.util.EC2MetadataUtils: Unable to retrieve the requested metadata.
INFO:apache_beam.runners.worker.statecache:Creating state cache with size 0
INFO:apache_beam.runners.worker.sdk_worker:Creating insecure control channel for localhost:42207.
INFO:apache_beam.runners.worker.sdk_worker:Control channel established.
INFO:apache_beam.runners.worker.sdk_worker:Initializing SDKHarness with unbounded number of workers.
INFO:apache_beam.utils.subprocess_server:23/02/25 18:25:49 INFO org.apache.beam.runners.fnexecution.control.FnApiControlClientPoolService: Beam Fn Control client connected with id 1-1
INFO:apache_beam.utils.subprocess_server:23/02/25 18:25:49 INFO org.apache.beam.runners.fnexecution.control.FnApiControlClientPoolService: getProcessBundleDescriptor request with id 1-2
INFO:apache_beam.runners.worker.sdk_worker:Creating insecure state channel for localhost:43981.
INFO:apache_beam.runners.worker.sdk_worker:State channel established.
INFO:root:Default Python SDK image for environment is apache/beam_python3.9_sdk:2.47.0.dev
INFO:apache_beam.runners.worker.data_plane:Creating client data channel for localhost:33063
INFO:apache_beam.utils.subprocess_server:23/02/25 18:25:49 INFO org.apache.beam.runners.fnexecution.data.GrpcDataService: Beam Fn Data client connected.
INFO:apache_beam.utils.subprocess_server:23/02/25 18:25:49 INFO org.apache.beam.runners.fnexecution.control.FnApiControlClientPoolService: getProcessBundleDescriptor request with id 1-3
INFO:root:Default Python SDK image for environment is apache/beam_python3.9_sdk:2.47.0.dev
INFO:apache_beam.utils.subprocess_server:23/02/25 18:25:49 WARN software.amazon.awssdk.regions.internal.util.EC2MetadataUtils: Unable to retrieve the requested metadata.
INFO:apache_beam.utils.subprocess_server:23/02/25 18:25:49 WARN software.amazon.awssdk.regions.internal.util.EC2MetadataUtils: Unable to retrieve the requested metadata.
INFO:apache_beam.utils.subprocess_server:23/02/25 18:25:49 WARN software.amazon.awssdk.regions.internal.util.EC2MetadataUtils: Unable to retrieve the requested metadata.
INFO:apache_beam.utils.subprocess_server:23/02/25 18:25:49 WARN software.amazon.awssdk.regions.internal.util.EC2MetadataUtils: Unable to retrieve the requested metadata.
INFO:apache_beam.utils.subprocess_server:23/02/25 18:25:49 INFO org.apache.beam.runners.fnexecution.control.FnApiControlClientPoolService: getProcessBundleDescriptor request with id 1-4
INFO:root:Default Python SDK image for environment is apache/beam_python3.9_sdk:2.47.0.dev
INFO:apache_beam.utils.subprocess_server:23/02/25 18:25:49 INFO org.apache.beam.runners.fnexecution.control.FnApiControlClientPoolService: getProcessBundleDescriptor request with id 1-5
INFO:root:Default Python SDK image for environment is apache/beam_python3.9_sdk:2.47.0.dev
INFO:apache_beam.utils.subprocess_server:23/02/25 18:25:50 WARN software.amazon.awssdk.regions.internal.util.EC2MetadataUtils: Unable to retrieve the requested metadata.
INFO:apache_beam.utils.subprocess_server:23/02/25 18:25:50 WARN software.amazon.awssdk.regions.internal.util.EC2MetadataUtils: Unable to retrieve the requested metadata.
INFO:apache_beam.utils.subprocess_server:23/02/25 18:25:50 WARN software.amazon.awssdk.regions.internal.util.EC2MetadataUtils: Unable to retrieve the requested metadata.
INFO:apache_beam.utils.subprocess_server:23/02/25 18:25:50 WARN software.amazon.awssdk.regions.internal.util.EC2MetadataUtils: Unable to retrieve the requested metadata.
INFO:apache_beam.utils.subprocess_server:23/02/25 18:25:50 INFO org.apache.beam.runners.fnexecution.control.FnApiControlClientPoolService: getProcessBundleDescriptor request with id 1-6
INFO:apache_beam.utils.subprocess_server:23/02/25 18:25:50 INFO org.apache.beam.runners.fnexecution.control.FnApiControlClientPoolService: getProcessBundleDescriptor request with id 1-8
INFO:apache_beam.utils.subprocess_server:23/02/25 18:25:50 INFO org.apache.beam.runners.fnexecution.control.FnApiControlClientPoolService: getProcessBundleDescriptor request with id 1-9
INFO:apache_beam.utils.subprocess_server:23/02/25 18:25:50 INFO org.apache.beam.runners.fnexecution.control.FnApiControlClientPoolService: getProcessBundleDescriptor request with id 1-7
INFO:root:Default Python SDK image for environment is apache/beam_python3.9_sdk:2.47.0.dev
INFO:root:Default Python SDK image for environment is apache/beam_python3.9_sdk:2.47.0.dev
INFO:root:Default Python SDK image for environment is apache/beam_python3.9_sdk:2.47.0.dev
INFO:root:Default Python SDK image for environment is apache/beam_python3.9_sdk:2.47.0.dev
INFO:apache_beam.utils.subprocess_server:23/02/25 18:25:50 INFO org.apache.beam.runners.fnexecution.control.FnApiControlClientPoolService: getProcessBundleDescriptor request with id 1-10
INFO:root:Default Python SDK image for environment is apache/beam_python3.9_sdk:2.47.0.dev
INFO:apache_beam.utils.subprocess_server:23/02/25 18:25:50 INFO org.apache.beam.runners.fnexecution.control.FnApiControlClientPoolService: getProcessBundleDescriptor request with id 1-11
INFO:root:Default Python SDK image for environment is apache/beam_python3.9_sdk:2.47.0.dev
INFO:apache_beam.utils.subprocess_server:23/02/25 18:25:50 INFO org.apache.beam.runners.fnexecution.control.FnApiControlClientPoolService: getProcessBundleDescriptor request with id 1-12
INFO:root:Default Python SDK image for environment is apache/beam_python3.9_sdk:2.47.0.dev
INFO:apache_beam.utils.subprocess_server:23/02/25 18:25:50 INFO org.apache.beam.runners.fnexecution.control.FnApiControlClientPoolService: getProcessBundleDescriptor request with id 1-13
INFO:root:Default Python SDK image for environment is apache/beam_python3.9_sdk:2.47.0.dev
INFO:apache_beam.utils.subprocess_server:23/02/25 18:25:50 WARN software.amazon.awssdk.regions.internal.util.EC2MetadataUtils: Unable to retrieve the requested metadata.
INFO:apache_beam.utils.subprocess_server:23/02/25 18:25:50 WARN software.amazon.awssdk.regions.internal.util.EC2MetadataUtils: Unable to retrieve the requested metadata.
INFO:apache_beam.utils.subprocess_server:23/02/25 18:25:50 WARN software.amazon.awssdk.regions.internal.util.EC2MetadataUtils: Unable to retrieve the requested metadata.
INFO:apache_beam.utils.subprocess_server:23/02/25 18:25:50 WARN software.amazon.awssdk.regions.internal.util.EC2MetadataUtils: Unable to retrieve the requested metadata.
INFO:apache_beam.utils.subprocess_server:23/02/25 18:25:50 INFO org.apache.beam.runners.fnexecution.control.FnApiControlClientPoolService: getProcessBundleDescriptor request with id 1-14
INFO:root:Default Python SDK image for environment is apache/beam_python3.9_sdk:2.47.0.dev
INFO:apache_beam.utils.subprocess_server:23/02/25 18:25:50 WARN software.amazon.awssdk.regions.internal.util.EC2MetadataUtils: Unable to retrieve the requested metadata.
INFO:apache_beam.utils.subprocess_server:23/02/25 18:25:50 WARN software.amazon.awssdk.regions.internal.util.EC2MetadataUtils: Unable to retrieve the requested metadata.
INFO:apache_beam.utils.subprocess_server:23/02/25 18:25:50 WARN software.amazon.awssdk.regions.internal.util.EC2MetadataUtils: Unable to retrieve the requested metadata.
INFO:apache_beam.utils.subprocess_server:23/02/25 18:25:50 WARN software.amazon.awssdk.regions.internal.util.EC2MetadataUtils: Unable to retrieve the requested metadata.
INFO:apache_beam.utils.subprocess_server:23/02/25 18:25:50 INFO org.apache.beam.runners.fnexecution.control.FnApiControlClientPoolService: getProcessBundleDescriptor request with id 1-15
INFO:root:Default Python SDK image for environment is apache/beam_python3.9_sdk:2.47.0.dev
INFO:apache_beam.utils.subprocess_server:23/02/25 18:25:50 INFO org.apache.beam.runners.spark.SparkPipelineRunner: Job BeamApp-jenkins-0225182544-c5d4bdc1_72d9c4b6-197a-48af-b62e-6503c02bb97c: Pipeline translated successfully. Computing outputs
INFO:apache_beam.utils.subprocess_server:23/02/25 18:25:50 WARN software.amazon.awssdk.regions.internal.util.EC2MetadataUtils: Unable to retrieve the requested metadata.
INFO:apache_beam.utils.subprocess_server:23/02/25 18:25:50 WARN software.amazon.awssdk.regions.internal.util.EC2MetadataUtils: Unable to retrieve the requested metadata.
INFO:apache_beam.utils.subprocess_server:23/02/25 18:25:50 WARN software.amazon.awssdk.regions.internal.util.EC2MetadataUtils: Unable to retrieve the requested metadata.
INFO:apache_beam.utils.subprocess_server:23/02/25 18:25:50 WARN software.amazon.awssdk.regions.internal.util.EC2MetadataUtils: Unable to retrieve the requested metadata.
INFO:apache_beam.utils.subprocess_server:23/02/25 18:25:50 INFO org.apache.beam.runners.fnexecution.control.FnApiControlClientPoolService: getProcessBundleDescriptor request with id 1-16
INFO:root:Default Python SDK image for environment is apache/beam_python3.9_sdk:2.47.0.dev
INFO:apache_beam.io.filebasedsink:Starting finalize_write threads with num_shards: 4 (skipped: 0), batches: 4, num_threads: 4
INFO:apache_beam.io.filebasedsink:Renamed 4 shards in 0.01 seconds.
INFO:apache_beam.utils.subprocess_server:23/02/25 18:25:50 INFO org.apache.beam.runners.spark.SparkPipelineRunner: Job BeamApp-jenkins-0225182544-c5d4bdc1_72d9c4b6-197a-48af-b62e-6503c02bb97c finished.
INFO:apache_beam.utils.subprocess_server:23/02/25 18:25:50 INFO org.sparkproject.jetty.server.AbstractConnector: Stopped Spark@3ad052e5{HTTP/1.1, (http/1.1)}{127.0.0.1:4040}
INFO:apache_beam.runners.portability.portable_runner:Job state changed to DONE
Exception in thread run_worker_1-1:
Traceback (most recent call last):
  File "/usr/lib/python3.9/threading.py", line 973, in _bootstrap_inner
    self.run()
Exception in thread read_state:
Traceback (most recent call last):
  File "/usr/lib/python3.9/threading.py", line 910, in run
  File "/usr/lib/python3.9/threading.py", line 973, in _bootstrap_inner
    self._target(*self._args, **self._kwargs)
  File "<https://ci-beam.apache.org/job/beam_PostCommit_Python39/ws/src/sdks/python/apache_beam/runners/worker/sdk_worker.py",> line 259, in run
    for work_request in self._control_stub.Control(get_responses()):
  File "<https://ci-beam.apache.org/job/beam_PostCommit_Python39/ws/src/build/gradleenv/2022703443/lib/python3.9/site-packages/grpc/_channel.py",> line 426, in __next__
ERROR:apache_beam.runners.worker.data_plane:Failed to read inputs in the data plane.
Traceback (most recent call last):
  File "<https://ci-beam.apache.org/job/beam_PostCommit_Python39/ws/src/sdks/python/apache_beam/runners/worker/data_plane.py",> line 654, in _read_inputs
    for elements in elements_iterator:
  File "<https://ci-beam.apache.org/job/beam_PostCommit_Python39/ws/src/build/gradleenv/2022703443/lib/python3.9/site-packages/grpc/_channel.py",> line 426, in __next__
    return self._next()
  File "<https://ci-beam.apache.org/job/beam_PostCommit_Python39/ws/src/build/gradleenv/2022703443/lib/python3.9/site-packages/grpc/_channel.py",> line 826, in _next
    raise self
grpc._channel._MultiThreadedRendezvous: <_MultiThreadedRendezvous of RPC that terminated with:
	status = StatusCode.UNAVAILABLE
	details = "recvmsg:Connection reset by peer"
	debug_error_string = "UNKNOWN:Error received from peer ipv6:%5B::1%5D:33063 {created_time:"2023-02-25T18:25:51.308460224+00:00", grpc_status:14, grpc_message:"recvmsg:Connection reset by peer"}"
>
Exception in thread read_grpc_client_inputs:
Traceback (most recent call last):
  File "/usr/lib/python3.9/threading.py", line 973, in _bootstrap_inner
    self.run()
  File "/usr/lib/python3.9/threading.py", line 910, in run
    return self._next()
    self.run()
  File "/usr/lib/python3.9/threading.py", line 910, in run
  File "<https://ci-beam.apache.org/job/beam_PostCommit_Python39/ws/src/build/gradleenv/2022703443/lib/python3.9/site-packages/grpc/_channel.py",> line 826, in _next
    self._target(*self._args, **self._kwargs)
  File "<https://ci-beam.apache.org/job/beam_PostCommit_Python39/ws/src/sdks/python/apache_beam/runners/worker/sdk_worker.py",> line 1034, in pull_responses
    self._target(*self._args, **self._kwargs)
  File "<https://ci-beam.apache.org/job/beam_PostCommit_Python39/ws/src/sdks/python/apache_beam/runners/worker/data_plane.py",> line 671, in <lambda>
    raise self
    for response in responses:
grpc._channel._MultiThreadedRendezvous: <_MultiThreadedRendezvous of RPC that terminated with:
	status = StatusCode.UNAVAILABLE
	details = "Socket closed"
	debug_error_string = "UNKNOWN:Error received from peer ipv6:%5B::1%5D:42207 {grpc_message:"Socket closed", grpc_status:14, created_time:"2023-02-25T18:25:51.308513686+00:00"}"
>  File "<https://ci-beam.apache.org/job/beam_PostCommit_Python39/ws/src/build/gradleenv/2022703443/lib/python3.9/site-packages/grpc/_channel.py",> line 426, in __next__

    target=lambda: self._read_inputs(elements_iterator),
  File "<https://ci-beam.apache.org/job/beam_PostCommit_Python39/ws/src/sdks/python/apache_beam/runners/worker/data_plane.py",> line 654, in _read_inputs
    return self._next()
  File "<https://ci-beam.apache.org/job/beam_PostCommit_Python39/ws/src/build/gradleenv/2022703443/lib/python3.9/site-packages/grpc/_channel.py",> line 826, in _next
    for elements in elements_iterator:
  File "<https://ci-beam.apache.org/job/beam_PostCommit_Python39/ws/src/build/gradleenv/2022703443/lib/python3.9/site-packages/grpc/_channel.py",> line 426, in __next__
    raise self
grpc._channel._MultiThreadedRendezvous: <_MultiThreadedRendezvous of RPC that terminated with:
	status = StatusCode.UNAVAILABLE
	details = "recvmsg:Connection reset by peer"
	debug_error_string = "UNKNOWN:Error received from peer ipv6:%5B::1%5D:43981 {grpc_message:"recvmsg:Connection reset by peer", grpc_status:14, created_time:"2023-02-25T18:25:51.308462298+00:00"}"
>
    return self._next()
  File "<https://ci-beam.apache.org/job/beam_PostCommit_Python39/ws/src/build/gradleenv/2022703443/lib/python3.9/site-packages/grpc/_channel.py",> line 826, in _next
    raise self
grpc._channel._MultiThreadedRendezvous: <_MultiThreadedRendezvous of RPC that terminated with:
	status = StatusCode.UNAVAILABLE
	details = "recvmsg:Connection reset by peer"
	debug_error_string = "UNKNOWN:Error received from peer ipv6:%5B::1%5D:33063 {created_time:"2023-02-25T18:25:51.308460224+00:00", grpc_status:14, grpc_message:"recvmsg:Connection reset by peer"}"
>

> Task :sdks:python:test-suites:dataflow:py39:postCommitIT
warning: sdist: standard file not found: should have one of README, README.rst, README.txt, README.md

warning: check: missing required meta-data: url

warning: check: missing meta-data: either (author and author_email) or (maintainer and maintainer_email) should be supplied


FAILURE: Build completed with 2 failures.

1: Task failed with an exception.
-----------
* Where:
Script '<https://ci-beam.apache.org/job/beam_PostCommit_Python39/ws/src/sdks/python/test-suites/direct/common.gradle'> line: 304

* What went wrong:
Execution failed for task ':sdks:python:test-suites:direct:py39:tensorflowInferenceTest'.
> Process 'command 'sh'' finished with non-zero exit value 1

* Try:
> Run with --stacktrace option to get the stack trace.
> Run with --info or --debug option to get more log output.
==============================================================================

2: Task failed with an exception.
-----------
* Where:
Script '<https://ci-beam.apache.org/job/beam_PostCommit_Python39/ws/src/sdks/python/test-suites/portable/common.gradle'> line: 326

* What went wrong:
Execution failed for task ':sdks:python:test-suites:portable:py39:postCommitPy39IT'.
> Process 'command 'sh'' finished with non-zero exit value 1

* Try:
> Run with --stacktrace option to get the stack trace.
> Run with --info or --debug option to get more log output.
==============================================================================

* Get more help at https://help.gradle.org

Deprecated Gradle features were used in this build, making it incompatible with Gradle 8.0.

You can use '--warning-mode all' to show the individual deprecation warnings and determine if they come from your own scripts or plugins.

See https://docs.gradle.org/7.5.1/userguide/command_line_interface.html#sec:command_line_warnings

Execution optimizations have been disabled for 1 invalid unit(s) of work during this build to ensure correctness.
Please consult deprecation warnings for more details.

BUILD FAILED in 3h 40m 35s
211 actionable tasks: 146 executed, 59 from cache, 6 up-to-date

Publishing build scan...
https://gradle.com/s/nbtp4vdoinqhy

Build step 'Invoke Gradle script' changed build result to FAILURE
Build step 'Invoke Gradle script' marked build as failure

---------------------------------------------------------------------
To unsubscribe, e-mail: builds-unsubscribe@beam.apache.org
For additional commands, e-mail: builds-help@beam.apache.org


Build failed in Jenkins: beam_PostCommit_Python39 #1508

Posted by Apache Jenkins Server <je...@builds.apache.org>.
See <https://ci-beam.apache.org/job/beam_PostCommit_Python39/1508/display/redirect>

Changes:


------------------------------------------
[...truncated 11.77 MB...]
apache_beam/typehints/pandas_type_compatibility_test.py:67
apache_beam/typehints/pandas_type_compatibility_test.py:67
apache_beam/typehints/pandas_type_compatibility_test.py:67
apache_beam/typehints/pandas_type_compatibility_test.py:67
apache_beam/typehints/pandas_type_compatibility_test.py:67
apache_beam/typehints/pandas_type_compatibility_test.py:67
apache_beam/typehints/pandas_type_compatibility_test.py:67
apache_beam/typehints/pandas_type_compatibility_test.py:67
  <https://ci-beam.apache.org/job/beam_PostCommit_Python39/ws/src/sdks/python/apache_beam/typehints/pandas_type_compatibility_test.py>:67: FutureWarning: pandas.Int64Index is deprecated and will be removed from pandas in a future version. Use pandas.Index with the appropriate dtype instead.
    }).set_index(pd.Int64Index(range(123, 223), name='an_index')),

apache_beam/typehints/pandas_type_compatibility_test.py:90
apache_beam/typehints/pandas_type_compatibility_test.py:90
apache_beam/typehints/pandas_type_compatibility_test.py:90
apache_beam/typehints/pandas_type_compatibility_test.py:90
apache_beam/typehints/pandas_type_compatibility_test.py:90
apache_beam/typehints/pandas_type_compatibility_test.py:90
apache_beam/typehints/pandas_type_compatibility_test.py:90
apache_beam/typehints/pandas_type_compatibility_test.py:90
  <https://ci-beam.apache.org/job/beam_PostCommit_Python39/ws/src/sdks/python/apache_beam/typehints/pandas_type_compatibility_test.py>:90: FutureWarning: pandas.Int64Index is deprecated and will be removed from pandas in a future version. Use pandas.Index with the appropriate dtype instead.
    pd.Int64Index(range(123, 223), name='an_index'),

apache_beam/typehints/pandas_type_compatibility_test.py:91
apache_beam/typehints/pandas_type_compatibility_test.py:91
apache_beam/typehints/pandas_type_compatibility_test.py:91
apache_beam/typehints/pandas_type_compatibility_test.py:91
apache_beam/typehints/pandas_type_compatibility_test.py:91
apache_beam/typehints/pandas_type_compatibility_test.py:91
apache_beam/typehints/pandas_type_compatibility_test.py:91
apache_beam/typehints/pandas_type_compatibility_test.py:91
  <https://ci-beam.apache.org/job/beam_PostCommit_Python39/ws/src/sdks/python/apache_beam/typehints/pandas_type_compatibility_test.py>:91: FutureWarning: pandas.Int64Index is deprecated and will be removed from pandas in a future version. Use pandas.Index with the appropriate dtype instead.
    pd.Int64Index(range(475, 575), name='another_index'),

apache_beam/dataframe/io_it_test.py: 3 warnings
apache_beam/examples/cookbook/bigquery_tornadoes_it_test.py: 1 warning
apache_beam/examples/dataframe/flight_delays_it_test.py: 1 warning
apache_beam/io/gcp/bigquery_io_read_it_test.py: 2 warnings
apache_beam/io/gcp/bigquery_read_it_test.py: 7 warnings
apache_beam/io/gcp/bigquery_json_it_test.py: 3 warnings
apache_beam/io/gcp/big_query_query_to_table_it_test.py: 4 warnings
  <https://ci-beam.apache.org/job/beam_PostCommit_Python39/ws/src/sdks/python/apache_beam/io/gcp/bigquery.py>:2485: BeamDeprecationWarning: options is deprecated since First stable release. References to <pipeline>.options will not be supported
    temp_location = pcoll.pipeline.options.view_as(

apache_beam/dataframe/io_it_test.py: 3 warnings
apache_beam/examples/cookbook/bigquery_tornadoes_it_test.py: 1 warning
apache_beam/examples/dataframe/flight_delays_it_test.py: 1 warning
apache_beam/io/gcp/bigquery_io_read_it_test.py: 2 warnings
apache_beam/io/gcp/bigquery_read_it_test.py: 7 warnings
apache_beam/io/gcp/bigquery_json_it_test.py: 3 warnings
apache_beam/io/gcp/big_query_query_to_table_it_test.py: 4 warnings
  <https://ci-beam.apache.org/job/beam_PostCommit_Python39/ws/src/sdks/python/apache_beam/io/gcp/bigquery.py>:2487: BeamDeprecationWarning: options is deprecated since First stable release. References to <pipeline>.options will not be supported
    job_name = pcoll.pipeline.options.view_as(GoogleCloudOptions).job_name

apache_beam/dataframe/io_it_test.py: 3 warnings
apache_beam/examples/cookbook/bigquery_tornadoes_it_test.py: 1 warning
apache_beam/examples/dataframe/flight_delays_it_test.py: 1 warning
apache_beam/io/gcp/bigquery_io_read_it_test.py: 2 warnings
apache_beam/io/gcp/bigquery_read_it_test.py: 7 warnings
apache_beam/io/gcp/bigquery_json_it_test.py: 3 warnings
apache_beam/io/gcp/big_query_query_to_table_it_test.py: 4 warnings
  <https://ci-beam.apache.org/job/beam_PostCommit_Python39/ws/src/sdks/python/apache_beam/io/gcp/bigquery.py>:2511: BeamDeprecationWarning: options is deprecated since First stable release. References to <pipeline>.options will not be supported
    pipeline_options=pcoll.pipeline.options,

apache_beam/examples/complete/game/game_stats_it_test.py::GameStatsIT::test_game_stats_it
apache_beam/examples/complete/game/hourly_team_score_it_test.py::HourlyTeamScoreIT::test_hourly_team_score_it
apache_beam/examples/complete/game/leader_board_it_test.py::LeaderBoardIT::test_leader_board_it
apache_beam/io/gcp/bigquery_test.py::PubSubBigQueryIT::test_file_loads
apache_beam/io/gcp/bigquery_test.py::PubSubBigQueryIT::test_streaming_inserts
  <https://ci-beam.apache.org/job/beam_PostCommit_Python39/ws/src/sdks/python/apache_beam/io/gcp/tests/utils.py>:63: PendingDeprecationWarning: Client.dataset is deprecated and will be removed in a future version. Use a string like 'my_project.my_dataset' or a cloud.google.bigquery.DatasetReference object, instead.
    dataset_ref = client.dataset(unique_dataset_name, project=project)

apache_beam/examples/complete/game/game_stats_it_test.py: 2 warnings
apache_beam/examples/cookbook/bigquery_tornadoes_it_test.py: 1 warning
apache_beam/examples/complete/game/hourly_team_score_it_test.py: 1 warning
apache_beam/examples/complete/game/leader_board_it_test.py: 2 warnings
apache_beam/io/gcp/bigquery_file_loads_test.py: 3 warnings
apache_beam/io/gcp/bigquery_test.py: 6 warnings
apache_beam/io/gcp/bigquery_write_it_test.py: 4 warnings
apache_beam/io/gcp/bigquery_json_it_test.py: 2 warnings
apache_beam/io/gcp/big_query_query_to_table_it_test.py: 4 warnings
  <https://ci-beam.apache.org/job/beam_PostCommit_Python39/ws/src/sdks/python/apache_beam/io/gcp/bigquery.py>:1992: BeamDeprecationWarning: options is deprecated since First stable release. References to <pipeline>.options will not be supported
    is_streaming_pipeline = p.options.view_as(StandardOptions).streaming

apache_beam/examples/complete/game/game_stats_it_test.py: 2 warnings
apache_beam/examples/cookbook/bigquery_tornadoes_it_test.py: 1 warning
apache_beam/examples/complete/game/hourly_team_score_it_test.py: 1 warning
apache_beam/examples/complete/game/leader_board_it_test.py: 2 warnings
apache_beam/io/gcp/bigquery_file_loads_test.py: 3 warnings
apache_beam/io/gcp/bigquery_test.py: 6 warnings
apache_beam/io/gcp/bigquery_write_it_test.py: 4 warnings
apache_beam/io/gcp/bigquery_json_it_test.py: 2 warnings
apache_beam/io/gcp/big_query_query_to_table_it_test.py: 4 warnings
  <https://ci-beam.apache.org/job/beam_PostCommit_Python39/ws/src/sdks/python/apache_beam/io/gcp/bigquery.py>:1998: BeamDeprecationWarning: options is deprecated since First stable release. References to <pipeline>.options will not be supported
    experiments = p.options.view_as(DebugOptions).experiments or []

apache_beam/examples/cookbook/bigquery_tornadoes_it_test.py: 1 warning
apache_beam/io/gcp/bigquery_write_it_test.py: 4 warnings
apache_beam/io/gcp/bigquery_test.py: 2 warnings
apache_beam/io/gcp/big_query_query_to_table_it_test.py: 4 warnings
  <https://ci-beam.apache.org/job/beam_PostCommit_Python39/ws/src/sdks/python/apache_beam/io/gcp/bigquery.py>:1988: BeamDeprecationWarning: options is deprecated since First stable release. References to <pipeline>.options will not be supported
    self.table_reference.projectId = pcoll.pipeline.options.view_as(

apache_beam/examples/cookbook/bigquery_tornadoes_it_test.py: 1 warning
apache_beam/io/gcp/bigquery_file_loads_test.py: 3 warnings
apache_beam/io/gcp/bigquery_write_it_test.py: 3 warnings
apache_beam/io/gcp/bigquery_test.py: 3 warnings
apache_beam/io/gcp/big_query_query_to_table_it_test.py: 4 warnings
  <https://ci-beam.apache.org/job/beam_PostCommit_Python39/ws/src/sdks/python/apache_beam/io/gcp/bigquery_file_loads.py>:1166: BeamDeprecationWarning: options is deprecated since First stable release. References to <pipeline>.options will not be supported
    self.project = self.project or p.options.view_as(GoogleCloudOptions).project

apache_beam/examples/cookbook/bigquery_tornadoes_it_test.py: 1 warning
apache_beam/examples/complete/game/hourly_team_score_it_test.py: 1 warning
apache_beam/io/gcp/bigquery_file_loads_test.py: 3 warnings
apache_beam/io/gcp/bigquery_write_it_test.py: 3 warnings
apache_beam/io/gcp/bigquery_test.py: 3 warnings
apache_beam/io/gcp/big_query_query_to_table_it_test.py: 4 warnings
  <https://ci-beam.apache.org/job/beam_PostCommit_Python39/ws/src/sdks/python/apache_beam/io/gcp/bigquery_file_loads.py>:1173: BeamDeprecationWarning: options is deprecated since First stable release. References to <pipeline>.options will not be supported
    temp_location = p.options.view_as(GoogleCloudOptions).temp_location

apache_beam/examples/cookbook/bigquery_tornadoes_it_test.py: 1 warning
apache_beam/examples/complete/game/hourly_team_score_it_test.py: 1 warning
apache_beam/io/gcp/bigquery_file_loads_test.py: 3 warnings
apache_beam/io/gcp/bigquery_write_it_test.py: 3 warnings
apache_beam/io/gcp/bigquery_test.py: 3 warnings
apache_beam/io/gcp/big_query_query_to_table_it_test.py: 4 warnings
  <https://ci-beam.apache.org/job/beam_PostCommit_Python39/ws/src/sdks/python/apache_beam/io/gcp/bigquery_file_loads.py>:1175: BeamDeprecationWarning: options is deprecated since First stable release. References to <pipeline>.options will not be supported
    p.options.view_as(GoogleCloudOptions).job_name or 'AUTOMATIC_JOB_NAME')

apache_beam/examples/cookbook/bigquery_tornadoes_it_test.py::BigqueryTornadoesIT::test_bigquery_tornadoes_it
  <https://ci-beam.apache.org/job/beam_PostCommit_Python39/ws/src/sdks/python/apache_beam/io/gcp/tests/utils.py>:100: PendingDeprecationWarning: Client.dataset is deprecated and will be removed in a future version. Use a string like 'my_project.my_dataset' or a cloud.google.bigquery.DatasetReference object, instead.
    table_ref = client.dataset(dataset_id).table(table_id)

apache_beam/dataframe/io_it_test.py: 2 warnings
apache_beam/io/gcp/bigquery_json_it_test.py: 1 warning
apache_beam/io/gcp/bigquery_read_it_test.py: 9 warnings
  <https://ci-beam.apache.org/job/beam_PostCommit_Python39/ws/src/sdks/python/apache_beam/io/gcp/bigquery.py>:2529: BeamDeprecationWarning: options is deprecated since First stable release. References to <pipeline>.options will not be supported
    project_id = pcoll.pipeline.options.view_as(GoogleCloudOptions).project

apache_beam/dataframe/io_it_test.py: 2 warnings
apache_beam/io/gcp/bigquery_json_it_test.py: 1 warning
apache_beam/io/gcp/bigquery_read_it_test.py: 9 warnings
  <https://ci-beam.apache.org/job/beam_PostCommit_Python39/ws/src/sdks/python/apache_beam/io/gcp/bigquery.py>:2550: BeamDeprecationWarning: options is deprecated since First stable release. References to <pipeline>.options will not be supported
    pipeline_options=pcoll.pipeline.options,

apache_beam/examples/dataframe/flight_delays_it_test.py::FlightDelaysTest::test_flight_delays
  <https://ci-beam.apache.org/job/beam_PostCommit_Python39/ws/src/sdks/python/apache_beam/examples/dataframe/flight_delays.py>:47: FutureWarning: The default value of numeric_only in DataFrame.mean is deprecated. In a future version, it will default to False. In addition, specifying 'numeric_only=None' is deprecated. Select only valid columns or specify the value of numeric_only to silence this warning.
    return airline_df[at_top_airports].mean()

apache_beam/examples/dataframe/flight_delays_it_test.py::FlightDelaysTest::test_flight_delays
apache_beam/examples/dataframe/taxiride_it_test.py::TaxirideIT::test_aggregation
apache_beam/examples/dataframe/taxiride_it_test.py::TaxirideIT::test_enrich
  <https://ci-beam.apache.org/job/beam_PostCommit_Python39/ws/src/sdks/python/apache_beam/dataframe/io.py>:659: FutureWarning: WriteToFiles is experimental.
    return pcoll | fileio.WriteToFiles(

apache_beam/examples/dataframe/flight_delays_it_test.py::FlightDelaysTest::test_flight_delays
apache_beam/examples/dataframe/taxiride_it_test.py::TaxirideIT::test_aggregation
apache_beam/examples/dataframe/taxiride_it_test.py::TaxirideIT::test_enrich
  <https://ci-beam.apache.org/job/beam_PostCommit_Python39/ws/src/sdks/python/apache_beam/io/fileio.py>:593: BeamDeprecationWarning: options is deprecated since First stable release. References to <pipeline>.options will not be supported
    p.options.view_as(GoogleCloudOptions).temp_location or

apache_beam/io/gcp/bigquery_test.py::BigQueryStreamingInsertTransformIntegrationTests::test_multiple_destinations_transform
  <https://ci-beam.apache.org/job/beam_PostCommit_Python39/ws/src/sdks/python/apache_beam/io/gcp/bigquery_test.py>:1690: BeamDeprecationWarning: options is deprecated since First stable release. References to <pipeline>.options will not be supported
    streaming = self.test_pipeline.options.view_as(StandardOptions).streaming

apache_beam/io/gcp/bigquery_read_it_test.py::ReadTests::test_native_source
  <https://ci-beam.apache.org/job/beam_PostCommit_Python39/ws/src/sdks/python/apache_beam/io/gcp/bigquery_read_it_test.py>:170: BeamDeprecationWarning: BigQuerySource is deprecated since 2.25.0. Use ReadFromBigQuery instead.
    beam.io.BigQuerySource(query=self.query, use_standard_sql=True)))

apache_beam/ml/gcp/cloud_dlp_it_test.py::CloudDLPIT::test_deidentification
  <https://ci-beam.apache.org/job/beam_PostCommit_Python39/ws/src/sdks/python/apache_beam/ml/gcp/cloud_dlp_it_test.py>:74: FutureWarning: MaskDetectedDetails is experimental.
    | MaskDetectedDetails(

apache_beam/ml/gcp/cloud_dlp_it_test.py::CloudDLPIT::test_inspection
  <https://ci-beam.apache.org/job/beam_PostCommit_Python39/ws/src/sdks/python/apache_beam/ml/gcp/cloud_dlp_it_test.py>:85: FutureWarning: InspectForDetails is experimental.
    | InspectForDetails(

apache_beam/ml/inference/sklearn_inference_it_test.py::SklearnInference::test_sklearn_regression
  <https://ci-beam.apache.org/job/beam_PostCommit_Python39/ws/src/sdks/python/apache_beam/examples/inference/sklearn_japanese_housing_regression.py>:128: FutureWarning: SklearnModelHandlerPandas is experimental. No backwards-compatibility guarantees.
    model_loader = SklearnModelHandlerPandas(

apache_beam/ml/inference/sklearn_inference_it_test.py::SklearnInference::test_sklearn_regression
  <https://ci-beam.apache.org/job/beam_PostCommit_Python39/ws/src/build/gradleenv/-1734967050/lib/python3.9/site-packages/dill/_dill.py>:472: FutureWarning: SklearnModelHandlerPandas is experimental. No backwards-compatibility guarantees.
    obj = StockUnpickler.load(self)

apache_beam/io/gcp/bigquery_read_it_test.py::ReadNewTypesTests::test_native_source
  <https://ci-beam.apache.org/job/beam_PostCommit_Python39/ws/src/sdks/python/apache_beam/io/gcp/bigquery_read_it_test.py>:693: BeamDeprecationWarning: BigQuerySource is deprecated since 2.25.0. Use ReadFromBigQuery instead.
    beam.io.BigQuerySource(query=self.query, use_standard_sql=True)))

apache_beam/io/gcp/bigquery_read_it_test.py::ReadAllBQTests::test_read_queries
  <https://ci-beam.apache.org/job/beam_PostCommit_Python39/ws/src/sdks/python/apache_beam/io/gcp/bigquery_read_it_test.py>:808: FutureWarning: ReadAllFromBigQuery is experimental.
    | beam.io.ReadAllFromBigQuery())

apache_beam/io/gcp/bigquery_read_it_test.py::ReadAllBQTests::test_read_queries
  <https://ci-beam.apache.org/job/beam_PostCommit_Python39/ws/src/sdks/python/apache_beam/io/gcp/bigquery.py>:2658: BeamDeprecationWarning: options is deprecated since First stable release. References to <pipeline>.options will not be supported
    job_name = pcoll.pipeline.options.view_as(GoogleCloudOptions).job_name

apache_beam/io/gcp/bigquery_read_it_test.py::ReadAllBQTests::test_read_queries
  <https://ci-beam.apache.org/job/beam_PostCommit_Python39/ws/src/sdks/python/apache_beam/io/gcp/bigquery.py>:2659: BeamDeprecationWarning: options is deprecated since First stable release. References to <pipeline>.options will not be supported
    project = pcoll.pipeline.options.view_as(GoogleCloudOptions).project

apache_beam/io/gcp/bigquery_read_it_test.py::ReadAllBQTests::test_read_queries
  <https://ci-beam.apache.org/job/beam_PostCommit_Python39/ws/src/sdks/python/apache_beam/io/gcp/bigquery.py>:2672: BeamDeprecationWarning: options is deprecated since First stable release. References to <pipeline>.options will not be supported
    options=pcoll.pipeline.options,

-- Docs: https://docs.pytest.org/en/stable/how-to/capture-warnings.html
- generated xml file: <https://ci-beam.apache.org/job/beam_PostCommit_Python39/ws/src/sdks/python/pytest_postCommitIT-df-py39.xml> -
=========================== short test summary info ============================
FAILED apache_beam/examples/streaming_wordcount_it_test.py::StreamingWordCountIT::test_streaming_wordcount_it - AssertionError: 
Expected: (Test pipeline expected terminated in state: RUNNING and Expected 500 messages.)
     but: Expected 500 messages. Got 0 messages. Diffs (item, count):
  Expected but not in actual: dict_items([(b'0: 1', 1), (b'1: 1', 1), (b'2: 1', 1), (b'3: 1', 1), (b'4: 1', 1), (b'5: 1', 1), (b'6: 1', 1), (b'7: 1', 1), (b'8: 1', 1), (b'9: 1', 1), (b'10: 1', 1), (b'11: 1', 1), (b'12: 1', 1), (b'13: 1', 1), (b'14: 1', 1), (b'15: 1', 1), (b'16: 1', 1), (b'17: 1', 1), (b'18: 1', 1), (b'19: 1', 1), (b'20: 1', 1), (b'21: 1', 1), (b'22: 1', 1), (b'23: 1', 1), (b'24: 1', 1), (b'25: 1', 1), (b'26: 1', 1), (b'27: 1', 1), (b'28: 1', 1), (b'29: 1', 1), (b'30: 1', 1), (b'31: 1', 1), (b'32: 1', 1), (b'33: 1', 1), (b'34: 1', 1), (b'35: 1', 1), (b'36: 1', 1), (b'37: 1', 1), (b'38: 1', 1), (b'39: 1', 1), (b'40: 1', 1), (b'41: 1', 1), (b'42: 1', 1), (b'43: 1', 1), (b'44: 1', 1), (b'45: 1', 1), (b'46: 1', 1), (b'47: 1', 1), (b'48: 1', 1), (b'49: 1', 1), (b'50: 1', 1), (b'51: 1', 1), (b'52: 1', 1), (b'53: 1', 1), (b'54: 1', 1), (b'55: 1', 1), (b'56: 1', 1), (b'57: 1', 1), (b'58: 1', 1), (b'59: 1', 1), (b'60: 1', 1), (b'61: 1', 1), (b'62: 1', 1), (b'63: 1', 1), (b'64: 1', 1), (b'65: 1', 1), (b'66: 1', 1), (b'67: 1', 1), (b'68: 1', 1), (b'69: 1', 1), (b'70: 1', 1), (b'71: 1', 1), (b'72: 1', 1), (b'73: 1', 1), (b'74: 1', 1), (b'75: 1', 1), (b'76: 1', 1), (b'77: 1', 1), (b'78: 1', 1), (b'79: 1', 1), (b'80: 1', 1), (b'81: 1', 1), (b'82: 1', 1), (b'83: 1', 1), (b'84: 1', 1), (b'85: 1', 1), (b'86: 1', 1), (b'87: 1', 1), (b'88: 1', 1), (b'89: 1', 1), (b'90: 1', 1), (b'91: 1', 1), (b'92: 1', 1), (b'93: 1', 1), (b'94: 1', 1), (b'95: 1', 1), (b'96: 1', 1), (b'97: 1', 1), (b'98: 1', 1), (b'99: 1', 1), (b'100: 1', 1), (b'101: 1', 1), (b'102: 1', 1), (b'103: 1', 1), (b'104: 1', 1), (b'105: 1', 1), (b'106: 1', 1), (b'107: 1', 1), (b'108: 1', 1), (b'109: 1', 1), (b'110: 1', 1), (b'111: 1', 1), (b'112: 1', 1), (b'113: 1', 1), (b'114: 1', 1), (b'115: 1', 1), (b'116: 1', 1), (b'117: 1', 1), (b'118: 1', 1), (b'119: 1', 1), (b'120: 1', 1), (b'121: 1', 1), (b'122: 1', 1), (b'123: 1', 1), (b'124: 1', 1), (b'125: 1', 1), (b'126: 1', 1), (b'127: 1', 1), (b'128: 1', 1), (b'129: 1', 1), (b'130: 1', 1), (b'131: 1', 1), (b'132: 1', 1), (b'133: 1', 1), (b'134: 1', 1), (b'135: 1', 1), (b'136: 1', 1), (b'137: 1', 1), (b'138: 1', 1), (b'139: 1', 1), (b'140: 1', 1), (b'141: 1', 1), (b'142: 1', 1), (b'143: 1', 1), (b'144: 1', 1), (b'145: 1', 1), (b'146: 1', 1), (b'147: 1', 1), (b'148: 1', 1), (b'149: 1', 1), (b'150: 1', 1), (b'151: 1', 1), (b'152: 1', 1), (b'153: 1', 1), (b'154: 1', 1), (b'155: 1', 1), (b'156: 1', 1), (b'157: 1', 1), (b'158: 1', 1), (b'159: 1', 1), (b'160: 1', 1), (b'161: 1', 1), (b'162: 1', 1), (b'163: 1', 1), (b'164: 1', 1), (b'165: 1', 1), (b'166: 1', 1), (b'167: 1', 1), (b'168: 1', 1), (b'169: 1', 1), (b'170: 1', 1), (b'171: 1', 1), (b'172: 1', 1), (b'173: 1', 1), (b'174: 1', 1), (b'175: 1', 1), (b'176: 1', 1), (b'177: 1', 1), (b'178: 1', 1), (b'179: 1', 1), (b'180: 1', 1), (b'181: 1', 1), (b'182: 1', 1), (b'183: 1', 1), (b'184: 1', 1), (b'185: 1', 1), (b'186: 1', 1), (b'187: 1', 1), (b'188: 1', 1), (b'189: 1', 1), (b'190: 1', 1), (b'191: 1', 1), (b'192: 1', 1), (b'193: 1', 1), (b'194: 1', 1), (b'195: 1', 1), (b'196: 1', 1), (b'197: 1', 1), (b'198: 1', 1), (b'199: 1', 1), (b'200: 1', 1), (b'201: 1', 1), (b'202: 1', 1), (b'203: 1', 1), (b'204: 1', 1), (b'205: 1', 1), (b'206: 1', 1), (b'207: 1', 1), (b'208: 1', 1), (b'209: 1', 1), (b'210: 1', 1), (b'211: 1', 1), (b'212: 1', 1), (b'213: 1', 1), (b'214: 1', 1), (b'215: 1', 1), (b'216: 1', 1), (b'217: 1', 1), (b'218: 1', 1), (b'219: 1', 1), (b'220: 1', 1), (b'221: 1', 1), (b'222: 1', 1), (b'223: 1', 1), (b'224: 1', 1), (b'225: 1', 1), (b'226: 1', 1), (b'227: 1', 1), (b'228: 1', 1), (b'229: 1', 1), (b'230: 1', 1), (b'231: 1', 1), (b'232: 1', 1), (b'233: 1', 1), (b'234: 1', 1), (b'235: 1', 1), (b'236: 1', 1), (b'237: 1', 1), (b'238: 1', 1), (b'239: 1', 1), (b'240: 1', 1), (b'241: 1', 1), (b'242: 1', 1), (b'243: 1', 1), (b'244: 1', 1), (b'245: 1', 1), (b'246: 1', 1), (b'247: 1', 1), (b'248: 1', 1), (b'249: 1', 1), (b'250: 1', 1), (b'251: 1', 1), (b'252: 1', 1), (b'253: 1', 1), (b'254: 1', 1), (b'255: 1', 1), (b'256: 1', 1), (b'257: 1', 1), (b'258: 1', 1), (b'259: 1', 1), (b'260: 1', 1), (b'261: 1', 1), (b'262: 1', 1), (b'263: 1', 1), (b'264: 1', 1), (b'265: 1', 1), (b'266: 1', 1), (b'267: 1', 1), (b'268: 1', 1), (b'269: 1', 1), (b'270: 1', 1), (b'271: 1', 1), (b'272: 1', 1), (b'273: 1', 1), (b'274: 1', 1), (b'275: 1', 1), (b'276: 1', 1), (b'277: 1', 1), (b'278: 1', 1), (b'279: 1', 1), (b'280: 1', 1), (b'281: 1', 1), (b'282: 1', 1), (b'283: 1', 1), (b'284: 1', 1), (b'285: 1', 1), (b'286: 1', 1), (b'287: 1', 1), (b'288: 1', 1), (b'289: 1', 1), (b'290: 1', 1), (b'291: 1', 1), (b'292: 1', 1), (b'293: 1', 1), (b'294: 1', 1), (b'295: 1', 1), (b'296: 1', 1), (b'297: 1', 1), (b'298: 1', 1), (b'299: 1', 1), (b'300: 1', 1), (b'301: 1', 1), (b'302: 1', 1), (b'303: 1', 1), (b'304: 1', 1), (b'305: 1', 1), (b'306: 1', 1), (b'307: 1', 1), (b'308: 1', 1), (b'309: 1', 1), (b'310: 1', 1), (b'311: 1', 1), (b'312: 1', 1), (b'313: 1', 1), (b'314: 1', 1), (b'315: 1', 1), (b'316: 1', 1), (b'317: 1', 1), (b'318: 1', 1), (b'319: 1', 1), (b'320: 1', 1), (b'321: 1', 1), (b'322: 1', 1), (b'323: 1', 1), (b'324: 1', 1), (b'325: 1', 1), (b'326: 1', 1), (b'327: 1', 1), (b'328: 1', 1), (b'329: 1', 1), (b'330: 1', 1), (b'331: 1', 1), (b'332: 1', 1), (b'333: 1', 1), (b'334: 1', 1), (b'335: 1', 1), (b'336: 1', 1), (b'337: 1', 1), (b'338: 1', 1), (b'339: 1', 1), (b'340: 1', 1), (b'341: 1', 1), (b'342: 1', 1), (b'343: 1', 1), (b'344: 1', 1), (b'345: 1', 1), (b'346: 1', 1), (b'347: 1', 1), (b'348: 1', 1), (b'349: 1', 1), (b'350: 1', 1), (b'351: 1', 1), (b'352: 1', 1), (b'353: 1', 1), (b'354: 1', 1), (b'355: 1', 1), (b'356: 1', 1), (b'357: 1', 1), (b'358: 1', 1), (b'359: 1', 1), (b'360: 1', 1), (b'361: 1', 1), (b'362: 1', 1), (b'363: 1', 1), (b'364: 1', 1), (b'365: 1', 1), (b'366: 1', 1), (b'367: 1', 1), (b'368: 1', 1), (b'369: 1', 1), (b'370: 1', 1), (b'371: 1', 1), (b'372: 1', 1), (b'373: 1', 1), (b'374: 1', 1), (b'375: 1', 1), (b'376: 1', 1), (b'377: 1', 1), (b'378: 1', 1), (b'379: 1', 1), (b'380: 1', 1), (b'381: 1', 1), (b'382: 1', 1), (b'383: 1', 1), (b'384: 1', 1), (b'385: 1', 1), (b'386: 1', 1), (b'387: 1', 1), (b'388: 1', 1), (b'389: 1', 1), (b'390: 1', 1), (b'391: 1', 1), (b'392: 1', 1), (b'393: 1', 1), (b'394: 1', 1), (b'395: 1', 1), (b'396: 1', 1), (b'397: 1', 1), (b'398: 1', 1), (b'399: 1', 1), (b'400: 1', 1), (b'401: 1', 1), (b'402: 1', 1), (b'403: 1', 1), (b'404: 1', 1), (b'405: 1', 1), (b'406: 1', 1), (b'407: 1', 1), (b'408: 1', 1), (b'409: 1', 1), (b'410: 1', 1), (b'411: 1', 1), (b'412: 1', 1), (b'413: 1', 1), (b'414: 1', 1), (b'415: 1', 1), (b'416: 1', 1), (b'417: 1', 1), (b'418: 1', 1), (b'419: 1', 1), (b'420: 1', 1), (b'421: 1', 1), (b'422: 1', 1), (b'423: 1', 1), (b'424: 1', 1), (b'425: 1', 1), (b'426: 1', 1), (b'427: 1', 1), (b'428: 1', 1), (b'429: 1', 1), (b'430: 1', 1), (b'431: 1', 1), (b'432: 1', 1), (b'433: 1', 1), (b'434: 1', 1), (b'435: 1', 1), (b'436: 1', 1), (b'437: 1', 1), (b'438: 1', 1), (b'439: 1', 1), (b'440: 1', 1), (b'441: 1', 1), (b'442: 1', 1), (b'443: 1', 1), (b'444: 1', 1), (b'445: 1', 1), (b'446: 1', 1), (b'447: 1', 1), (b'448: 1', 1), (b'449: 1', 1), (b'450: 1', 1), (b'451: 1', 1), (b'452: 1', 1), (b'453: 1', 1), (b'454: 1', 1), (b'455: 1', 1), (b'456: 1', 1), (b'457: 1', 1), (b'458: 1', 1), (b'459: 1', 1), (b'460: 1', 1), (b'461: 1', 1), (b'462: 1', 1), (b'463: 1', 1), (b'464: 1', 1), (b'465: 1', 1), (b'466: 1', 1), (b'467: 1', 1), (b'468: 1', 1), (b'469: 1', 1), (b'470: 1', 1), (b'471: 1', 1), (b'472: 1', 1), (b'473: 1', 1), (b'474: 1', 1), (b'475: 1', 1), (b'476: 1', 1), (b'477: 1', 1), (b'478: 1', 1), (b'479: 1', 1), (b'480: 1', 1), (b'481: 1', 1), (b'482: 1', 1), (b'483: 1', 1), (b'484: 1', 1), (b'485: 1', 1), (b'486: 1', 1), (b'487: 1', 1), (b'488: 1', 1), (b'489: 1', 1), (b'490: 1', 1), (b'491: 1', 1), (b'492: 1', 1), (b'493: 1', 1), (b'494: 1', 1), (b'495: 1', 1), (b'496: 1', 1), (b'497: 1', 1), (b'498: 1', 1), (b'499: 1', 1)])
  Unexpected: dict_items([])
  Unexpected (with all details): []
===== 1 failed, 84 passed, 28 skipped, 608 warnings in 14066.97s (3:54:26) =====

> Task :sdks:python:test-suites:dataflow:py39:postCommitIT FAILED

FAILURE: Build failed with an exception.

* Where:
Script '<https://ci-beam.apache.org/job/beam_PostCommit_Python39/ws/src/sdks/python/test-suites/dataflow/common.gradle'> line: 111

* What went wrong:
Execution failed for task ':sdks:python:test-suites:dataflow:py39:postCommitIT'.
> Process 'command 'sh'' finished with non-zero exit value 1

* Try:
> Run with --stacktrace option to get the stack trace.
> Run with --info or --debug option to get more log output.

* Get more help at https://help.gradle.org

Deprecated Gradle features were used in this build, making it incompatible with Gradle 8.0.

You can use '--warning-mode all' to show the individual deprecation warnings and determine if they come from your own scripts or plugins.

See https://docs.gradle.org/7.5.1/userguide/command_line_interface.html#sec:command_line_warnings

Execution optimizations have been disabled for 1 invalid unit(s) of work during this build to ensure correctness.
Please consult deprecation warnings for more details.

BUILD FAILED in 3h 56m 26s
211 actionable tasks: 146 executed, 59 from cache, 6 up-to-date

Publishing build scan...
https://gradle.com/s/b6tslfiwkbywu

Build step 'Invoke Gradle script' changed build result to FAILURE
Build step 'Invoke Gradle script' marked build as failure

---------------------------------------------------------------------
To unsubscribe, e-mail: builds-unsubscribe@beam.apache.org
For additional commands, e-mail: builds-help@beam.apache.org