You are viewing a plain text version of this content. The canonical link for it is here.
Posted to yarn-dev@hadoop.apache.org by Apache Jenkins Server <je...@builds.apache.org> on 2015/01/29 01:53:09 UTC
Failed: YARN-3101 PreCommit Build #6447
Jira: https://issues.apache.org/jira/browse/YARN-3101
Build: https://builds.apache.org/job/PreCommit-YARN-Build/6447/
###################################################################################
########################## LAST 60 LINES OF THE CONSOLE ###########################
[...truncated 57 lines...]
scheduler.handle(updateEvent);
assertEquals(1, app.getLiveContainers().size());
// Reserved container will be at higher priority,
// since old reservation cannot be satisfied
for (RMContainer container : app.getReservedContainers()) {
assertEquals(1, container.getReservedPriority().getPriority());
}
// Complete container
error: patch failed: hadoop-yarn-project/hadoop-yarn/hadoop-yarn-server/hadoop-yarn-server-resourcemanager/src/test/java/org/apache/hadoop/yarn/server/resourcemanager/scheduler/fair/TestFairScheduler.java:1656
error: hadoop-yarn-project/hadoop-yarn/hadoop-yarn-server/hadoop-yarn-server-resourcemanager/src/test/java/org/apache/hadoop/yarn/server/resourcemanager/scheduler/fair/TestFairScheduler.java: patch does not apply
PATCH APPLICATION FAILED
{color:red}-1 overall{color}. Here are the results of testing the latest attachment
http://issues.apache.org/jira/secure/attachment/12695141/YARN-3101-Siqi.v1.patch
against trunk revision 5a0051f.
{color:red}-1 patch{color}. The patch command could not apply the patch.
Console output: https://builds.apache.org/job/PreCommit-YARN-Build/6447//console
This message is automatically generated.
======================================================================
======================================================================
Adding comment to Jira.
======================================================================
======================================================================
Comment added.
d2409a8149d31f38124e6a56feb87d70cc5beed4 logged out
======================================================================
======================================================================
Finished build.
======================================================================
======================================================================
Build step 'Execute shell' marked build as failure
Archiving artifacts
Sending artifact delta relative to PreCommit-YARN-Build #6443
Archived 15 artifacts
Archive block size is 32768
Received 56 blocks and 7001411 bytes
Compression is 20.8%
Took 1.7 sec
[description-setter] Could not determine description.
Recording test results
Email was triggered for: Failure
Sending email for trigger: Failure
###################################################################################
############################## FAILED TESTS (if any) ##############################
No tests ran.
Success: YARN-3077 PreCommit Build #6450
Posted by Apache Jenkins Server <je...@builds.apache.org>.
Jira: https://issues.apache.org/jira/browse/YARN-3077
Build: https://builds.apache.org/job/PreCommit-YARN-Build/6450/
###################################################################################
########################## LAST 60 LINES OF THE CONSOLE ###########################
[...truncated 3299 lines...]
{color:green}+1 overall{color}. Here are the results of testing the latest attachment
http://issues.apache.org/jira/secure/attachment/12695162/YARN-3077.3.patch
against trunk revision 5a0051f.
{color:green}+1 @author{color}. The patch does not contain any @author tags.
{color:green}+1 tests included{color}. The patch appears to include 1 new or modified test files.
{color:green}+1 javac{color}. The applied patch does not increase the total number of javac compiler warnings.
{color:green}+1 javadoc{color}. There were no new javadoc warning messages.
{color:green}+1 eclipse:eclipse{color}. The patch built with eclipse:eclipse.
{color:green}+1 findbugs{color}. The patch does not introduce any new Findbugs (version 2.0.3) warnings.
{color:green}+1 release audit{color}. The applied patch does not increase the total number of release audit warnings.
{color:green}+1 core tests{color}. The patch passed unit tests in hadoop-yarn-project/hadoop-yarn/hadoop-yarn-server/hadoop-yarn-server-resourcemanager.
Test results: https://builds.apache.org/job/PreCommit-YARN-Build/6450//testReport/
Console output: https://builds.apache.org/job/PreCommit-YARN-Build/6450//console
This message is automatically generated.
======================================================================
======================================================================
Adding comment to Jira.
======================================================================
======================================================================
Comment added.
55425a1992788732877669e44cf233f2f86d67c1 logged out
======================================================================
======================================================================
Finished build.
======================================================================
======================================================================
Archiving artifacts
Sending artifact delta relative to PreCommit-YARN-Build #6443
Archived 15 artifacts
Archive block size is 32768
Received 156 blocks and 2128845 bytes
Compression is 70.6%
Took 0.75 sec
Description set: YARN-3077
Recording test results
Email was triggered for: Success
Sending email for trigger: Success
###################################################################################
############################## FAILED TESTS (if any) ##############################
All tests passed
Failed: YARN-3101 PreCommit Build #6449
Posted by Apache Jenkins Server <je...@builds.apache.org>.
Jira: https://issues.apache.org/jira/browse/YARN-3101
Build: https://builds.apache.org/job/PreCommit-YARN-Build/6449/
###################################################################################
########################## LAST 60 LINES OF THE CONSOLE ###########################
[...truncated 3517 lines...]
{color:red}-1 overall{color}. Here are the results of testing the latest attachment
http://issues.apache.org/jira/secure/attachment/12695156/YARN-3101-Siqi.v1.patch
against trunk revision 5a0051f.
{color:green}+1 @author{color}. The patch does not contain any @author tags.
{color:green}+1 tests included{color}. The patch appears to include 1 new or modified test files.
{color:green}+1 javac{color}. The applied patch does not increase the total number of javac compiler warnings.
{color:green}+1 javadoc{color}. There were no new javadoc warning messages.
{color:green}+1 eclipse:eclipse{color}. The patch built with eclipse:eclipse.
{color:green}+1 findbugs{color}. The patch does not introduce any new Findbugs (version 2.0.3) warnings.
{color:green}+1 release audit{color}. The applied patch does not increase the total number of release audit warnings.
{color:red}-1 core tests{color}. The patch failed these unit tests in hadoop-yarn-project/hadoop-yarn/hadoop-yarn-common hadoop-yarn-project/hadoop-yarn/hadoop-yarn-server/hadoop-yarn-server-resourcemanager:
org.apache.hadoop.yarn.server.resourcemanager.recovery.TestFSRMStateStore
Test results: https://builds.apache.org/job/PreCommit-YARN-Build/6449//testReport/
Console output: https://builds.apache.org/job/PreCommit-YARN-Build/6449//console
This message is automatically generated.
======================================================================
======================================================================
Adding comment to Jira.
======================================================================
======================================================================
Comment added.
e6fadbfb1c9f7ed2a9b74889f50798d3dd785bcb logged out
======================================================================
======================================================================
Finished build.
======================================================================
======================================================================
Build step 'Execute shell' marked build as failure
Archiving artifacts
Sending artifact delta relative to PreCommit-YARN-Build #6443
Archived 20 artifacts
Archive block size is 32768
Received 63 blocks and 7085642 bytes
Compression is 22.6%
Took 1.8 sec
[description-setter] Could not determine description.
Recording test results
Email was triggered for: Failure
Sending email for trigger: Failure
###################################################################################
############################## FAILED TESTS (if any) ##############################
1 tests failed.
FAILED: org.apache.hadoop.yarn.server.resourcemanager.recovery.TestFSRMStateStore.testFSRMStateStoreClientRetry
Error Message:
null
Stack Trace:
java.lang.AssertionError: null
at org.junit.Assert.fail(Assert.java:86)
at org.junit.Assert.assertTrue(Assert.java:41)
at org.junit.Assert.assertFalse(Assert.java:64)
at org.junit.Assert.assertFalse(Assert.java:74)
at org.apache.hadoop.yarn.server.resourcemanager.recovery.TestFSRMStateStore.testFSRMStateStoreClientRetry(TestFSRMStateStore.java:289)
Failed: YARN-3099 PreCommit Build #6448
Posted by Apache Jenkins Server <je...@builds.apache.org>.
Jira: https://issues.apache.org/jira/browse/YARN-3099
Build: https://builds.apache.org/job/PreCommit-YARN-Build/6448/
###################################################################################
########################## LAST 60 LINES OF THE CONSOLE ###########################
[...truncated 3020 lines...]
/bin/grep: /home/jenkins/jenkins-slave/workspace/PreCommit-YARN-Build/../patchprocess/patch: No such file or directory
cat: /tmp/tmp.modules.28425: No such file or directory
rm: cannot remove '/tmp/tmp.modules.28425': No such file or directory
{color:green}+1 overall{color}. Here are the results of testing the latest attachment
http://issues.apache.org/jira/secure/attachment/12695151/YARN-3099.4.patch
against trunk revision 5a0051f.
{color:green}+1 @author{color}. The patch does not contain any @author tags.
{color:green}+1 tests included{color}. The patch appears to include 2 new or modified test files.
{color:green}+1 javac{color}. The applied patch does not increase the total number of javac compiler warnings.
{color:green}+1 javadoc{color}. There were no new javadoc warning messages.
{color:green}+1 eclipse:eclipse{color}. The patch built with eclipse:eclipse.
{color:green}+1 findbugs{color}. The patch does not introduce any new Findbugs (version 2.0.3) warnings.
{color:green}+1 release audit{color}. The applied patch does not increase the total number of release audit warnings.
{color:green}+1 core tests{color}. The patch passed unit tests in .
Test results: https://builds.apache.org/job/PreCommit-YARN-Build/6448//testReport/
Console output: https://builds.apache.org/job/PreCommit-YARN-Build/6448//console
This message is automatically generated.
======================================================================
======================================================================
Adding comment to Jira.
======================================================================
======================================================================
Comment added.
e22d015597d89b28902f54b2ec283b97d96598da logged out
======================================================================
======================================================================
Finished build.
======================================================================
======================================================================
Archiving artifacts
ERROR: No artifacts found that match the file pattern "patchprocess/*.*". Configuration error?
ERROR: ?patchprocess/*.*? doesn?t match anything, but ?*.*? does. Perhaps that?s what you mean?
Build step 'Archive the artifacts' changed build result to FAILURE
[description-setter] Could not determine description.
Recording test results
Email was triggered for: Failure
Sending email for trigger: Failure
###################################################################################
############################## FAILED TESTS (if any) ##############################
No tests ran.