You are viewing a plain text version of this content. The canonical link for it is here.
Posted to builds@lucene.apache.org by Apache Jenkins Server <je...@builds.apache.org> on 2025/04/23 02:41:18 UTC

[JENKINS] Lucene » Lucene-Maven-Snapshots-main - Build # 2161 - Failure!

Build: https://ci-builds.apache.org/job/Lucene/job/Lucene-Maven-Snapshots-main/2161/

No tests ran.

Build Log:
[...truncated 77 lines...]
BUILD FAILED in 59s
22 actionable tasks: 22 executed

Publishing build scan...
https://develocity.apache.org/s/z2dtk23uvgoay

Build step 'Invoke Gradle script' changed build result to FAILURE
Build step 'Invoke Gradle script' marked build as failure
Email was triggered for: Failure - Any
Sending email for trigger: Failure - Any

Re: [JENKINS] Lucene » Lucene-Maven-Snapshots-main - Build # 2161 - Failure!

Posted by Dawid Weiss <da...@gmail.com>.
This ran on lucene-solr-4 and some credentials to upload to
ApacheSnapshots seem to be missing:

* What went wrong:
Execution failed for task
':lucene:backward-codecs:publishJarsPublicationToApacheSnapshotsRepository'.
> Failed to publish publication 'jars' to repository 'ApacheSnapshots'
   > Could not PUT
'https://repository.apache.org/content/repositories/snapshots/org/apache/lucene/lucene-backward-codecs/11.0.0-SNAPSHOT/lucene-backward-codecs-11.0.0-20250423.024018-190.jar'.
Received status code 401 from server: Unauthorized

On Wed, Apr 23, 2025 at 4:41 AM Apache Jenkins Server
<je...@builds.apache.org> wrote:
>
> Build: https://ci-builds.apache.org/job/Lucene/job/Lucene-Maven-Snapshots-main/2161/
>
> No tests ran.
>
> Build Log:
> [...truncated 77 lines...]
> BUILD FAILED in 59s
> 22 actionable tasks: 22 executed
>
> Publishing build scan...
> https://develocity.apache.org/s/z2dtk23uvgoay
>
> Build step 'Invoke Gradle script' changed build result to FAILURE
> Build step 'Invoke Gradle script' marked build as failure
> Email was triggered for: Failure - Any
> Sending email for trigger: Failure - Any
>
> ---------------------------------------------------------------------
> To unsubscribe, e-mail: builds-unsubscribe@lucene.apache.org
> For additional commands, e-mail: builds-help@lucene.apache.org

---------------------------------------------------------------------
To unsubscribe, e-mail: builds-unsubscribe@lucene.apache.org
For additional commands, e-mail: builds-help@lucene.apache.org


Re: [JENKINS] Lucene » Lucene-Maven-Snapshots-main - Build # 2161 - Failure!

Posted by Dawid Weiss <da...@gmail.com>.
This ran on lucene-solr-4 and some credentials to upload to
ApacheSnapshots seem to be missing:

* What went wrong:
Execution failed for task
':lucene:backward-codecs:publishJarsPublicationToApacheSnapshotsRepository'.
> Failed to publish publication 'jars' to repository 'ApacheSnapshots'
   > Could not PUT
'https://repository.apache.org/content/repositories/snapshots/org/apache/lucene/lucene-backward-codecs/11.0.0-SNAPSHOT/lucene-backward-codecs-11.0.0-20250423.024018-190.jar'.
Received status code 401 from server: Unauthorized

On Wed, Apr 23, 2025 at 4:41 AM Apache Jenkins Server
<je...@builds.apache.org> wrote:
>
> Build: https://ci-builds.apache.org/job/Lucene/job/Lucene-Maven-Snapshots-main/2161/
>
> No tests ran.
>
> Build Log:
> [...truncated 77 lines...]
> BUILD FAILED in 59s
> 22 actionable tasks: 22 executed
>
> Publishing build scan...
> https://develocity.apache.org/s/z2dtk23uvgoay
>
> Build step 'Invoke Gradle script' changed build result to FAILURE
> Build step 'Invoke Gradle script' marked build as failure
> Email was triggered for: Failure - Any
> Sending email for trigger: Failure - Any
>
> ---------------------------------------------------------------------
> To unsubscribe, e-mail: builds-unsubscribe@lucene.apache.org
> For additional commands, e-mail: builds-help@lucene.apache.org

---------------------------------------------------------------------
To unsubscribe, e-mail: dev-unsubscribe@lucene.apache.org
For additional commands, e-mail: dev-help@lucene.apache.org