You are viewing a plain text version of this content. The canonical link for it is here.
Posted to dev@lucene.apache.org by Policeman Jenkins Server <je...@thetaphi.de> on 2017/04/29 10:15:06 UTC

[JENKINS] Lucene-Solr-master-Solaris (64bit/jdk1.8.0) - Build # 1272 - Still Unstable!

Build: https://jenkins.thetaphi.de/job/Lucene-Solr-master-Solaris/1272/
Java: 64bit/jdk1.8.0 -XX:-UseCompressedOops -XX:+UseSerialGC

1 tests failed.
FAILED:  org.apache.solr.update.AutoCommitTest.testMaxDocs

Error Message:
Exception during query

Stack Trace:
java.lang.RuntimeException: Exception during query
	at __randomizedtesting.SeedInfo.seed([7D57302EABBD9DDA:C4D6E6F187579950]:0)
	at org.apache.solr.SolrTestCaseJ4.assertQ(SolrTestCaseJ4.java:896)
	at org.apache.solr.update.AutoCommitTest.testMaxDocs(AutoCommitTest.java:225)
	at sun.reflect.NativeMethodAccessorImpl.invoke0(Native Method)
	at sun.reflect.NativeMethodAccessorImpl.invoke(NativeMethodAccessorImpl.java:62)
	at sun.reflect.DelegatingMethodAccessorImpl.invoke(DelegatingMethodAccessorImpl.java:43)
	at java.lang.reflect.Method.invoke(Method.java:498)
	at com.carrotsearch.randomizedtesting.RandomizedRunner.invoke(RandomizedRunner.java:1713)
	at com.carrotsearch.randomizedtesting.RandomizedRunner$8.evaluate(RandomizedRunner.java:907)
	at com.carrotsearch.randomizedtesting.RandomizedRunner$9.evaluate(RandomizedRunner.java:943)
	at com.carrotsearch.randomizedtesting.RandomizedRunner$10.evaluate(RandomizedRunner.java:957)
	at com.carrotsearch.randomizedtesting.rules.SystemPropertiesRestoreRule$1.evaluate(SystemPropertiesRestoreRule.java:57)
	at org.apache.lucene.util.TestRuleSetupTeardownChained$1.evaluate(TestRuleSetupTeardownChained.java:49)
	at org.apache.lucene.util.AbstractBeforeAfterRule$1.evaluate(AbstractBeforeAfterRule.java:45)
	at org.apache.lucene.util.TestRuleThreadAndTestName$1.evaluate(TestRuleThreadAndTestName.java:48)
	at org.apache.lucene.util.TestRuleIgnoreAfterMaxFailures$1.evaluate(TestRuleIgnoreAfterMaxFailures.java:64)
	at org.apache.lucene.util.TestRuleMarkFailure$1.evaluate(TestRuleMarkFailure.java:47)
	at com.carrotsearch.randomizedtesting.rules.StatementAdapter.evaluate(StatementAdapter.java:36)
	at com.carrotsearch.randomizedtesting.ThreadLeakControl$StatementRunner.run(ThreadLeakControl.java:368)
	at com.carrotsearch.randomizedtesting.ThreadLeakControl.forkTimeoutingTask(ThreadLeakControl.java:817)
	at com.carrotsearch.randomizedtesting.ThreadLeakControl$3.evaluate(ThreadLeakControl.java:468)
	at com.carrotsearch.randomizedtesting.RandomizedRunner.runSingleTest(RandomizedRunner.java:916)
	at com.carrotsearch.randomizedtesting.RandomizedRunner$5.evaluate(RandomizedRunner.java:802)
	at com.carrotsearch.randomizedtesting.RandomizedRunner$6.evaluate(RandomizedRunner.java:852)
	at com.carrotsearch.randomizedtesting.RandomizedRunner$7.evaluate(RandomizedRunner.java:863)
	at com.carrotsearch.randomizedtesting.rules.StatementAdapter.evaluate(StatementAdapter.java:36)
	at com.carrotsearch.randomizedtesting.rules.SystemPropertiesRestoreRule$1.evaluate(SystemPropertiesRestoreRule.java:57)
	at org.apache.lucene.util.AbstractBeforeAfterRule$1.evaluate(AbstractBeforeAfterRule.java:45)
	at com.carrotsearch.randomizedtesting.rules.StatementAdapter.evaluate(StatementAdapter.java:36)
	at org.apache.lucene.util.TestRuleStoreClassName$1.evaluate(TestRuleStoreClassName.java:41)
	at com.carrotsearch.randomizedtesting.rules.NoShadowingOrOverridesOnMethodsRule$1.evaluate(NoShadowingOrOverridesOnMethodsRule.java:40)
	at com.carrotsearch.randomizedtesting.rules.NoShadowingOrOverridesOnMethodsRule$1.evaluate(NoShadowingOrOverridesOnMethodsRule.java:40)
	at com.carrotsearch.randomizedtesting.rules.StatementAdapter.evaluate(StatementAdapter.java:36)
	at com.carrotsearch.randomizedtesting.rules.StatementAdapter.evaluate(StatementAdapter.java:36)
	at com.carrotsearch.randomizedtesting.rules.StatementAdapter.evaluate(StatementAdapter.java:36)
	at org.apache.lucene.util.TestRuleAssertionsRequired$1.evaluate(TestRuleAssertionsRequired.java:53)
	at org.apache.lucene.util.TestRuleMarkFailure$1.evaluate(TestRuleMarkFailure.java:47)
	at org.apache.lucene.util.TestRuleIgnoreAfterMaxFailures$1.evaluate(TestRuleIgnoreAfterMaxFailures.java:64)
	at org.apache.lucene.util.TestRuleIgnoreTestSuites$1.evaluate(TestRuleIgnoreTestSuites.java:54)
	at com.carrotsearch.randomizedtesting.rules.StatementAdapter.evaluate(StatementAdapter.java:36)
	at com.carrotsearch.randomizedtesting.ThreadLeakControl$StatementRunner.run(ThreadLeakControl.java:368)
	at java.lang.Thread.run(Thread.java:745)
Caused by: java.lang.RuntimeException: REQUEST FAILED: xpath=//result[@numFound=1]
	xml response was: <?xml version="1.0" encoding="UTF-8"?>
<response>
<lst name="responseHeader"><int name="status">0</int><int name="QTime">0</int></lst><result name="response" numFound="0" start="0"></result>
</response>

	request was:q=id:14&qt=standard&start=0&rows=20&version=2.2
	at org.apache.solr.SolrTestCaseJ4.assertQ(SolrTestCaseJ4.java:889)
	... 40 more




Build Log:
[...truncated 12129 lines...]
   [junit4] Suite: org.apache.solr.update.AutoCommitTest
   [junit4]   2> Creating dataDir: /export/home/jenkins/workspace/Lucene-Solr-master-Solaris/solr/build/solr-core/test/J0/temp/solr.update.AutoCommitTest_7D57302EABBD9DDA-001/init-core-data-001
   [junit4]   2> 1379230 WARN  (SUITE-AutoCommitTest-seed#[7D57302EABBD9DDA]-worker) [    ] o.a.s.SolrTestCaseJ4 startTrackingSearchers: numOpens=2 numCloses=2
   [junit4]   2> 1379230 INFO  (SUITE-AutoCommitTest-seed#[7D57302EABBD9DDA]-worker) [    ] o.a.s.SolrTestCaseJ4 Using TrieFields
   [junit4]   2> 1379231 INFO  (SUITE-AutoCommitTest-seed#[7D57302EABBD9DDA]-worker) [    ] o.a.s.SolrTestCaseJ4 Randomized ssl (true) and clientAuth (false) via: @org.apache.solr.util.RandomizeSSL(reason=, value=NaN, ssl=NaN, clientAuth=NaN)
   [junit4]   2> 1379232 INFO  (SUITE-AutoCommitTest-seed#[7D57302EABBD9DDA]-worker) [    ] o.a.s.SolrTestCaseJ4 ####initCore
   [junit4]   2> 1379233 INFO  (SUITE-AutoCommitTest-seed#[7D57302EABBD9DDA]-worker) [    ] o.a.s.c.SolrResourceLoader [null] Added 2 libs to classloader, from paths: [/export/home/jenkins/workspace/Lucene-Solr-master-Solaris/solr/core/src/test-files/solr/collection1/lib, /export/home/jenkins/workspace/Lucene-Solr-master-Solaris/solr/core/src/test-files/solr/collection1/lib/classes]
   [junit4]   2> 1379269 WARN  (SUITE-AutoCommitTest-seed#[7D57302EABBD9DDA]-worker) [    ] o.a.s.c.Config Beginning with Solr 5.5, <mergePolicy> is deprecated, use <mergePolicyFactory> instead.
   [junit4]   2> 1379290 INFO  (SUITE-AutoCommitTest-seed#[7D57302EABBD9DDA]-worker) [    ] o.a.s.c.SolrConfig Using Lucene MatchVersion: 7.0.0
   [junit4]   2> 1379323 INFO  (SUITE-AutoCommitTest-seed#[7D57302EABBD9DDA]-worker) [    ] o.a.s.s.IndexSchema [null] Schema name=test
   [junit4]   2> 1379438 WARN  (SUITE-AutoCommitTest-seed#[7D57302EABBD9DDA]-worker) [    ] o.a.s.s.IndexSchema [null] default search field in schema is text. WARNING: Deprecated, please use 'df' on request instead.
   [junit4]   2> 1379441 INFO  (SUITE-AutoCommitTest-seed#[7D57302EABBD9DDA]-worker) [    ] o.a.s.s.IndexSchema Loaded schema test/1.0 with uniqueid field id
   [junit4]   2> 1379492 INFO  (SUITE-AutoCommitTest-seed#[7D57302EABBD9DDA]-worker) [    ] o.a.s.m.r.SolrJmxReporter JMX monitoring for 'solr.node' (registry 'solr.node') enabled at server: com.sun.jmx.mbeanserver.JmxMBeanServer@11512f3a
   [junit4]   2> 1379496 INFO  (SUITE-AutoCommitTest-seed#[7D57302EABBD9DDA]-worker) [    ] o.a.s.m.r.SolrJmxReporter JMX monitoring for 'solr.jvm' (registry 'solr.jvm') enabled at server: com.sun.jmx.mbeanserver.JmxMBeanServer@11512f3a
   [junit4]   2> 1379496 INFO  (SUITE-AutoCommitTest-seed#[7D57302EABBD9DDA]-worker) [    ] o.a.s.m.r.SolrJmxReporter JMX monitoring for 'solr.jetty' (registry 'solr.jetty') enabled at server: com.sun.jmx.mbeanserver.JmxMBeanServer@11512f3a
   [junit4]   2> 1379499 INFO  (coreLoadExecutor-7275-thread-1) [    x:collection1] o.a.s.c.SolrResourceLoader [null] Added 2 libs to classloader, from paths: [/export/home/jenkins/workspace/Lucene-Solr-master-Solaris/solr/core/src/test-files/solr/collection1/lib, /export/home/jenkins/workspace/Lucene-Solr-master-Solaris/solr/core/src/test-files/solr/collection1/lib/classes]
   [junit4]   2> 1379553 WARN  (coreLoadExecutor-7275-thread-1) [    x:collection1] o.a.s.c.Config Beginning with Solr 5.5, <mergePolicy> is deprecated, use <mergePolicyFactory> instead.
   [junit4]   2> 1379555 INFO  (coreLoadExecutor-7275-thread-1) [    x:collection1] o.a.s.c.SolrConfig Using Lucene MatchVersion: 7.0.0
   [junit4]   2> 1379579 INFO  (coreLoadExecutor-7275-thread-1) [    x:collection1] o.a.s.s.IndexSchema [collection1] Schema name=test
   [junit4]   2> 1379721 WARN  (coreLoadExecutor-7275-thread-1) [    x:collection1] o.a.s.s.IndexSchema [collection1] default search field in schema is text. WARNING: Deprecated, please use 'df' on request instead.
   [junit4]   2> 1379739 INFO  (coreLoadExecutor-7275-thread-1) [    x:collection1] o.a.s.s.IndexSchema Loaded schema test/1.0 with uniqueid field id
   [junit4]   2> 1379746 INFO  (coreLoadExecutor-7275-thread-1) [    x:collection1] o.a.s.c.CoreContainer Creating SolrCore 'collection1' using configuration from instancedir /export/home/jenkins/workspace/Lucene-Solr-master-Solaris/solr/core/src/test-files/solr/collection1, trusted=true
   [junit4]   2> 1379746 INFO  (coreLoadExecutor-7275-thread-1) [    x:collection1] o.a.s.m.r.SolrJmxReporter JMX monitoring for 'solr.core.collection1' (registry 'solr.core.collection1') enabled at server: com.sun.jmx.mbeanserver.JmxMBeanServer@11512f3a
   [junit4]   2> 1379746 INFO  (coreLoadExecutor-7275-thread-1) [    x:collection1] o.a.s.c.SolrCore solr.RecoveryStrategy.Builder
   [junit4]   2> 1379746 INFO  (coreLoadExecutor-7275-thread-1) [    x:collection1] o.a.s.c.SolrCore [[collection1] ] Opening new SolrCore at [/export/home/jenkins/workspace/Lucene-Solr-master-Solaris/solr/core/src/test-files/solr/collection1], dataDir=[/export/home/jenkins/workspace/Lucene-Solr-master-Solaris/solr/build/solr-core/test/J0/temp/solr.update.AutoCommitTest_7D57302EABBD9DDA-001/init-core-data-001/]
   [junit4]   2> 1379748 INFO  (coreLoadExecutor-7275-thread-1) [    x:collection1] o.a.s.u.RandomMergePolicy RandomMergePolicy wrapping class org.apache.lucene.index.TieredMergePolicy: [TieredMergePolicy: maxMergeAtOnce=47, maxMergeAtOnceExplicit=22, maxMergedSegmentMB=24.162109375, floorSegmentMB=0.8447265625, forceMergeDeletesPctAllowed=8.070457140597448, segmentsPerTier=12.0, maxCFSSegmentSizeMB=8.796093022207999E12, noCFSRatio=1.0
   [junit4]   2> 1379854 INFO  (coreLoadExecutor-7275-thread-1) [    x:collection1] o.a.s.u.UpdateHandler Using UpdateLog implementation: org.apache.solr.update.UpdateLog
   [junit4]   2> 1379854 INFO  (coreLoadExecutor-7275-thread-1) [    x:collection1] o.a.s.u.UpdateLog Initializing UpdateLog: dataDir= defaultSyncLevel=FLUSH numRecordsToKeep=100 maxNumLogsToKeep=10 numVersionBuckets=65536
   [junit4]   2> 1379855 INFO  (coreLoadExecutor-7275-thread-1) [    x:collection1] o.a.s.u.CommitTracker Hard AutoCommit: disabled
   [junit4]   2> 1379855 INFO  (coreLoadExecutor-7275-thread-1) [    x:collection1] o.a.s.u.CommitTracker Soft AutoCommit: disabled
   [junit4]   2> 1379856 INFO  (coreLoadExecutor-7275-thread-1) [    x:collection1] o.a.s.u.RandomMergePolicy RandomMergePolicy wrapping class org.apache.lucene.index.LogByteSizeMergePolicy: [LogByteSizeMergePolicy: minMergeSize=1677721, mergeFactor=43, maxMergeSize=2147483648, maxMergeSizeForForcedMerge=9223372036854775807, calibrateSizeByDeletes=false, maxMergeDocs=2147483647, maxCFSSegmentSizeMB=8.796093022207999E12, noCFSRatio=0.2132922497006102]
   [junit4]   2> 1379856 INFO  (coreLoadExecutor-7275-thread-1) [    x:collection1] o.a.s.s.SolrIndexSearcher Opening [Searcher@194b5730[collection1] main]
   [junit4]   2> 1379857 INFO  (coreLoadExecutor-7275-thread-1) [    x:collection1] o.a.s.h.c.SpellCheckComponent Initializing spell checkers
   [junit4]   2> 1379862 INFO  (coreLoadExecutor-7275-thread-1) [    x:collection1] o.a.s.s.DirectSolrSpellChecker init: {name=direct,classname=DirectSolrSpellChecker,field=lowerfilt,minQueryLength=3}
   [junit4]   2> 1379888 INFO  (coreLoadExecutor-7275-thread-1) [    x:collection1] o.a.s.h.ReplicationHandler Commits will be reserved for  10000
   [junit4]   2> 1379894 INFO  (coreLoadExecutor-7275-thread-1) [    x:collection1] o.a.s.u.UpdateLog Could not find max version in index or recent updates, using new clock 1566004761103171584
   [junit4]   2> 1379894 INFO  (searcherExecutor-7276-thread-1-processing-x:collection1) [    x:collection1] o.a.s.h.c.SpellCheckComponent Loading spell index for spellchecker: default
   [junit4]   2> 1379895 INFO  (searcherExecutor-7276-thread-1-processing-x:collection1) [    x:collection1] o.a.s.h.c.SpellCheckComponent Loading spell index for spellchecker: direct
   [junit4]   2> 1379895 INFO  (searcherExecutor-7276-thread-1-processing-x:collection1) [    x:collection1] o.a.s.h.c.SpellCheckComponent Loading spell index for spellchecker: wordbreak
   [junit4]   2> 1379895 INFO  (searcherExecutor-7276-thread-1-processing-x:collection1) [    x:collection1] o.a.s.h.c.SpellCheckComponent Loading spell index for spellchecker: multipleFields
   [junit4]   2> 1379896 INFO  (searcherExecutor-7276-thread-1-processing-x:collection1) [    x:collection1] o.a.s.h.c.SpellCheckComponent Loading spell index for spellchecker: jarowinkler
   [junit4]   2> 1379897 INFO  (searcherExecutor-7276-thread-1-processing-x:collection1) [    x:collection1] o.a.s.h.c.SpellCheckComponent Loading spell index for spellchecker: external
   [junit4]   2> 1379898 INFO  (searcherExecutor-7276-thread-1-processing-x:collection1) [    x:collection1] o.a.s.h.c.SpellCheckComponent Loading spell index for spellchecker: freq
   [junit4]   2> 1379898 INFO  (searcherExecutor-7276-thread-1-processing-x:collection1) [    x:collection1] o.a.s.h.c.SpellCheckComponent Loading spell index for spellchecker: fqcn
   [junit4]   2> 1379899 INFO  (searcherExecutor-7276-thread-1-processing-x:collection1) [    x:collection1] o.a.s.h.c.SpellCheckComponent Loading spell index for spellchecker: perDict
   [junit4]   2> 1379900 INFO  (searcherExecutor-7276-thread-1-processing-x:collection1) [    x:collection1] o.a.s.c.SolrCore [collection1] Registered new searcher Searcher@194b5730[collection1] main{ExitableDirectoryReader(UninvertingDirectoryReader())}
   [junit4]   2> 1379901 INFO  (SUITE-AutoCommitTest-seed#[7D57302EABBD9DDA]-worker) [    ] o.a.s.SolrTestCaseJ4 ####initCore end
   [junit4]   2> 1379905 INFO  (TEST-AutoCommitTest.testCommitWithin-seed#[7D57302EABBD9DDA]) [    ] o.a.s.SolrTestCaseJ4 ###Starting testCommitWithin
   [junit4]   2> 1379906 INFO  (TEST-AutoCommitTest.testCommitWithin-seed#[7D57302EABBD9DDA]) [    ] o.a.s.u.DirectUpdateHandler2 [collection1] REMOVING ALL DOCUMENTS FROM INDEX
   [junit4]   2> 1379907 INFO  (TEST-AutoCommitTest.testCommitWithin-seed#[7D57302EABBD9DDA]) [    ] o.a.s.s.SolrIndexSearcher Opening [Searcher@1e33d53d[collection1] realtime]
   [junit4]   2> 1379907 INFO  (TEST-AutoCommitTest.testCommitWithin-seed#[7D57302EABBD9DDA]) [    ] o.a.s.u.p.LogUpdateProcessorFactory [collection1]  webapp=null path=null params={_version_=-9223372036854775807&update.distrib=FROMLEADER&versions=true&wt=json&indent=true}{deleteByQuery=*:* (-9223372036854775807)} 0 1
   [junit4]   2> 1379907 ERROR (TEST-AutoCommitTest.testCommitWithin-seed#[7D57302EABBD9DDA]) [    ] o.a.s.c.CorePropertiesLocator Couldn't load core descriptor from /export/home/jenkins/workspace/Lucene-Solr-master-Solaris/solr/core/src/test-files/solr/collection1/core.properties:java.nio.file.NoSuchFileException: /export/home/jenkins/workspace/Lucene-Solr-master-Solaris/solr/core/src/test-files/solr/collection1/core.properties
   [junit4]   2> 1379908 INFO  (TEST-AutoCommitTest.testCommitWithin-seed#[7D57302EABBD9DDA]) [    ] o.a.s.c.SolrResourceLoader [null] Added 2 libs to classloader, from paths: [/export/home/jenkins/workspace/Lucene-Solr-master-Solaris/solr/core/src/test-files/solr/collection1/lib, /export/home/jenkins/workspace/Lucene-Solr-master-Solaris/solr/core/src/test-files/solr/collection1/lib/classes]
   [junit4]   2> 1379956 WARN  (TEST-AutoCommitTest.testCommitWithin-seed#[7D57302EABBD9DDA]) [    ] o.a.s.c.Config Beginning with Solr 5.5, <mergePolicy> is deprecated, use <mergePolicyFactory> instead.
   [junit4]   2> 1379958 INFO  (TEST-AutoCommitTest.testCommitWithin-seed#[7D57302EABBD9DDA]) [    ] o.a.s.c.SolrConfig Using Lucene MatchVersion: 7.0.0
   [junit4]   2> 1379991 INFO  (TEST-AutoCommitTest.testCommitWithin-seed#[7D57302EABBD9DDA]) [    ] o.a.s.s.IndexSchema [collection1] Schema name=test
   [junit4]   2> 1380151 WARN  (TEST-AutoCommitTest.testCommitWithin-seed#[7D57302EABBD9DDA]) [    ] o.a.s.s.IndexSchema [collection1] default search field in schema is text. WARNING: Deprecated, please use 'df' on request instead.
   [junit4]   2> 1380155 INFO  (TEST-AutoCommitTest.testCommitWithin-seed#[7D57302EABBD9DDA]) [    ] o.a.s.s.IndexSchema Loaded schema test/1.0 with uniqueid field id
   [junit4]   2> 1380164 INFO  (TEST-AutoCommitTest.testCommitWithin-seed#[7D57302EABBD9DDA]) [    ] o.a.s.c.CoreContainer Reloading SolrCore 'collection1' using configuration from instancedir /export/home/jenkins/workspace/Lucene-Solr-master-Solaris/solr/core/src/test-files/solr/collection1
   [junit4]   2> 1380189 INFO  (TEST-AutoCommitTest.testCommitWithin-seed#[7D57302EABBD9DDA]) [    x:collection1] o.a.s.m.r.SolrJmxReporter JMX monitoring for 'solr.core.collection1' (registry 'solr.core.collection1') enabled at server: com.sun.jmx.mbeanserver.JmxMBeanServer@11512f3a
   [junit4]   2> 1380189 INFO  (TEST-AutoCommitTest.testCommitWithin-seed#[7D57302EABBD9DDA]) [    x:collection1] o.a.s.c.SolrCore [[collection1] ] Opening new SolrCore at [/export/home/jenkins/workspace/Lucene-Solr-master-Solaris/solr/core/src/test-files/solr/collection1], dataDir=[/export/home/jenkins/workspace/Lucene-Solr-master-Solaris/solr/build/solr-core/test/J0/temp/solr.update.AutoCommitTest_7D57302EABBD9DDA-001/init-core-data-001/]
   [junit4]   2> 1380258 INFO  (TEST-AutoCommitTest.testCommitWithin-seed#[7D57302EABBD9DDA]) [    x:collection1] o.a.s.u.CommitTracker Hard AutoCommit: disabled
   [junit4]   2> 1380258 INFO  (TEST-AutoCommitTest.testCommitWithin-seed#[7D57302EABBD9DDA]) [    x:collection1] o.a.s.u.CommitTracker Soft AutoCommit: disabled
   [junit4]   2> 1380259 INFO  (TEST-AutoCommitTest.testCommitWithin-seed#[7D57302EABBD9DDA]) [    x:collection1] o.a.s.s.SolrIndexSearcher Opening [Searcher@5638d963[collection1] main]
   [junit4]   2> 1380260 INFO  (TEST-AutoCommitTest.testCommitWithin-seed#[7D57302EABBD9DDA]) [    x:collection1] o.a.s.h.c.SpellCheckComponent Initializing spell checkers
   [junit4]   2> 1380260 INFO  (TEST-AutoCommitTest.testCommitWithin-seed#[7D57302EABBD9DDA]) [    x:collection1] o.a.s.s.DirectSolrSpellChecker init: {name=direct,classname=DirectSolrSpellChecker,field=lowerfilt,minQueryLength=3}
   [junit4]   2> 1380264 INFO  (TEST-AutoCommitTest.testCommitWithin-seed#[7D57302EABBD9DDA]) [    x:collection1] o.a.s.h.ReplicationHandler Commits will be reserved for  10000
   [junit4]   2> 1380266 INFO  (searcherExecutor-7281-thread-1-processing-x:collection1) [    x:collection1] o.a.s.h.c.SpellCheckComponent Loading spell index for spellchecker: default
   [junit4]   2> 1380266 INFO  (TEST-AutoCommitTest.testCommitWithin-seed#[7D57302EABBD9DDA]) [    x:collection1] o.a.s.u.UpdateLog Could not find max version in index or recent updates, using new clock 1566004761493241856
   [junit4]   2> 1380267 INFO  (searcherExecutor-7281-thread-1-processing-x:collection1) [    x:collection1] o.a.s.h.c.SpellCheckComponent Loading spell index for spellchecker: direct
   [junit4]   2> 1380267 INFO  (searcherExecutor-7281-thread-1-processing-x:collection1) [    x:collection1] o.a.s.h.c.SpellCheckComponent Loading spell index for spellchecker: wordbreak
   [junit4]   2> 1380267 INFO  (searcherExecutor-7281-thread-1-processing-x:collection1) [    x:collection1] o.a.s.h.c.SpellCheckComponent Loading spell index for spellchecker: multipleFields
   [junit4]   2> 1380267 INFO  (searcherExecutor-7281-thread-1-processing-x:collection1) [    x:collection1] o.a.s.h.c.SpellCheckComponent Loading spell index for spellchecker: jarowinkler
   [junit4]   2> 1380267 INFO  (searcherExecutor-7281-thread-1-processing-x:collection1) [    x:collection1] o.a.s.h.c.SpellCheckComponent Loading spell index for spellchecker: external
   [junit4]   2> 1380268 INFO  (searcherExecutor-7281-thread-1-processing-x:collection1) [    x:collection1] o.a.s.h.c.SpellCheckComponent Loading spell index for spellchecker: freq
   [junit4]   2> 1380268 INFO  (searcherExecutor-7281-thread-1-processing-x:collection1) [    x:collection1] o.a.s.h.c.SpellCheckComponent Loading spell index for spellchecker: fqcn
   [junit4]   2> 1380268 INFO  (searcherExecutor-7281-thread-1-processing-x:collection1) [    x:collection1] o.a.s.h.c.SpellCheckComponent Loading spell index for spellchecker: perDict
   [junit4]   2> 1380270 INFO  (TEST-AutoCommitTest.testCommitWithin-seed#[7D57302EABBD9DDA]) [    x:collection1] o.a.s.u.RandomMergePolicy RandomMergePolicy wrapping class org.apache.lucene.index.TieredMergePolicy: [TieredMergePolicy: maxMergeAtOnce=16, maxMergeAtOnceExplicit=26, maxMergedSegmentMB=74.244140625, floorSegmentMB=1.3466796875, forceMergeDeletesPctAllowed=1.8901658269425592, segmentsPerTier=30.0, maxCFSSegmentSizeMB=8.796093022207999E12, noCFSRatio=0.2940585329715598
   [junit4]   2> 1380270 INFO  (TEST-AutoCommitTest.testCommitWithin-seed#[7D57302EABBD9DDA]) [    x:collection1] o.a.s.u.DefaultSolrCoreState New IndexWriter is ready to be used.
   [junit4]   2> 1380271 INFO  (searcherExecutor-7281-thread-1-processing-x:collection1) [    x:collection1] o.a.s.c.SolrCore [collection1] Registered new searcher Searcher@5638d963[collection1] main{ExitableDirectoryReader(UninvertingDirectoryReader())}
   [junit4]   2> 1380271 INFO  (TEST-AutoCommitTest.testCommitWithin-seed#[7D57302EABBD9DDA]) [    x:collection1] o.a.s.s.SolrIndexSearcher Opening [Searcher@b1e36d9[collection1] main]
   [junit4]   2> 1380272 INFO  (TEST-AutoCommitTest.testCommitWithin-seed#[7D57302EABBD9DDA]) [    x:collection1] o.a.s.c.SolrCore [collection1]  CLOSING SolrCore org.apache.solr.core.SolrCore@5757ee24
   [junit4]   2> 1380272 INFO  (TEST-AutoCommitTest.testCommitWithin-seed#[7D57302EABBD9DDA]) [    x:collection1] o.a.s.m.SolrMetricManager Closing metric reporters for registry=solr.core.collection1, tag=1465380388
   [junit4]   2> 1380274 INFO  (searcherExecutor-7281-thread-1-processing-x:collection1) [    x:collection1] o.a.s.c.SolrCore [collection1] Registered new searcher Searcher@b1e36d9[collection1] main{ExitableDirectoryReader(UninvertingDirectoryReader())}
   [junit4]   2> 1380283 INFO  (TEST-AutoCommitTest.testCommitWithin-seed#[7D57302EABBD9DDA]) [    x:collection1] o.a.s.u.p.LogUpdateProcessorFactory [collection1] {add=[529 (1566004761506873344)]} 0 3
   [junit4]   2> 1380285 INFO  (TEST-AutoCommitTest.testCommitWithin-seed#[7D57302EABBD9DDA]) [    x:collection1] o.a.s.c.S.Request [collection1]  webapp=null path=null params={q=id:529&qt=standard&start=0&rows=20&version=2.2} hits=0 status=0 QTime=1
   [junit4]   2> 1384281 INFO  (commitScheduler-7284-thread-1) [    x:collection1] o.a.s.u.DirectUpdateHandler2 start commit{,optimize=false,openSearcher=true,waitSearcher=true,expungeDeletes=false,softCommit=true,prepareCommit=false}
   [junit4]   2> 1384284 INFO  (commitScheduler-7284-thread-1) [    x:collection1] o.a.s.s.SolrIndexSearcher Opening [Searcher@77dfcef7[collection1] main]
   [junit4]   2> 1384284 INFO  (commitScheduler-7284-thread-1) [    x:collection1] o.a.s.u.DirectUpdateHandler2 end_commit_flush
   [junit4]   2> 1384287 INFO  (searcherExecutor-7281-thread-1-processing-x:collection1) [    x:collection1] o.a.s.c.SolrCore [collection1] Registered new searcher Searcher@77dfcef7[collection1] main{ExitableDirectoryReader(UninvertingDirectoryReader(Uninverting(_0(7.0.0):C1)))}
   [junit4]   2> 1384295 INFO  (TEST-AutoCommitTest.testCommitWithin-seed#[7D57302EABBD9DDA]) [    x:collection1] o.a.s.u.p.LogUpdateProcessorFactory [collection1] {add=[530 (1566004765717954560)]} 0 4017
   [junit4]   2> 1384295 INFO  (TEST-AutoCommitTest.testCommitWithin-seed#[7D57302EABBD9DDA]) [    x:collection1] o.a.s.c.S.Request [collection1]  webapp=null path=null params={q=id:530&qt=standard&start=0&rows=20&version=2.2} hits=0 status=0 QTime=0
   [junit4]   2> 1384296 INFO  (TEST-AutoCommitTest.testCommitWithin-seed#[7D57302EABBD9DDA]) [    x:collection1] o.a.s.u.p.LogUpdateProcessorFactory [collection1] {delete=[529 (-1566004765719003136)]} 0 4018
   [junit4]   2> 1384296 INFO  (TEST-AutoCommitTest.testCommitWithin-seed#[7D57302EABBD9DDA]) [    x:collection1] o.a.s.c.S.Request [collection1]  webapp=null path=null params={q=id:529&qt=standard&start=0&rows=20&version=2.2} hits=1 status=0 QTime=0
   [junit4]   2> 1386297 INFO  (commitScheduler-7284-thread-1) [    x:collection1] o.a.s.u.DirectUpdateHandler2 start commit{,optimize=false,openSearcher=true,waitSearcher=true,expungeDeletes=false,softCommit=true,prepareCommit=false}
   [junit4]   2> 1386299 INFO  (commitScheduler-7284-thread-1) [    x:collection1] o.a.s.s.SolrIndexSearcher Opening [Searcher@2048cb7b[collection1] main]
   [junit4]   2> 1386299 INFO  (commitScheduler-7284-thread-1) [    x:collection1] o.a.s.u.DirectUpdateHandler2 end_commit_flush
   [junit4]   2> 1386300 INFO  (searcherExecutor-7281-thread-1-processing-x:collection1) [    x:collection1] o.a.s.c.SolrCore [collection1] Registered new searcher Searcher@2048cb7b[collection1] main{ExitableDirectoryReader(UninvertingDirectoryReader(Uninverting(_1(7.0.0):C1)))}
   [junit4]   2> 1386301 INFO  (TEST-AutoCommitTest.testCommitWithin-seed#[7D57302EABBD9DDA]) [    x:collection1] o.a.s.c.S.Request [collection1]  webapp=null path=null params={q=id:529&qt=standard&start=0&rows=20&version=2.2} hits=0 status=0 QTime=0
   [junit4]   2> 1386302 INFO  (TEST-AutoCommitTest.testCommitWithin-seed#[7D57302EABBD9DDA]) [    x:collection1] o.a.s.c.S.Request [collection1]  webapp=null path=null params={q=id:530&qt=standard&start=0&rows=20&version=2.2} hits=1 status=0 QTime=0
   [junit4]   2> 1386303 INFO  (TEST-AutoCommitTest.testCommitWithin-seed#[7D57302EABBD9DDA]) [    x:collection1] o.a.s.u.p.LogUpdateProcessorFactory [collection1] {add=[500 (1566004767823495168)]} 0 6026
   [junit4]   2> 1386303 INFO  (TEST-AutoCommitTest.testCommitWithin-seed#[7D57302EABBD9DDA]) [    x:collection1] o.a.s.u.p.LogUpdateProcessorFactory [collection1] {add=[500 (1566004767823495169)]} 0 6026
   [junit4]   2> 1386303 INFO  (TEST-AutoCommitTest.testCommitWithin-seed#[7D57302EABBD9DDA]) [    x:collection1] o.a.s.u.p.LogUpdateProcessorFactory [collection1] {add=[500 (1566004767823495170)]} 0 6026
   [junit4]   2> 1386304 INFO  (TEST-AutoCommitTest.testCommitWithin-seed#[7D57302EABBD9DDA]) [    x:collection1] o.a.s.u.p.LogUpdateProcessorFactory [collection1] {add=[500 (1566004767824543744)]} 0 6026
   [junit4]   2> 1386304 INFO  (TEST-AutoCommitTest.testCommitWithin-seed#[7D57302EABBD9DDA]) [    x:collection1] o.a.s.u.p.LogUpdateProcessorFactory [collection1] {add=[500 (1566004767824543745)]} 0 6026
   [junit4]   2> 1386304 INFO  (TEST-AutoCommitTest.testCommitWithin-seed#[7D57302EABBD9DDA]) [    x:collection1] o.a.s.u.p.LogUpdateProcessorFactory [collection1] {add=[500 (1566004767824543746)]} 0 6026
   [junit4]   2> 1386304 INFO  (TEST-AutoCommitTest.testCommitWithin-seed#[7D57302EABBD9DDA]) [    x:collection1] o.a.s.u.p.LogUpdateProcessorFactory [collection1] {add=[500 (1566004767824543747)]} 0 6027
   [junit4]   2> 1386304 INFO  (TEST-AutoCommitTest.testCommitWithin-seed#[7D57302EABBD9DDA]) [    x:collection1] o.a.s.u.p.LogUpdateProcessorFactory [collection1] {add=[500 (1566004767824543748)]} 0 6027
   [junit4]   2> 1386305 INFO  (TEST-AutoCommitTest.testCommitWithin-seed#[7D57302EABBD9DDA]) [    x:collection1] o.a.s.u.p.LogUpdateProcessorFactory [collection1] {add=[500 (1566004767824543749)]} 0 6027
   [junit4]   2> 1386305 INFO  (TEST-AutoCommitTest.testCommitWithin-seed#[7D57302EABBD9DDA]) [    x:collection1] o.a.s.u.p.LogUpdateProcessorFactory [collection1] {add=[500 (1566004767825592320)]} 0 6027
   [junit4]   2> 1386305 INFO  (TEST-AutoCommitTest.testCommitWithin-seed#[7D57302EABBD9DDA]) [    x:collection1] o.a.s.c.S.Request [collection1]  webapp=null path=null params={q=id:500&qt=standard&start=0&rows=20&version=2.2} hits=0 status=0 QTime=0
   [junit4]   2> 1386306 INFO  (TEST-AutoCommitTest.testCommitWithin-seed#[7D57302EABBD9DDA]) [    x:collection1] o.a.s.u.p.LogUpdateProcessorFactory [collection1] {delete=[530 (-1566004767826640896)]} 0 6028
   [junit4]   2> 1386306 INFO  (TEST-AutoCommitTest.testCommitWithin-seed#[7D57302EABBD9DDA]) [    x:collection1] o.a.s.u.p.LogUpdateProcessorFactory [collection1] {delete=[530 (-1566004767826640897)]} 0 6028
   [junit4]   2> 1386306 INFO  (TEST-AutoCommitTest.testCommitWithin-seed#[7D57302EABBD9DDA]) [    x:collection1] o.a.s.u.p.LogUpdateProcessorFactory [collection1] {delete=[530 (-1566004767826640898)]} 0 6028
   [junit4]   2> 1386306 INFO  (TEST-AutoCommitTest.testCommitWithin-seed#[7D57302EABBD9DDA]) [    x:collection1] o.a.s.u.p.LogUpdateProcessorFactory [collection1] {delete=[530 (-1566004767826640899)]} 0 6029
   [junit4]   2> 1386306 INFO  (TEST-AutoCommitTest.testCommitWithin-seed#[7D57302EABBD9DDA]) [    x:collection1] o.a.s.u.p.LogUpdateProcessorFactory [collection1] {delete=[530 (-1566004767826640900)]} 0 6029
   [junit4]   2> 1386306 INFO  (TEST-AutoCommitTest.testCommitWithin-seed#[7D57302EABBD9DDA]) [    x:collection1] o.a.s.u.p.LogUpdateProcessorFactory [collection1] {delete=[530 (-1566004767826640901)]} 0 6029
   [junit4]   2> 1386306 INFO  (TEST-AutoCommitTest.testCommitWithin-seed#[7D57302EABBD9DDA]) [    x:collection1] o.a.s.u.p.LogUpdateProcessorFactory [collection1] {delete=[530 (-1566004767826640902)]} 0 6029
   [junit4]   2> 1386307 INFO  (TEST-AutoCommitTest.testCommitWithin-seed#[7D57302EABBD9DDA]) [    x:collection1] o.a.s.u.p.LogUpdateProcessorFactory [collection1] {delete=[530 (-1566004767826640903)]} 0 6029
   [junit4]   2> 1386307 INFO  (TEST-AutoCommitTest.testCommitWithin-seed#[7D57302EABBD9DDA]) [    x:collection1] o.a.s.u.p.LogUpdateProcessorFactory [collection1] {delete=[530 (-1566004767827689472)]} 0 6029
   [junit4]   2> 1386307 INFO  (TEST-AutoCommitTest.testCommitWithin-seed#[7D57302EABBD9DDA]) [    x:collection1] o.a.s.u.p.LogUpdateProcessorFactory [collection1] {delete=[530 (-1566004767827689473)]} 0 6029
   [junit4]   2> 1386307 INFO  (TEST-AutoCommitTest.testCommitWithin-seed#[7D57302EABBD9DDA]) [    x:collection1] o.a.s.c.S.Request [collection1]  webapp=null path=null params={q=id:530&qt=standard&start=0&rows=20&version=2.2} hits=1 status=0 QTime=0
   [junit4]   2> 1387307 INFO  (commitScheduler-7284-thread-1) [    x:collection1] o.a.s.u.DirectUpdateHandler2 start commit{,optimize=false,openSearcher=true,waitSearcher=true,expungeDeletes=false,softCommit=true,prepareCommit=false}
   [junit4]   2> 1387309 INFO  (commitScheduler-7284-thread-1) [    x:collection1] o.a.s.s.SolrIndexSearcher Opening [Searcher@3e1bd53d[collection1] main]
   [junit4]   2> 1387310 INFO  (commitScheduler-7284-thread-1) [    x:collection1] o.a.s.u.DirectUpdateHandler2 end_commit_flush
   [junit4]   2> 1387312 INFO  (searcherExecutor-7281-thread-1-processing-x:collection1) [    x:collection1] o.a.s.c.SolrCore [collection1] Registered new searcher Searcher@3e1bd53d[collection1] main{ExitableDirectoryReader(UninvertingDirectoryReader(Uninverting(_2(7.0.0):C10/9:delGen=1)))}
   [junit4]   2> 1387312 INFO  (TEST-AutoCommitTest.testCommitWithin-seed#[7D57302EABBD9DDA]) [    x:collection1] o.a.s.c.S.Request [collection1]  webapp=null path=null params={q=id:500&qt=standard&start=0&rows=20&version=2.2} hits=1 status=0 QTime=0
   [junit4]   2> 1387313 INFO  (TEST-AutoCommitTest.testCommitWithin-seed#[7D57302EABBD9DDA]) [    x:collection1] o.a.s.c.S.Request [collection1]  webapp=null path=null params={q=id:530&qt=standard&start=0&rows=20&version=2.2} hits=0 status=0 QTime=0
   [junit4]   2> 1387313 INFO  (TEST-AutoCommitTest.testCommitWithin-seed#[7D57302EABBD9DDA]) [    x:collection1] o.a.s.SolrTestCaseJ4 ###Ending testCommitWithin
   [junit4]   2> 1387316 INFO  (TEST-AutoCommitTest.testMaxDocs-seed#[7D57302EABBD9DDA]) [    x:collection1] o.a.s.SolrTestCaseJ4 ###Starting testMaxDocs
   [junit4]   2> 1387317 INFO  (TEST-AutoCommitTest.testMaxDocs-seed#[7D57302EABBD9DDA]) [    x:collection1] o.a.s.u.DirectUpdateHandler2 [collection1] REMOVING ALL DOCUMENTS FROM INDEX
   [junit4]   2> 1387318 INFO  (TEST-AutoCommitTest.testMaxDocs-seed#[7D57302EABBD9DDA]) [    x:collection1] o.a.s.s.SolrIndexSearcher Opening [Searcher@59df41d9[collection1] realtime]
   [junit4]   2> 1387318 INFO  (TEST-AutoCommitTest.testMaxDocs-seed#[7D57302EABBD9DDA]) [    x:collection1] o.a.s.u.p.LogUpdateProcessorFactory [collection1]  webapp=null path=null params={_version_=-9223372036854775807&update.distrib=FROMLEADER&versions=true&wt=json&indent=true}{deleteByQuery=*:* (-9223372036854775807)} 0 1
   [junit4]   2> 1387318 ERROR (TEST-AutoCommitTest.testMaxDocs-seed#[7D57302EABBD9DDA]) [    x:collection1] o.a.s.c.CorePropertiesLocator Couldn't load core descriptor from /export/home/jenkins/workspace/Lucene-Solr-master-Solaris/solr/core/src/test-files/solr/collection1/core.properties:java.nio.file.NoSuchFileException: /export/home/jenkins/workspace/Lucene-Solr-master-Solaris/solr/core/src/test-files/solr/collection1/core.properties
   [junit4]   2> 1387319 INFO  (TEST-AutoCommitTest.testMaxDocs-seed#[7D57302EABBD9DDA]) [    x:collection1] o.a.s.c.SolrResourceLoader [null] Added 2 libs to classloader, from paths: [/export/home/jenkins/workspace/Lucene-Solr-master-Solaris/solr/core/src/test-files/solr/collection1/lib, /export/home/jenkins/workspace/Lucene-Solr-master-Solaris/solr/core/src/test-files/solr/collection1/lib/classes]
   [junit4]   2> 1387367 WARN  (TEST-AutoCommitTest.testMaxDocs-seed#[7D57302EABBD9DDA]) [    x:collection1] o.a.s.c.Config Beginning with Solr 5.5, <mergePolicy> is deprecated, use <mergePolicyFactory> instead.
   [junit4]   2> 1387369 INFO  (TEST-AutoCommitTest.testMaxDocs-seed#[7D57302EABBD9DDA]) [    x:collection1] o.a.s.c.SolrConfig Using Lucene MatchVersion: 7.0.0
   [junit4]   2> 1387417 INFO  (TEST-AutoCommitTest.testMaxDocs-seed#[7D57302EABBD9DDA]) [    x:collection1] o.a.s.s.IndexSchema [collection1] Schema name=test
   [junit4]   2> 1387531 WARN  (TEST-AutoCommitTest.testMaxDocs-seed#[7D57302EABBD9DDA]) [    x:collection1] o.a.s.s.IndexSchema [collection1] default search field in schema is text. WARNING: Deprecated, please use 'df' on request instead.
   [junit4]   2> 1387534 INFO  (TEST-AutoCommitTest.testMaxDocs-seed#[7D57302EABBD9DDA]) [    x:collection1] o.a.s.s.IndexSchema Loaded schema test/1.0 with uniqueid field id
   [junit4]   2> 1387546 INFO  (TEST-AutoCommitTest.testMaxDocs-seed#[7D57302EABBD9DDA]) [    x:collection1] o.a.s.c.CoreContainer Reloading SolrCore 'collection1' using configuration from instancedir /export/home/jenkins/workspace/Lucene-Solr-master-Solaris/solr/core/src/test-files/solr/collection1
   [junit4]   2> 1387562 INFO  (TEST-AutoCommitTest.testMaxDocs-seed#[7D57302EABBD9DDA]) [    x:collection1] o.a.s.m.r.SolrJmxReporter JMX monitoring for 'solr.core.collection1' (registry 'solr.core.collection1') enabled at server: com.sun.jmx.mbeanserver.JmxMBeanServer@11512f3a
   [junit4]   2> 1387562 INFO  (TEST-AutoCommitTest.testMaxDocs-seed#[7D57302EABBD9DDA]) [    x:collection1] o.a.s.c.SolrCore [[collection1] ] Opening new SolrCore at [/export/home/jenkins/workspace/Lucene-Solr-master-Solaris/solr/core/src/test-files/solr/collection1], dataDir=[/export/home/jenkins/workspace/Lucene-Solr-master-Solaris/solr/build/solr-core/test/J0/temp/solr.update.AutoCommitTest_7D57302EABBD9DDA-001/init-core-data-001/]
   [junit4]   2> 1387705 INFO  (TEST-AutoCommitTest.testMaxDocs-seed#[7D57302EABBD9DDA]) [    x:collection1] o.a.s.u.CommitTracker Hard AutoCommit: disabled
   [junit4]   2> 1387705 INFO  (TEST-AutoCommitTest.testMaxDocs-seed#[7D57302EABBD9DDA]) [    x:collection1] o.a.s.u.CommitTracker Soft AutoCommit: disabled
   [junit4]   2> 1387706 INFO  (TEST-AutoCommitTest.testMaxDocs-seed#[7D57302EABBD9DDA]) [    x:collection1] o.a.s.s.SolrIndexSearcher Opening [Searcher@13ca7a5e[collection1] main]
   [junit4]   2> 1387707 INFO  (TEST-AutoCommitTest.testMaxDocs-seed#[7D57302EABBD9DDA]) [    x:collection1] o.a.s.h.c.SpellCheckComponent Initializing spell checkers
   [junit4]   2> 1387708 INFO  (TEST-AutoCommitTest.testMaxDocs-seed#[7D57302EABBD9DDA]) [    x:collection1] o.a.s.s.DirectSolrSpellChecker init: {name=direct,classname=DirectSolrSpellChecker,field=lowerfilt,minQueryLength=3}
   [junit4]   2> 1387713 INFO  (TEST-AutoCommitTest.testMaxDocs-seed#[7D57302EABBD9DDA]) [    x:collection1] o.a.s.h.ReplicationHandler Commits will be reserved for  10000
   [junit4]   2> 1387714 INFO  (searcherExecutor-7285-thread-1-processing-x:collection1) [    x:collection1] o.a.s.h.c.SpellCheckComponent Loading spell index for spellchecker: default
   [junit4]   2> 1387715 INFO  (searcherExecutor-7285-thread-1-processing-x:collection1) [    x:collection1] o.a.s.h.c.SpellCheckComponent Loading spell index for spellchecker: direct
   [junit4]   2> 1387715 INFO  (searcherExecutor-7285-thread-1-processing-x:collection1) [    x:collection1] o.a.s.h.c.SpellCheckComponent Loading spell index for spellchecker: wordbreak
   [junit4]   2> 1387715 INFO  (searcherExecutor-7285-thread-1-processing-x:collection1) [    x:collection1] o.a.s.h.c.SpellCheckComponent Loading spell index for spellchecker: multipleFields
   [junit4]   2> 1387716 INFO  (searcherExecutor-7285-thread-1-processing-x:collection1) [    x:collection1] o.a.s.h.c.SpellCheckComponent Loading spell index for spellchecker: jarowinkler
   [junit4]   2> 1387717 INFO  (searcherExecutor-7285-thread-1-processing-x:collection1) [    x:collection1] o.a.s.h.c.SpellCheckComponent Loading spell index for spellchecker: external
   [junit4]   2> 1387717 INFO  (searcherExecutor-7285-thread-1-processing-x:collection1) [    x:collection1] o.a.s.h.c.SpellCheckComponent Loading spell index for spellchecker: freq
   [junit4]   2> 1387718 INFO  (searcherExecutor-7285-thread-1-processing-x:collection1) [    x:collection1] o.a.s.h.c.SpellCheckComponent Loading spell index for spellchecker: fqcn
   [junit4]   2> 1387720 INFO  (searcherExecutor-7285-thread-1-processing-x:collection1) [    x:collection1] o.a.s.h.c.SpellCheckComponent Loading spell index for spellchecker: perDict
   [junit4]   2> 1387724 INFO  (searcherExecutor-7285-thread-1-processing-x:collection1) [    x:collection1] o.a.s.c.SolrCore [collection1] Registered new searcher Searcher@13ca7a5e[collection1] main{ExitableDirectoryReader(UninvertingDirectoryReader())}
   [junit4]   2> 1387725 INFO  (TEST-AutoCommitTest.testMaxDocs-seed#[7D57302EABBD9DDA]) [    x:collection1] o.a.s.u.RandomMergePolicy RandomMergePolicy wrapping class org.apache.lucene.index.LogDocMergePolicy: [LogDocMergePolicy: minMergeSize=1000, mergeFactor=34, maxMergeSize=9223372036854775807, maxMergeSizeForForcedMerge=9223372036854775807, calibrateSizeByDeletes=true, maxMergeDocs=2147483647, maxCFSSegmentSizeMB=8.796093022207999E12, noCFSRatio=0.706691358539329]
   [junit4]   2> 1387725 INFO  (TEST-AutoCommitTest.testMaxDocs-seed#[7D57302EABBD9DDA]) [    x:collection1] o.a.s.u.DefaultSolrCoreState New IndexWriter is ready to be used.
   [junit4]   2> 1387726 INFO  (TEST-AutoCommitTest.testMaxDocs-seed#[7D57302EABBD9DDA]) [    x:collection1] o.a.s.s.SolrIndexSearcher Opening [Searcher@6c8c5f97[collection1] main]
   [junit4]   2> 1387726 INFO  (TEST-AutoCommitTest.testMaxDocs-seed#[7D57302EABBD9DDA]) [    x:collection1] o.a.s.c.SolrCore [collection1]  CLOSING SolrCore org.apache.solr.core.SolrCore@becf4d5
   [junit4]   2> 1387727 INFO  (TEST-AutoCommitTest.testMaxDocs-seed#[7D57302EABBD9DDA]) [    x:collection1] o.a.s.m.SolrMetricManager Closing metric reporters for registry=solr.core.collection1, tag=200078549
   [junit4]   2> 1387735 INFO  (searcherExecutor-7285-thread-1-processing-x:collection1) [    x:collection1] o.a.s.c.SolrCore [collection1] Registered new searcher Searcher@6c8c5f97[collection1] main{ExitableDirectoryReader(UninvertingDirectoryReader())}
   [junit4]   2> 1387743 INFO  (TEST-AutoCommitTest.testMaxDocs-seed#[7D57302EABBD9DDA]) [    x:collection1] o.a.s.u.p.LogUpdateProcessorFactory [collection1] {add=[0 (1566004769331347456)]} 0 10
   [junit4]   2> 1387743 INFO  (TEST-AutoCommitTest.testMaxDocs-seed#[7D57302EABBD9DDA]) [    x:collection1] o.a.s.u.p.LogUpdateProcessorFactory [collection1] {add=[1 (1566004769333444608)]} 0 10
   [junit4]   2> 1387743 INFO  (TEST-AutoCommitTest.testMaxDocs-seed#[7D57302EABBD9DDA]) [    x:collection1] o.a.s.u.p.LogUpdateProcessorFactory [collection1] {add=[2 (1566004769333444609)]} 0 10
   [junit4]   2> 1387743 INFO  (TEST-AutoCommitTest.testMaxDocs-seed#[7D57302EABBD9DDA]) [    x:collection1] o.a.s.u.p.LogUpdateProcessorFactory [collection1] {add=[3 (1566004769333444610)]} 0 10
   [junit4]   2> 1387743 INFO  (TEST-AutoCommitTest.testMaxDocs-seed#[7D57302EABBD9DDA]) [    x:collection1] o.a.s.u.p.LogUpdateProcessorFactory [collection1] {add=[4 (1566004769333444611)]} 0 10
   [junit4]   2> 1387744 INFO  (TEST-AutoCommitTest.testMaxDocs-seed#[7D57302EABBD9DDA]) [    x:collection1] o.a.s.u.p.LogUpdateProcessorFactory [collection1] {add=[5 (1566004769333444612)]} 0 11
   [junit4]   2> 1387744 INFO  (TEST-AutoCommitTest.testMaxDocs-seed#[7D57302EABBD9DDA]) [    x:collection1] o.a.s.u.p.LogUpdateProcessorFactory [collection1] {add=[6 (1566004769334493184)]} 0 11
   [junit4]   2> 1387744 INFO  (TEST-AutoCommitTest.testMaxDocs-seed#[7D57302EABBD9DDA]) [    x:collection1] o.a.s.u.p.LogUpdateProcessorFactory [collection1] {add=[7 (1566004769334493185)]} 0 11
   [junit4]   2> 1387744 INFO  (TEST-AutoCommitTest.testMaxDocs-seed#[7D57302EABBD9DDA]) [    x:collection1] o.a.s.u.p.LogUpdateProcessorFactory [collection1] {add=[8 (1566004769334493186)]} 0 11
   [junit4]   2> 1387745 INFO  (TEST-AutoCommitTest.testMaxDocs-seed#[7D57302EABBD9DDA]) [    x:collection1] o.a.s.u.p.LogUpdateProcessorFactory [collection1] {add=[9 (1566004769334493187)]} 0 12
   [junit4]   2> 1387745 INFO  (TEST-AutoCommitTest.testMaxDocs-seed#[7D57302EABBD9DDA]) [    x:collection1] o.a.s.u.p.LogUpdateProcessorFactory [collection1] {add=[10 (1566004769335541760)]} 0 12
   [junit4]   2> 1387745 INFO  (TEST-AutoCommitTest.testMaxDocs-seed#[7D57302EABBD9DDA]) [    x:collection1] o.a.s.u.p.LogUpdateProcessorFactory [collection1] {add=[11 (1566004769335541761)]} 0 12
   [junit4]   2> 1387746 INFO  (TEST-AutoCommitTest.testMaxDocs-seed#[7D57302EABBD9DDA]) [    x:collection1] o.a.s.u.p.LogUpdateProcessorFactory [collection1] {add=[12 (1566004769335541762)]} 0 13
   [junit4]   2> 1387746 INFO  (TEST-AutoCommitTest.testMaxDocs-seed#[7D57302EABBD9DDA]) [    x:collection1] o.a.s.u.p.LogUpdateProcessorFactory [collection1] {add=[13 (1566004769336590336)]} 0 13
   [junit4]   2> 1387746 INFO  (TEST-AutoCommitTest.testMaxDocs-seed#[7D57302EABBD9DDA]) [    x:collection1] o.a.s.c.S.Request [collection1]  webapp=null path=null params={q=id:1&qt=standard&start=0&rows=20&version=2.2} hits=0 status=0 QTime=0
   [junit4]   2> 1387747 INFO  (TEST-AutoCommitTest.testMaxDocs-seed#[7D57302EABBD9DDA]) [    x:collection1] o.a.s.u.p.LogUpdateProcessorFactory [collection1] {add=[14 (1566004769337638912)]} 0 14
   [junit4]   2> 1387748 INFO  (TEST-AutoCommitTest.testMaxDocs-seed#[7D57302EABBD9DDA]) [    x:collection1] o.a.s.u.p.LogUpdateProcessorFactory [collection1] {add=[15 (1566004769337638913)]} 0 15
   [junit4]   2> 1387748 INFO  (TEST-AutoCommitTest.testMaxDocs-seed#[7D57302EABBD9DDA]) [    x:collection1] o.a.s.c.S.Request [collection1]  webapp=null path=null params={q=id:14&qt=standard&start=0&rows=20&version=2.2} hits=0 status=0 QTime=0
   [junit4]   2> 1387749 ERROR (TEST-AutoCommitTest.testMaxDocs-seed#[7D57302EABBD9DDA]) [    x:collection1] o.a.s.SolrTestCaseJ4 REQUEST FAILED: xpath=//result[@numFound=1]
   [junit4]   2> 	xml response was: <?xml version="1.0" encoding="UTF-8"?>
   [junit4]   2> <response>
   [junit4]   2> <lst name="responseHeader"><int name="status">0</int><int name="QTime">0</int></lst><result name="response" numFound="0" start="0"></result>
   [junit4]   2> </response>
   [junit4]   2> 
   [junit4]   2> 	request was:q=id:14&qt=standard&start=0&rows=20&version=2.2
   [junit4]   2> 1387749 ERROR (TEST-AutoCommitTest.testMaxDocs-seed#[7D57302EABBD9DDA]) [    x:collection1] o.a.s.SolrTestCaseJ4 REQUEST FAILED: q=id:14&qt=standard&start=0&rows=20&version=2.2:java.lang.RuntimeException: REQUEST FAILED: xpath=//result[@numFound=1]
   [junit4]   2> 	xml response was: <?xml version="1.0" encoding="UTF-8"?>
   [junit4]   2> <response>
   [junit4]   2> <lst name="responseHeader"><int name="status">0</int><int name="QTime">0</int></lst><result name="response" numFound="0" start="0"></result>
   [junit4]   2> </response>
   [junit4]   2> 
   [junit4]   2> 	request was:q=id:14&qt=standard&start=0&rows=20&version=2.2
   [junit4]   2> 	at org.apache.solr.SolrTestCaseJ4.assertQ(SolrTestCaseJ4.java:889)
   [junit4]   2> 	at org.apache.solr.update.AutoCommitTest.testMaxDocs(AutoCommitTest.java:225)
   [junit4]   2> 	at sun.reflect.NativeMethodAccessorImpl.invoke0(Native Method)
   [junit4]   2> 	at sun.reflect.NativeMethodAccessorImpl.invoke(NativeMethodAccessorImpl.java:62)
   [junit4]   2> 	at sun.reflect.DelegatingMethodAccessorImpl.invoke(DelegatingMethodAccessorImpl.java:43)
   [junit4]   2> 	at java.lang.reflect.Method.invoke(Method.java:498)
   [junit4]   2> 	at com.carrotsearch.randomizedtesting.RandomizedRunner.invoke(RandomizedRunner.java:1713)
   [junit4]   2> 	at com.carrotsearch.randomizedtesting.RandomizedRunner$8.evaluate(RandomizedRunner.java:907)
   [junit4]   2> 	at com.carrotsearch.randomizedtesting.RandomizedRunner$9.evaluate(RandomizedRunner.java:943)
   [junit4]   2> 	at com.carrotsearch.randomizedtesting.RandomizedRunner$10.evaluate(RandomizedRunner.java:957)
   [junit4]   2> 	at com.carrotsearch.randomizedtesting.rules.SystemPropertiesRestoreRule$1.evaluate(SystemPropertiesRestoreRule.java:57)
   [junit4]   2> 	at org.apache.lucene.util.TestRuleSetupTeardownChained$1.evaluate(TestRuleSetupTeardownChained.java:49)
   [junit4]   2> 	at org.apache.lucene.util.AbstractBeforeAfterRule$1.evaluate(AbstractBeforeAfterRule.java:45)
   [junit4]   2> 	at org.apache.lucene.util.TestRuleThreadAndTestName$1.evaluate(TestRuleThreadAndTestName.java:48)
   [junit4]   2> 	at org.apache.lucene.util.TestRuleIgnoreAfterMaxFailures$1.evaluate(TestRuleIgnoreAfterMaxFailures.java:64)
   [junit4]   2> 	at org.apache.lucene.util.TestRuleMarkFailure$1.evaluate(TestRuleMarkFailure.java:47)
   [junit4]   2> 	at com.carrotsearch.randomizedtesting.rules.StatementAdapter.evaluate(StatementAdapter.java:36)
   [junit4]   2> 	at com.carrotsearch.randomizedtesting.ThreadLeakControl$StatementRunner.run(ThreadLeakControl.java:368)
   [junit4]   2> 	at com.carrotsearch.randomizedtesting.ThreadLeakControl.forkTimeoutingTask(ThreadLeakControl.java:817)
   [junit4]   2> 	at com.carrotsearch.randomizedtesting.ThreadLeakControl$3.evaluate(ThreadLeakControl.java:468)
   [junit4]   2> 	at com.carrotsearch.randomizedtesting.RandomizedRunner.runSingleTest(RandomizedRunner.java:916)
   [junit4]   2> 	at com.carrotsearch.randomizedtesting.RandomizedRunner$5.evaluate(RandomizedRunner.java:802)
   [junit4]   2> 	at com.carrotsearch.randomizedtesting.RandomizedRunner$6.evaluate(RandomizedRunner.java:852)
   [junit4]   2> 	at com.carrotsearch.randomizedtesting.RandomizedRunner$7.evaluate(RandomizedRunner.java:863)
   [junit4]   2> 	at com.carrotsearch.randomizedtesting.rules.StatementAdapter.evaluate(StatementAdapter.java:36)
   [junit4]   2> 	at com.carrotsearch.randomizedtesting.rules.SystemPropertiesRestoreRule$1.evaluate(SystemPropertiesRestoreRule.java:57)
   [junit4]   2> 	at org.apache.lucene.util.AbstractBeforeAfterRule$1.evaluate(AbstractBeforeAfterRule.java:45)
   [junit4]   2> 	at com.carrotsearch.randomizedtesting.rules.StatementAdapter.evaluate(StatementAdapter.java:36)
   [junit4]   2> 	at org.apache.lucene.util.TestRuleStoreClassName$1.evaluate(TestRuleStoreClassName.java:41)
   [junit4]   2> 	at com.carrotsearch.randomizedtesting.rules.NoShadowingOrOverridesOnMethodsRule$1.evaluate(NoShadowingOrOverridesOnMethodsRule.java:40)
   [junit4]   2> 	at com.carrotsearch.randomizedtesting.rules.NoShadowingOrOverridesOnMethodsRule$1.evaluate(NoShadowingOrOverridesOnMethodsRule.java:40)
   [junit4]   2> 	at com.carrotsearch.randomizedtesting.rules.StatementAdapter.evaluate(StatementAdapter.java:36)
   [junit4]   2> 	at com.carrotsearch.randomizedtesting.rules.StatementAdapter.evaluate(StatementAdapter.java:36)
   [junit4]   2> 	at com.carrotsearch.randomizedtesting.rules.StatementAdapter.evaluate(StatementAdapter.java:36)
   [junit4]   2> 	at org.apache.lucene.util.TestRuleAssertionsRequired$1.evaluate(TestRuleAssertionsRequired.java:53)
   [junit4]   2> 	at org.apache.lucene.util.TestRuleMarkFailure$1.evaluate(TestRuleMarkFailure.java:47)
   [junit4]   2> 	at org.apache.lucene.util.TestRuleIgnoreAfterMaxFailures$1.evaluate(TestRuleIgnoreAfterMaxFailures.java:64)
   [junit4]   2> 	at org.apache.lucene.util.TestRuleIgnoreTestSuites$1.evaluate(TestRuleIgnoreTestSuites.java:54)
   [junit4]   2> 	at com.carrotsearch.randomizedtesting.rules.StatementAdapter.evaluate(StatementAdapter.java:36)
   [junit4]   2> 	at com.carrotsearch.randomizedtesting.ThreadLeakControl$StatementRunner.run(ThreadLeakControl.java:368)
   [junit4]   2> 	at java.lang.Thread.run(Thread.java:745)
   [junit4]   2> 
   [junit4]   2> 1387750 INFO  (TEST-AutoCommitTest.testMaxDocs-seed#[7D57302EABBD9DDA]) [    x:collection1] o.a.s.SolrTestCaseJ4 ###Ending testMaxDocs
   [junit4]   2> 1387749 INFO  (commitScheduler-7288-thread-1) [    x:collection1] o.a.s.u.DirectUpdateHandler2 start commit{,optimize=false,openSearcher=true,waitSearcher=true,expungeDeletes=false,softCommit=true,prepareCommit=false}
   [junit4]   2> 1387786 INFO  (commitScheduler-7288-thread-1) [    x:collection1] o.a.s.s.SolrIndexSearcher Opening [Searcher@69eb2e21[collection1] main]
   [junit4]   2> 1387786 INFO  (commitScheduler-7288-thread-1) [    x:collection1] o.a.s.u.DirectUpdateHandler2 end_commit_flush
   [junit4]   2> 1387788 INFO  (searcherExecutor-7285-thread-1-processing-x:collection1) [    x:collection1] o.a.s.c.SolrCore [collection1] Registered new searcher Searcher@69eb2e21[collection1] main{ExitableDirectoryReader(UninvertingDirectoryReader(Uninverting(_3(7.0.0):C16)))}
   [junit4]   2> NOTE: reproduce with: ant test  -Dtestcase=AutoCommitTest -Dtests.method=testMaxDocs -Dtests.seed=7D57302EABBD9DDA -Dtests.slow=true -Dtests.locale=sr-ME -Dtests.timezone=Iran -Dtests.asserts=true -Dtests.file.encoding=UTF-8
   [junit4] ERROR   0.55s J0 | AutoCommitTest.testMaxDocs <<<
   [junit4]    > Throwable #1: java.lang.RuntimeException: Exception during query
   [junit4]    > 	at __randomizedtesting.SeedInfo.seed([7D57302EABBD9DDA:C4D6E6F187579950]:0)
   [junit4]    > 	at org.apache.solr.SolrTestCaseJ4.assertQ(SolrTestCaseJ4.java:896)
   [junit4]    > 	at org.apache.solr.update.AutoCommitTest.testMaxDocs(AutoCommitTest.java:225)
   [junit4]    > 	at java.lang.Thread.run(Thread.java:745)
   [junit4]    > Caused by: java.lang.RuntimeException: REQUEST FAILED: xpath=//result[@numFound=1]
   [junit4]    > 	xml response was: <?xml version="1.0" encoding="UTF-8"?>
   [junit4]    > <response>
   [junit4]    > <lst name="responseHeader"><int name="status">0</int><int name="QTime">0</int></lst><result name="response" numFound="0" start="0"></result>
   [junit4]    > </response>
   [junit4]    > 	request was:q=id:14&qt=standard&start=0&rows=20&version=2.2
   [junit4]    > 	at org.apache.solr.SolrTestCaseJ4.assertQ(SolrTestCaseJ4.java:889)
   [junit4]    > 	... 40 more
   [junit4]   2> 1387898 INFO  (TEST-AutoCommitTest.testMaxTime-seed#[7D57302EABBD9DDA]) [    x:collection1] o.a.s.SolrTestCaseJ4 ###Starting testMaxTime
   [junit4]   2> 1387905 INFO  (TEST-AutoCommitTest.testMaxTime-seed#[7D57302EABBD9DDA]) [    x:collection1] o.a.s.u.DirectUpdateHandler2 [collection1] REMOVING ALL DOCUMENTS FROM INDEX
   [junit4]   2> 1387912 INFO  (TEST-AutoCommitTest.testMaxTime-seed#[7D57302EABBD9DDA]) [    x:collection1] o.a.s.s.SolrIndexSearcher Opening [Searcher@313222f7[collection1] realtime]
   [junit4]   2> 1387919 INFO  (TEST-AutoCommitTest.testMaxTime-seed#[7D57302EABBD9DDA]) [    x:collection1] o.a.s.u.p.LogUpdateProcessorFactory [collection1]  webapp=null path=null params={_version_=-9223372036854775807&update.distrib=FROMLEADER&versions=true&wt=json&indent=true}{deleteByQuery=*:* (-9223372036854775807)} 0 18
   [junit4]   2> 1387927 ERROR (TEST-AutoCommitTest.testMaxTime-seed#[7D57302EABBD9DDA]) [    x:collection1] o.a.s.c.CorePropertiesLocator Couldn't load core descriptor from /export/home/jenkins/workspace/Lucene-Solr-master-Solaris/solr/core/src/test-files/solr/collection1/core.properties:java.nio.file.NoSuchFileException: /export/home/jenkins/workspace/Lucene-Solr-master-Solaris/solr/core/src/test-files/solr/collection1/core.properties
   [junit4]   2> 1387935 INFO  (TEST-AutoCommitTest.testMaxTime-seed#[7D57302EABBD9DDA]) [    x:collection1] o.a.s.c.SolrResourceLoader [null] Added 2 libs to classloader, from paths: [/export/home/jenkins/workspace/Lucene-Solr-master-Solaris/solr/core/src/test-files/solr/collection1/lib, /export/home/jenkins/workspace/Lucene-Solr-master-Solaris/solr/core/src/test-files/solr/collection1/lib/classes]
   [junit4]   2> 1388008 WARN  (TEST-AutoCommitTest.testMaxTime-seed#[7D57302EABBD9DDA]) [    x:collection1] o.a.s.c.Config Beginning with Solr 5.5, <mergePolicy> is deprecated, use <mergePolicyFactory> instead.
   [junit4]   2> 1388011 INFO  (TEST-AutoCommitTest.testMaxTime-seed#[7D57302EABBD9DDA]) [    x:collection1] o.a.s.c.SolrConfig Using Lucene MatchVersion: 7.0.0
   [junit4]   2> 1388055 INFO  (TEST-AutoCommitTest.testMaxTime-seed#[7D57302EABBD9DDA]) [    x:collection1] o.a.s.s.IndexSchema [collection1] Schema name=test
   [junit4]   2> 1388536 WARN  (TEST-AutoCommitTest.testMaxTime-seed#[7D57302EABBD9DDA]) [    x:collection1] o.a.s.s.IndexSchema [collection1] default search field in schema is text. WARNING: Deprecated, please use 'df' on request instead.
   [junit4]   2> 1388543 INFO  (TEST-AutoCommitTest.testMaxTime-seed#[7D57302EABBD9DDA]) [    x:collection1] o.a.s.s.IndexSchema Loaded schema test/1.0 with uniqueid field id
   [junit4]   2> 1388550 INFO  (TEST-AutoCommitTest.testMaxTime-seed#[7D57302EABBD9DDA]) [    x:collection1] o.a.s.c.CoreContainer Reloading SolrCore 'collection1' using configuration from instancedir /export/home/jenkins/workspace/Lucene-Solr-master-Solaris/solr/core/src/test-files/solr/collection1
   [junit4]   2> 1388562 INFO  (TEST-AutoCommitTest.testMaxTime-seed#[7D57302EABBD9DDA]) [    x:collection1] o.a.s.m.r.SolrJmxReporter JMX monitoring for 'solr.core.collection1' (registry 'solr.core.collection1') enabled at server: com.sun.jmx.mbeanserver.JmxMBeanServer@11512f3a
   [junit4]   2> 1388562 INFO  (TEST-AutoCommitTest.testMaxTime-seed#[7D57302EABBD9DDA]) [    x:collection1] o.a.s.c.SolrCore [[collection1] ] Opening new SolrCore at [/export/home/jenkins/workspace/Lucene-Solr-master-Solaris/solr/core/src/test-files/solr/collection1], dataDir=[/export/home/jenkins/workspace/Lucene-Solr-master-Solaris/solr/build/solr-core/test/J0/temp/solr.update.AutoCommitTest_7D57302EABBD9DDA-001/init-core-data-001/]
   [junit4]   2> 1388644 INFO  (TEST-AutoCommitTest.testMaxTime-seed#[7D57302EABBD9DDA]) [    x:collection1] o.a.s.u.CommitTracker Hard AutoCommit: disabled
   [junit4]   2> 1388644 INFO  (TEST-AutoCommitTest.testMaxTime-seed#[7D57302EABBD9DDA]) [    x:collection1] o.a.s.u.CommitTracker Soft AutoCommit: disabled
   [junit4]   2> 1388645 INFO  (TEST-AutoCommitTest.testMaxTime-seed#[7D57302EABBD9DDA]) [    x:collection1] o.a.s.s.SolrIndexSearcher Opening [Searcher@62018278[collection1] main]
   [junit4]   2> 1388646 INFO  (TEST-AutoCommitTest.testMaxTime-seed#[7D57302EABBD9DDA]) [    x:collection1] o.a.s.h.c.SpellCheckComponent Initializing spell checkers
   [junit4]   2> 1388646 INFO  (TEST-AutoCommitTest.testMaxTime-seed#[7D57302EABBD9DDA]) [    x:collection1] o.a.s.s.DirectSolrSpellChecker init: {name=direct,classname=DirectSolrSpellChecker,field=lowerfilt,minQueryLength=3}
   [junit4]   2> 1388649 INFO  (TEST-AutoCommitTest.testMaxTime-seed#[7D57302EABBD9DDA]) [    x:collection1] o.a.s.h.ReplicationHandler Commits will be reserved for  10000
   [junit4]   2> 1388652 INFO  (TEST-AutoCommitTest.testMaxTime-seed#[7D57302EABBD9DDA]) [    x:collection1] o.a.s.u.RandomMergePolicy RandomMergePolicy wrapping class org.apache.lucene.index.TieredMergePolicy: [TieredMergePolicy: maxMergeAtOnce=25, maxMergeAtOnceExplicit=37, maxMergedSegmentMB=25.3798828125, floorSegmentMB=0.8232421875, forceMergeDeletesPctAllowed=1.4457660314472687, segmentsPerTier=26.0, maxCFSSegmentSizeMB=8.796093022207999E12, noCFSRatio=0.0
   [junit4]   2> 1388653 INFO  (TEST-AutoCommitTest.testMaxTime-seed#[7D57302EABBD9DDA]) [    x:collection1] o.a.s.u.DefaultSolrCoreState New IndexWriter is ready to be used.
   [junit4]   2> 1388653 INFO  (searcherExecutor-7289-thread-1-processing-x:collection1) [    x:collection1] o.a.s.h.c.SpellCheckComponent Loading spell index for spellchecker: default
   [junit4]   2> 1388654 INFO  (searcherExecutor-7289-thread-1-processing-x:collection1) [    x:collection1] o.a.s.h.c.SpellCheckComponent Loading spell index for spellchecker: direct
   [junit4]   2> 1388654 INFO  (searcherExecutor-7289-thread-1-processing-x:collection1) [    x:collection1] o.a.s.h.c.SpellCheckComponent Loading spell index for spellchecker: wordbreak
   [junit4]   2> 1388654 INFO  (searcherExecutor-7289-thread-1-processing-x:collection1) [    x:collection1] o.a.s.h.c.SpellCheckComponent Loading spell index for spellchecker: multipleFields
   [junit4]   2> 1388654 INFO  (searcherExecutor-7289-thread-1-processing-x:collection1) [    x:collection1] o.a.s.h.c.SpellCheckComponent Loading spell index for spellchecker: jarowinkler
   [junit4]   2> 1388655 INFO  (searcherExecutor-7289-thread-1-processing-x:collection1) [    x:collection1] o.a.s.h.c.SpellCheckComponent Loading spell index for spellchecker: external
   [junit4]   2> 1388656 INFO  (searcherExecutor-7289-thread-1-processing-x:collection1) [    x:collection1] o.a.s.h.c.SpellCheckComponent Loading spell index for spellchecker: freq
   [junit4]   2> 1388656 INFO  (searcherExecutor-7289-thread-1-processing-x:collection1) [    x:collection1] o.a.s.h.c.SpellCheckComponent Loading spell index for spellchecker: fqcn
   [junit4]   2> 1388657 INFO  (searcherExecutor-7289-thread-1-processing-x:collection1) [    x:collection1] o.a.s.h.c.SpellCheckComponent Loading spell index for spellchecker: perDict
   [junit4]   2> 1388661 INFO  (searcherExecutor-7289-thread-1-processing-x:collection1) [    x:collection1] o.a.s.c.SolrCore [collection1] Registered new searcher Searcher@62018278[collection1] main{ExitableDirectoryReader(UninvertingDirectoryReader())}
   [junit4]   2> 1388662 INFO  (TEST-AutoCommitTest.testMaxTime-seed#[7D57302EABBD9DDA]) [    x:collection1] o.a.s.s.SolrIndexSearcher Opening [Searcher@4a71534a[collection1] main]
   [junit4]   2> 1388663 INFO  (TEST-AutoCommitTest.testMaxTime-seed#[7D57302EABBD9DDA]) [    x:collection1] o.a.s.c.SolrCore [collection1]  CLOSING SolrCore org.apache.solr.core.SolrCore@c7173d8
   [junit4]   2> 1388663 INFO  (TEST-AutoCommitTest.testMaxTime-seed#[7D57302EABBD9DDA]) [    x:collection1] o.a.s.m.SolrMetricManager Closing metric reporters for registry=solr.core.collection1, tag=208761816
   [junit4]   2> 1388666 INFO  (searcherExecutor-7289-thread-1-processing-x:collection1) [    x:collection1] o.a.s.c.SolrCore [collection1] Registered new searcher Searcher@4a71534a[collection1] main{ExitableDirectoryReader(UninvertingDirectoryReader())}
   [junit4]   2> 1388679 INFO  (TEST-AutoCommitTest.testMaxTime-seed#[7D57302EABBD9DDA]) [    x:collection1] o.a.s.u.p.LogUpdateProcessorFactory [collection1] {add=[529 (1566004770313863168)]} 0 1
   [junit4]   2> 1388680 INFO  (TEST-AutoCommitTest.testMaxTime-seed#[7D57302EABBD9DDA]) [    x:collection1] o.a.s.c.S.Request [collection1]  webapp=null path=null params={q=id:529&qt=standard&start=0&rows=20&version=2.2} hits=0 status=0 QTime=0
   [junit4]   2> 1390180 INFO  (commitScheduler-7292-thread-1) [    x:collection1] o.a.s.u.DirectUpdateHandler2 start commit{,optimize=false,openSearcher=true,waitSearcher=true,expungeDeletes=false,softCommit=true,prepareCommit=false}
   [junit4]   2> 1390183 INFO  (commitScheduler-7292-thread-1) [    x:collection1] o.a.s.s.SolrIndexSearcher Opening [Searcher@217227fd[collection1] main]
   [junit4]   2> 1390183 INFO  (commitScheduler-7292-thread-1) [    x:collection1] o.a.s.u.DirectUpdateHandler2 end_commit_flush
   [junit4]   2> 1390185 INFO  (searcherExecutor-7289-thread-1-processing-x:collection1) [    x:collection1] o.a.s.c.SolrCore [collection1] Registered new searcher Searcher@217227fd[collection1] main{ExitableDirectoryReader(UninvertingDirectoryReader(Uninverting(_4(7.0.0):C1)))}
   [junit4]   2> 1390434 INFO  (TEST-AutoCommitTest.testMaxTime-seed#[7D57302EABBD9DDA]) [    x:collection1] o.a.s.u.p.LogUpdateProcessorFactory [collection1] {add=[530 (1566004772154114048)]} 0 1756
   [junit4]   2> 1390434 INFO  (TEST-AutoCommitTest.testMaxTime-seed#[7D57302EABBD9DDA]) [    x:collection1] o.a.s.c.S.Request [collection1]  webapp=null path=null params={q=id:529&qt=standard&start=0&rows=20&version=2.2} hits=1 status=0 QTime=0
   [junit4]   2> 1390435 INFO  (TEST-AutoCommitTest.testMaxTime-seed#[7D57302EABBD9DDA]) [    x:collection1] o.a.s.c.S.Request [collection1]  webapp=null path=null params={q=id:530&qt=standard&start=0&rows=20&version=2.2} hits=0 status=0 QTime=0
   [junit4]   2> 1390436 INFO  (TEST-AutoCommitTest.testMaxTime-seed#[7D57302EABBD9DDA]) [    x:collection1] o.a.s.u.p.LogUpdateProcessorFactory [collection1]  webapp=null path=null params={}{delete=[529 (-1566004772157259776)]} 0 0
   [junit4]   2> 1390436 INFO  (TEST-AutoCommitTest.testMaxTime-seed#[7D57302EABBD9DDA]) [    x:collection1] o.a.s.c.S.Request [collection1]  webapp=null path=null params={q=id:529&qt=standard&start=0&rows=20&version=2.2} hits=1 status=0 QTime=0
   [junit4]   2> 1391935 INFO  (commitScheduler-7292-thread-1) [    x:collection1] o.a.s.u.DirectUpdateHandler2 start commit{,optimize=false,openSearcher=true,waitSearcher=true,expungeDeletes=false,softCommit=true,prepareCommit=false}
   [junit4]   2> 1391937 INFO  (commitScheduler-7292-thread-1) [    x:collection1] o.a.s.s.SolrIndexSearcher Opening [Searcher@2c2416ce[collection1] main]
   [junit4]   2> 1391937 INFO  (commitScheduler-7292-thread-1) [    x:collection1] o.a.s.u.DirectUpdateHandler2 end_commit_flush
   [junit4]   2> 1391939 INFO  (searcherExecutor-7289-thread-1-processing-x:collection1) [    x:collection1] o.a.s.c.SolrCore [collection1] Registered new searcher Searcher@2c2416ce[collection1] main{ExitableDirectoryReader(UninvertingDirectoryReader(Uninverting(_5(7.0.0):C1)))}
   [junit4]   2> 1391939 INFO  (TEST-AutoCommitTest.testMaxTime-seed#[7D57302EABBD9DDA]) [    x:collection1] o.a.s.u.p.LogUpdateProcessorFactory [collection1] {add=[550 (1566004773733269504)]} 0 3262
   [junit4]   2> 1391940 INFO  (TEST-AutoCommitTest.testMaxTime-seed#[7D57302EABBD9DDA]) [    x:collection1] o.a.s.c.S.Request [collection1]  webapp=null path=null params={q=id:529&qt=standard&start=0&rows=20&version=2.2} hits=0 status=0 QTime=0
   [junit4]   2> 1391940 INFO  (TEST-AutoCommitTest.testMaxTime-seed#[7D57302EABBD9DDA]) [    x:collection1] o.a.s.u.p.LogUpdateProcessorFactory [collection1] {add=[500 (1566004773734318080)]} 0 3263
   [junit4]   2> 1391940 INFO  (TEST-AutoCommitTest.testMaxTime-seed#[7D57302EABBD9DDA]) [    x:collection1] o.a.s.u.p.LogUpdateProcessorFactory [collection1] {add=[500 (1566004773734318081)]} 0 3263
   [junit4]   2> 1391941 INFO  (TEST-AutoCommitTest.testMaxTime-seed#[7D57302EABBD9DDA]) [    x:collection1] o.a.s.u.p.LogUpdateProcessorFactory [collection1] {add=[500 (1566004773735366656)]} 0 3263
   [junit4]   2> 1391941 INFO  (TEST-AutoCommitTest.testMaxTime-seed#[7D57302EABBD9DDA]) [    x:collection1] o.a.s.u.p.LogUpdateProcessorFactory [collection1] {add=[500 (1566004773735366657)]} 0 3263
   [junit4]   2> 1391941 INFO  (TEST-AutoCommitTest.testMaxTime-seed#[7D57302EABBD9DDA]) [    x:collection1] o.a.s.u.p.LogUpdateProcessorFactory [collection1] {add=[500 (1566004773735366658)]} 0 3264
   [junit4]   2> 1391941 INFO  (TEST-AutoCommitTest.testMaxTime-seed#[7D57302EABBD9DDA]) [    x:collection1] o.a.s.u.p.LogUpdateProcessorFactory [collection1] {add=[500 (1566004773735366659)]} 0 3264
   [junit4]   2> 1391941 INFO  (TEST-AutoCommitTest.testMaxTime-seed#[7D57302EABBD9DDA]) [    x:collection1] o.a.s.u.p.LogUpdateProcessorFactory [collection1] {add=[500 (1566004773735366660)]} 0 3264
   [junit4]   2> 1391941 INFO  (TEST-AutoCommitTest.testMaxTime-seed#[7D57302EABBD9DDA]) [    x:collection1] o.a.s.u.p.LogUpdateProcessorFactory [collection1] {add=[500 (1566004773735366661)]} 0 3264
   [junit4]   2> 1391942 INFO  (TEST-AutoCommitTest.testMaxTime-seed#[7D57302EABBD9DDA]) [    x:collection1] o.a.s.u.p.LogUpdateProcessorFactory [collection1] {add=[500 (1566004773736415232)]} 0 3264
   [junit4]   2> 1391942 INFO  (TEST-AutoCommitTest.testMaxTime-seed#[7D57302EABBD9DDA]) [    x:collection1] o.a.s.u.p.LogUpdateProcessorFactory [collection1] {add=[500 (1566004773736415233)]} 0 3264
   [junit4]   2> 1391942 INFO  (TEST-AutoCommitTest.testMaxTime-seed#[7D57302EABBD9DDA]) [    x:collection1] o.a.s.c.S.Request [collection1]  webapp=null path=null params={q=id:500&qt=standard&start=0&rows=20&version=2.2} hits=0 status=0 QTime=0
   [junit4]   2> 1393449 INFO  (commitScheduler-7292-thread-1) [    x:collection1] o.a.s.u.DirectUpdateHandler2 start commit{,optimize=false,openSearcher=true,waitSearcher=true,expungeDeletes=false,softCommit=true,prepareCommit=false}
   [junit4]   2> 1393456 INFO  (commitScheduler-7292-thread-1) [    x:collection1] o.a.s.s.SolrIndexSearcher Opening [Searcher@5346d848[collection1] main]
   [junit4]   2> 1393458 INFO  (commitScheduler-7292-thread-1) [    x:collection1] o.a.s.u.DirectUpdateHandler2 end_commit_flush
   [junit4]   2> 1393460 INFO  (searcherExecutor-7289-thread-1-processing-x:collection1) [    x:collection1] o.a.s.c.SolrCore [collection1] Registered new searcher Searcher@5346d848[collection1] main{ExitableDirectoryReader(UninvertingDirectoryReader(Uninverting(_5(7.0.0):C1) Uninverting(_6(7.0.0):C11/9:delGen=1)))}
   [junit4]   2> 1393701 INFO  (TEST-AutoCommitTest.testMaxTime-seed#[7D57302EABBD9DDA]) [    x:collection1] o.a.s.u.p.LogUpdateProcessorFactory [collection1] {add=[531 (1566004775579811840)]} 0 5024
   [junit4]   2> 1393701 INFO  (TEST-AutoCommitTest.testMaxTime-seed#[7D57302EABBD9DDA]) [    x:collection1] o.a.s.c.S.Request [collection1]  webapp=null path=null params={q=id:500&qt=standard&start=0&rows=20&version=2.2} hits=1 status=0 QTime=0
   [junit4]   2> 1393703 INFO  (TEST-AutoCommitTest.testMaxTime-seed#[7D57302EABBD9DDA]) [    x:collection1] o.a.s.SolrTestCaseJ4 ###Ending testMaxTime
   [junit4]   2> 1393703 INFO  (SUITE-AutoCommitTest-seed#[7D57302EABBD9DDA]-worker) [    x:collection1] o.a.s.SolrTestCaseJ4 ###deleteCore
   [junit4]   2> 1393703 INFO  (SUITE-AutoCommitTest-seed#[7D57302EABBD9DDA]-worker) [    x:collection1] o.a.s.c.CoreContainer Shutting down CoreContainer instance=202199910
   [junit4]   2> 1393703 INFO  (SUITE-AutoCommitTest-seed#[7D57302EABBD9DDA]-worker) [    x:collection1] o.a.s.m.SolrMetricManager Closing metric reporters for registry=solr.node, tag=null
   [junit4]   2> 1393705 INFO  (SUITE-AutoCommitTest-seed#[7D57302EABBD9DDA]-worker) [    x:collection1] o.a.s.m.SolrMetricManager Closing metric reporters for registry=solr.jvm, tag=null
   [junit4]   2> 1393707 INFO  (SUITE-AutoCommitTest-seed#[7D57302EABBD9DDA]-worker) [    x:collection1] o.a.s.m.SolrMetricManager Closing metric reporters for registry=solr.jetty, tag=null
   [junit4]   2> 1393714 INFO  (SUITE-AutoCommitTest-seed#[7D57302EABBD9DDA]-worker) [    x:collection1] o.a.s.c.TransientSolrCoreCacheDefault Allocating transient cache for 2147483647 transient cores
   [junit4]   2> 1393714 INFO  (coreCloseExecutor-7293-thread-1-processing-x:collection1) [    x:collection1] o.a.s.c.SolrCore [collection1]  CLOSING SolrCore org.apache.solr.core.SolrCore@58f2a09d
   [junit4]   2> 1393714 INFO  (coreCloseExecutor-7293-thread-1-processing-x:collection1) [    x:collection1] o.a.s.u.DirectUpdateHandler2 Committing on IndexWriter close.
   [junit4]   2> 1393714 INFO  (coreCloseExecutor-7293-thread-1-processing-x:collection1) [    x:collection1] o.a.s.u.SolrIndexWriter Calling setCommitData with IW:org.apache.solr.update.SolrIndexWriter@75ca3be9 commitCommandVersion:0
   [junit4]   2> 1393720 INFO  (coreCloseExecutor-7293-thread-1-processing-x:collection1) [    x:collection1] o.a.s.m.SolrMetricManager Closing metric reporters for registry=solr.core.collection1, tag=1492295837
   [junit4]   2> NOTE: leaving temporary files on disk at: /export/home/jenkins/workspace/Lucene-Solr-master-Solaris/solr/build/solr-core/test/J0/temp/solr.update.AutoCommitTest_7D57302EABBD9DDA-001
   [junit4]   2> NOTE: test params are: codec=Asserting(Lucene70), sim=RandomSimilarity(queryNorm=true): {}, locale=sr-ME, timezone=Iran
   [junit4]   2> NOTE: SunOS 5.11 amd64/Oracle Corporation 1.8.0_121 (64-bit)/cpus=3,threads=1,free=160018576,total=518979584
   [junit4]   2> NOTE: All tests run in this JVM: [TestIntervalFaceting, TestComplexPhraseLeadingWildcard, TestDocTermOrds, RecoveryAfterSoftCommitTest, BlockDirectoryTest, TestSQLHandler, BasicDistributedZkTest, LargeFieldTest, TestRemoteStreaming, TestRawResponseWriter, PluginInfoTest, TestReplicaProperties, JsonValidatorTest, TestNamedUpdateProcessors, ZkNodePropsTest, SuggesterFSTTest, DirectSolrSpellCheckerTest, TestDistribDocBasedVersion, TestSerializedLuceneMatchVersion, TestUseDocValuesAsStored2, TestReloadAndDeleteDocs, DistributedExpandComponentTest, TestStandardQParsers, TestFieldCacheReopen, TestInitParams, FastVectorHighlighterTest, MetricUtilsTest, TestGroupingSearch, SolrIndexMetricsTest, TestFilteredDocIdSet, DistributedQueryElevationComponentTest, SearchHandlerTest, TestSimpleTextCodec, TestStressLiveNodes, MetricsHandlerTest, TestSlowCompositeReaderWrapper, TestSystemIdResolver, TestSolrCoreParser, SpellingQueryConverterTest, ZkControllerTest, TestFieldCollectionResource, HdfsRecoverLeaseTest, TestCloudRecovery, TestCustomSort, TestSchemaSimilarityResource, TestReqParamsAPI, SpatialRPTFieldTypeTest, ReplicaListTransformerTest, HardAutoCommitTest, TestSort, TestFileDictionaryLookup, TestBulkSchemaAPI, TestNoOpRegenerator, TestExceedMaxTermLength, ParsingFieldUpdateProcessorsTest, TestFieldCacheSortRandom, OutputWriterTest, TestLegacyNumericRangeQueryBuilder, QueryEqualityTest, MBeansHandlerTest, DataDrivenBlockJoinTest, TestManagedResourceStorage, HLLUtilTest, DeleteStatusTest, TestDynamicFieldCollectionResource, ChangedSchemaMergeTest, TestSchemaNameResource, DistributedQueryComponentOptimizationTest, ConfigureRecoveryStrategyTest, CollectionStateFormat2Test, TestNestedDocsSort, TestPKIAuthenticationPlugin, TestCloudSchemaless, DistributedSpellCheckComponentTest, ClassificationUpdateProcessorFactoryTest, TestRequestStatusCollectionAPI, HdfsCollectionsAPIDistributedZkTest, TestJsonFacets, SolrTestCaseJ4Test, TestLazyCores, SolrJmxReporterTest, HdfsChaosMonkeyNothingIsSafeTest, TestSolrConfigHandlerCloud, DeleteReplicaTest, TestAnalyzeInfixSuggestions, TestSolrQueryResponse, StatelessScriptUpdateProcessorFactoryTest, TestNonDefinedSimilarityFactory, TestGeoJSONResponseWriter, TestExactStatsCache, FacetPivotSmallTest, OverseerRolesTest, DistributedQueueTest, SubstringBytesRefFilterTest, HdfsDirectoryFactoryTest, TestStressVersions, TestExclusionRuleCollectionAccess, MultiTermTest, TestPerFieldSimilarity, TestTolerantSearch, DocValuesMissingTest, AlternateDirectoryTest, TestManagedSchemaAPI, BinaryUpdateRequestHandlerTest, PingRequestHandlerTest, TestCustomStream, ConjunctionSolrSpellCheckerTest, TestImpersonationWithHadoopAuth, HighlighterMaxOffsetTest, SoftAutoCommitTest, TestInPlaceUpdatesDistrib, SchemaVersionSpecificBehaviorTest, ClusterStateUpdateTest, SyncSliceTest, TestHighFrequencyDictionaryFactory, BaseCdcrDistributedZkTest, RequiredFieldsTest, TestOrdValues, TestCoreAdminApis, SolrCoreTest, TestStressLucene, SuggestComponentTest, TestFunctionQuery, TestSolrCoreSnapshots, TestRandomDVFaceting, TestFieldTypeCollectionResource, TestHashQParserPlugin, RAMDirectoryFactoryTest, TestRecoveryHdfs, SimpleFacetsTest, BitVectorTest, DistributedFacetPivotLargeTest, TestCursorMarkWithoutUniqueKey, SolrCoreMetricManagerTest, TestJmxIntegration, PrimitiveFieldTypeTest, SolrCLIZkUtilsTest, TestBinaryField, StandardRequestHandlerTest, TestPartialUpdateDeduplication, NodeMutatorTest, HdfsUnloadDistributedZkTest, SolrXmlInZkTest, DistributedFacetPivotWhiteBoxTest, DisMaxRequestHandlerTest, TestCryptoKeys, SpatialHeatmapFacetsTest, ActionThrottleTest, TestEmbeddedSolrServerConstructors, DocValuesMultiTest, IndexSchemaRuntimeFieldTest, TestImplicitCoreProperties, SmileWriterTest, TestPseudoReturnFields, TestCopyFieldCollectionResource, UpdateLogTest, TestWordDelimiterFilterFactory, SolrPluginUtilsTest, SampleTest, TestLeaderInitiatedRecoveryThread, MigrateRouteKeyTest, HighlighterTest, DistributedMLTComponentTest, SolrGangliaReporterTest, TestHdfsBackupRestoreCore, DocValuesTest, SecurityConfHandlerTest, TestCollationField, SharedFSAutoReplicaFailoverUtilsTest, TestXIncludeConfig, ChaosMonkeySafeLeaderTest, BasicDistributedZk2Test, CollectionsAPIDistributedZkTest, ShardRoutingTest, RecoveryZkTest, LeaderElectionTest, ZkSolrClientTest, TestZkChroot, ZkCLITest, ShardRoutingCustomTest, AutoCommitTest]
   [junit4] Completed [368/706 (1!)] on J0 in 14.51s, 3 tests, 1 error <<< FAILURES!

[...truncated 44498 lines...]