You are viewing a plain text version of this content. The canonical link for it is here.
Posted to builds@cassandra.apache.org by Apache Jenkins Server <je...@builds.apache.org> on 2024/11/11 22:04:45 UTC

Build complete: Cassandra-trunk #1944 [UNSTABLE] fd4113d5fef09f6361bea88a35655db2ecb46427

-------------------------------------------------------------------------------
  Build Cassandra-trunk #1944 Still unstable
  URL: https://ci-cassandra.apache.org/job/Cassandra-trunk/1944/
  -------------------------------------------------------------------------------
  Changes:
  No changes

  -------------------------------------------------------------------------------
  Failed Tests:
  14 tests failed.
FAILED:  org.apache.cassandra.cql3.RandomSchemaTest.Tests / test-cdc jdk11 5/8 / test-cdc_jdk11_x86_64
FAILED:  org.apache.cassandra.db.compaction.CompactionStrategyManagerTest.Tests / test-latest jdk11 1/8 / testAutomaticUpgradeConcurrency-latest_jdk11_x86_64
FAILED:  org.apache.cassandra.db.compaction.CompactionStrategyManagerTest.Tests / test-oa jdk17 1/8 / testAutomaticUpgradeConcurrency-oa_jdk17_x86_64
FAILED:  org.apache.cassandra.cql3.PstmtPersistenceTest.Tests / test-cdc jdk17 2/8 / testPstmtInvalidation-cdc_jdk17_x86_64
FAILED:  org.apache.cassandra.cql3.PstmtPersistenceTest.Tests / test-latest jdk17 2/8 / testPstmtInvalidation-latest_jdk17_x86_64
FAILED:  org.apache.cassandra.cql3.PstmtPersistenceTest.Tests / test jdk17 2/8 / testPstmtInvalidation-_jdk17_x86_64
FAILED:  org.apache.cassandra.cql3.PstmtPersistenceTest.Tests / test-compression jdk17 2/8 / testPstmtInvalidation-compression_jdk17_x86_64
FAILED:  org.apache.cassandra.cql3.PstmtPersistenceTest.Tests / test-oa jdk17 2/8 / testPstmtInvalidation-oa_jdk17_x86_64
FAILED:  org.apache.cassandra.cql3.PstmtPersistenceTest.Tests / test-system-keyspace-directory jdk17 2/8 / testPstmtInvalidation-system_keyspace_directory_jdk17_x86_64
FAILED:  dtest-latest.materialized_views_test.TestMaterializedViewsConsistency.Tests / dtest-latest jdk11 12/64 / test_multi_partition_consistent_reads_after_write
FAILED:  dtest-novnode.pushed_notifications_test.TestPushedNotifications.Tests / dtest-novnode jdk11 47/64 / test_move_single_node_localhost
FAILED:  dtest.cqlsh_tests.test_cqlsh_copy.TestCqlshCopy.Tests / dtest jdk11 48/64 / test_round_trip_with_rate_file
FAILED:  org.apache.cassandra.distributed.test.UpdateSystemAuthAfterDCExpansionTest.Tests / jvm-dtest jdk17 7/12 / replicaFactorTest-_jdk17_x86_64
FAILED:  dtest.replace_address_test.TestReplaceAddress.Tests / dtest jdk11 9/64 / test_fail_without_replace

  -------------------------------------------------------------------------------
  For complete test report and logs see https://nightlies.apache.org/cassandra/Cassandra-trunk/1944/