You are viewing a plain text version of this content. The canonical link for it is here.
Posted to builds@cassandra.apache.org by Apache Jenkins Server <je...@builds.apache.org> on 2025/07/19 07:41:59 UTC
Build complete: Cassandra-5.0 #482 [UNSTABLE] 169c37b030a88b988894cfb7c09ed5c552361285
-------------------------------------------------------------------------------
Build Cassandra-5.0 #482 Still Unstable
URL: https://ci-cassandra.apache.org/job/Cassandra-5.0/482/
-------------------------------------------------------------------------------
Changes:
[David Capwell] IntrusiveStack.accumulate is not accumulating correctly
-------------------------------------------------------------------------------
Failed Tests:
10 tests failed.
FAILED: dtest-latest.bootstrap_test.TestBootstrap.Tests / dtest-latest jdk11 13/64 / test_shutdown_wiped_node_cannot_join
FAILED: dtest-latest.cdc_test.TestCDC.Tests / dtest-latest jdk11 25/64 / test_insertion_and_commitlog_behavior_after_reaching_cdc_total_space
FAILED: dtest-novnode.bootstrap_test.TestBootstrap.Tests / dtest-novnode jdk17 23/64 / test_simultaneous_bootstrap
FAILED: dtest-novnode.global_row_key_cache_test.TestGlobalRowKeyCache.Tests / dtest-novnode jdk11 61/64 / test_functional
FAILED: dtest-upgrade-novnode-large.upgrade_tests.upgrade_through_versions_test.TestUpgrade_current_4_0_x_To_indev_5_0_x.Tests / dtest-upgrade-novnode-large jdk11 30/32 / test_bootstrap_multidc
FAILED: dtest-upgrade-novnode.upgrade_tests.cql_tests.TestCQLNodes2RF1_Upgrade_indev_4_0_x_To_indev_5_0_x.Tests / dtest-upgrade-novnode jdk11 115/128 / test_limit_sparse
FAILED: dtest-upgrade-novnode.upgrade_tests.cql_tests.TestCQLNodes3RF3_Upgrade_indev_4_0_x_To_indev_5_0_x.Tests / dtest-upgrade-novnode jdk11 127/128 / test_exclusive_slice
FAILED: dtest-upgrade-novnode.upgrade_tests.cql_tests.TestCQLNodes3RF3_Upgrade_indev_4_0_x_To_indev_5_0_x.Tests / dtest-upgrade-novnode jdk11 28/128 / test_only_pk
FAILED: dtest.bootstrap_test.TestBootstrap.Tests / dtest jdk17 15/64 / test_decommissioned_wiped_node_can_join
FAILED: org.apache.cassandra.transport.AuthMessageSizeLimitTest.Tests / test-latest jdk17 3/16 / sendTooBigAuthMultiFrameMessage-latest_jdk17_x86_64
-------------------------------------------------------------------------------
For complete test report and logs see https://nightlies.apache.org/cassandra/Cassandra-5.0/482/