You are viewing a plain text version of this content. The canonical link for it is here.
Posted to builds@hbase.apache.org by Apache Jenkins Server <je...@builds.apache.org> on 2015/05/12 22:25:34 UTC

Build failed in Jenkins: HBase-TRUNK #6479

See <https://builds.apache.org/job/HBase-TRUNK/6479/changes>

Changes:

[mstanleyjones] HBASE-13533 section on configuring ~/.m2/settings.xml has no anchor <Gabor Liptak>

[matteo.bertozzi] HBASE-13662 RSRpcService.scan() throws an OutOfOrderScannerNext if the scan has a retriable failure

------------------------------------------
[...truncated 5513 lines...]
	at org.eclipse.jetty.util.thread.NonBlockingThread.run(NonBlockingThread.java:52)
	at org.eclipse.jetty.util.thread.QueuedThreadPool.runJob(QueuedThreadPool.java:635)
	at org.eclipse.jetty.util.thread.QueuedThreadPool$3.run(QueuedThreadPool.java:555)
	at java.lang.Thread.run(Thread.java:744)

"qtp779557490-12-selector-ServerConnectorManager@4fe25e47/2" prio=10 tid=0x00007f5b2c81a000 nid=0x4461 runnable [0x00007f5af3bf4000]
   java.lang.Thread.State: RUNNABLE
	at sun.nio.ch.EPollArrayWrapper.epollWait(Native Method)
	at sun.nio.ch.EPollArrayWrapper.poll(EPollArrayWrapper.java:269)
	at sun.nio.ch.EPollSelectorImpl.doSelect(EPollSelectorImpl.java:79)
	at sun.nio.ch.SelectorImpl.lockAndDoSelect(SelectorImpl.java:87)
	- locked <0x00000007078ca9f8> (a sun.nio.ch.Util$2)
	- locked <0x00000007078ca9e8> (a java.util.Collections$UnmodifiableSet)
	- locked <0x00000007078ca8d0> (a sun.nio.ch.EPollSelectorImpl)
	at sun.nio.ch.SelectorImpl.select(SelectorImpl.java:98)
	at sun.nio.ch.SelectorImpl.select(SelectorImpl.java:102)
	at org.eclipse.jetty.io.SelectorManager$ManagedSelector.select(SelectorManager.java:596)
	at org.eclipse.jetty.io.SelectorManager$ManagedSelector.run(SelectorManager.java:545)
	at org.eclipse.jetty.util.thread.NonBlockingThread.run(NonBlockingThread.java:52)
	at org.eclipse.jetty.util.thread.QueuedThreadPool.runJob(QueuedThreadPool.java:635)
	at org.eclipse.jetty.util.thread.QueuedThreadPool$3.run(QueuedThreadPool.java:555)
	at java.lang.Thread.run(Thread.java:744)

"qtp779557490-11-selector-ServerConnectorManager@4fe25e47/1" prio=10 tid=0x00007f5b2c818800 nid=0x4460 runnable [0x00007f5af3cf5000]
   java.lang.Thread.State: RUNNABLE
	at sun.nio.ch.EPollArrayWrapper.epollWait(Native Method)
	at sun.nio.ch.EPollArrayWrapper.poll(EPollArrayWrapper.java:269)
	at sun.nio.ch.EPollSelectorImpl.doSelect(EPollSelectorImpl.java:79)
	at sun.nio.ch.SelectorImpl.lockAndDoSelect(SelectorImpl.java:87)
	- locked <0x00000007078bb1b0> (a sun.nio.ch.Util$2)
	- locked <0x00000007078bb1a0> (a java.util.Collections$UnmodifiableSet)
	- locked <0x00000007078bb088> (a sun.nio.ch.EPollSelectorImpl)
	at sun.nio.ch.SelectorImpl.select(SelectorImpl.java:98)
	at sun.nio.ch.SelectorImpl.select(SelectorImpl.java:102)
	at org.eclipse.jetty.io.SelectorManager$ManagedSelector.select(SelectorManager.java:596)
	at org.eclipse.jetty.io.SelectorManager$ManagedSelector.run(SelectorManager.java:545)
	at org.eclipse.jetty.util.thread.NonBlockingThread.run(NonBlockingThread.java:52)
	at org.eclipse.jetty.util.thread.QueuedThreadPool.runJob(QueuedThreadPool.java:635)
	at org.eclipse.jetty.util.thread.QueuedThreadPool$3.run(QueuedThreadPool.java:555)
	at java.lang.Thread.run(Thread.java:744)

"qtp779557490-10-selector-ServerConnectorManager@4fe25e47/0" prio=10 tid=0x00007f5b2c818000 nid=0x445f runnable [0x00007f5af3df6000]
   java.lang.Thread.State: RUNNABLE
	at sun.nio.ch.EPollArrayWrapper.epollWait(Native Method)
	at sun.nio.ch.EPollArrayWrapper.poll(EPollArrayWrapper.java:269)
	at sun.nio.ch.EPollSelectorImpl.doSelect(EPollSelectorImpl.java:79)
	at sun.nio.ch.SelectorImpl.lockAndDoSelect(SelectorImpl.java:87)
	- locked <0x00000007078a3fa8> (a sun.nio.ch.Util$2)
	- locked <0x00000007078a3f28> (a java.util.Collections$UnmodifiableSet)
	- locked <0x00000007078a3da8> (a sun.nio.ch.EPollSelectorImpl)
	at sun.nio.ch.SelectorImpl.select(SelectorImpl.java:98)
	at sun.nio.ch.SelectorImpl.select(SelectorImpl.java:102)
	at org.eclipse.jetty.io.SelectorManager$ManagedSelector.select(SelectorManager.java:596)
	at org.eclipse.jetty.io.SelectorManager$ManagedSelector.run(SelectorManager.java:545)
	at org.eclipse.jetty.util.thread.NonBlockingThread.run(NonBlockingThread.java:52)
	at org.eclipse.jetty.util.thread.QueuedThreadPool.runJob(QueuedThreadPool.java:635)
	at org.eclipse.jetty.util.thread.QueuedThreadPool$3.run(QueuedThreadPool.java:555)
	at java.lang.Thread.run(Thread.java:744)

"Service Thread" daemon prio=10 tid=0x00007f5b2c28f800 nid=0x4324 runnable [0x0000000000000000]
   java.lang.Thread.State: RUNNABLE

"C2 CompilerThread1" daemon prio=10 tid=0x00007f5b2c28d800 nid=0x4323 waiting on condition [0x0000000000000000]
   java.lang.Thread.State: RUNNABLE

"C2 CompilerThread0" daemon prio=10 tid=0x00007f5b2c28a800 nid=0x4322 waiting on condition [0x0000000000000000]
   java.lang.Thread.State: RUNNABLE

"Signal Dispatcher" daemon prio=10 tid=0x00007f5b2c280000 nid=0x4321 runnable [0x0000000000000000]
   java.lang.Thread.State: RUNNABLE

"Finalizer" daemon prio=10 tid=0x00007f5b2c269800 nid=0x431d in Object.wait() [0x00007f5af9129000]
   java.lang.Thread.State: WAITING (on object monitor)
	at java.lang.Object.wait(Native Method)
	- waiting on <0x0000000704705568> (a java.lang.ref.ReferenceQueue$Lock)
	at java.lang.ref.ReferenceQueue.remove(ReferenceQueue.java:135)
	- locked <0x0000000704705568> (a java.lang.ref.ReferenceQueue$Lock)
	at java.lang.ref.ReferenceQueue.remove(ReferenceQueue.java:151)
	at java.lang.ref.Finalizer$FinalizerThread.run(Finalizer.java:189)

"Reference Handler" daemon prio=10 tid=0x00007f5b2c265800 nid=0x431c in Object.wait() [0x00007f5af922a000]
   java.lang.Thread.State: WAITING (on object monitor)
	at java.lang.Object.wait(Native Method)
	- waiting on <0x00000007047050f0> (a java.lang.ref.Reference$Lock)
	at java.lang.Object.wait(Object.java:503)
	at java.lang.ref.Reference$ReferenceHandler.run(Reference.java:133)
	- locked <0x00000007047050f0> (a java.lang.ref.Reference$Lock)

"main" prio=10 tid=0x00007f5b2c009000 nid=0x42f4 waiting on condition [0x00007f5b325a0000]
   java.lang.Thread.State: WAITING (parking)
	at sun.misc.Unsafe.park(Native Method)
	- parking to wait for  <0x00000007079babc0> (a java.util.concurrent.CountDownLatch$Sync)
	at java.util.concurrent.locks.LockSupport.park(LockSupport.java:186)
	at java.util.concurrent.locks.AbstractQueuedSynchronizer.parkAndCheckInterrupt(AbstractQueuedSynchronizer.java:834)
	at java.util.concurrent.locks.AbstractQueuedSynchronizer.doAcquireSharedInterruptibly(AbstractQueuedSynchronizer.java:994)
	at java.util.concurrent.locks.AbstractQueuedSynchronizer.acquireSharedInterruptibly(AbstractQueuedSynchronizer.java:1303)
	at java.util.concurrent.CountDownLatch.await(CountDownLatch.java:236)
	at org.apache.camel.impl.DefaultAsyncProcessorAwaitManager.await(DefaultAsyncProcessorAwaitManager.java:74)
	at org.apache.camel.util.AsyncProcessorHelper.process(AsyncProcessorHelper.java:122)
	at org.apache.camel.processor.UnitOfWorkProducer.process(UnitOfWorkProducer.java:68)
	at org.apache.camel.impl.ProducerCache$2.doInProducer(ProducerCache.java:375)
	at org.apache.camel.impl.ProducerCache$2.doInProducer(ProducerCache.java:343)
	at org.apache.camel.impl.ProducerCache.doInProducer(ProducerCache.java:233)
	at org.apache.camel.impl.ProducerCache.sendExchange(ProducerCache.java:343)
	at org.apache.camel.impl.ProducerCache.send(ProducerCache.java:201)
	at org.apache.camel.impl.DefaultProducerTemplate.send(DefaultProducerTemplate.java:128)
	at org.apache.camel.impl.DefaultProducerTemplate.send(DefaultProducerTemplate.java:115)
	at org.apache.camel.impl.DefaultProducerTemplate.request(DefaultProducerTemplate.java:297)
	at org.apache.camel.component.jetty.jettyproducer.HttpJettyProducerRecipientListCustomThreadPoolTest.testRecipientList(HttpJettyProducerRecipientListCustomThreadPoolTest.java:40)
	at sun.reflect.NativeMethodAccessorImpl.invoke0(Native Method)
	at sun.reflect.NativeMethodAccessorImpl.invoke(NativeMethodAccessorImpl.java:57)
	at sun.reflect.DelegatingMethodAccessorImpl.invoke(DelegatingMethodAccessorImpl.java:43)
	at java.lang.reflect.Method.invoke(Method.java:606)
	at org.junit.runners.model.FrameworkMethod$1.runReflectiveCall(FrameworkMethod.java:47)
	at org.junit.internal.runners.model.ReflectiveCallable.run(ReflectiveCallable.java:12)
	at org.junit.runners.model.FrameworkMethod.invokeExplosively(FrameworkMethod.java:44)
	at org.junit.internal.runners.statements.InvokeMethod.evaluate(InvokeMethod.java:17)
	at org.junit.internal.runners.statements.RunBefores.evaluate(RunBefores.java:26)
	at org.junit.internal.runners.statements.RunAfters.evaluate(RunAfters.java:27)
	at org.junit.rules.TestWatcher$1.evaluate(TestWatcher.java:55)
	at org.junit.rules.TestWatcher$1.evaluate(TestWatcher.java:55)
	at org.junit.rules.RunRules.evaluate(RunRules.java:20)
	at org.junit.runners.ParentRunner.runLeaf(ParentRunner.java:271)
	at org.junit.runners.BlockJUnit4ClassRunner.runChild(BlockJUnit4ClassRunner.java:70)
	at org.junit.runners.BlockJUnit4ClassRunner.runChild(BlockJUnit4ClassRunner.java:50)
	at org.junit.runners.ParentRunner$3.run(ParentRunner.java:238)
	at org.junit.runners.ParentRunner$1.schedule(ParentRunner.java:63)
	at org.junit.runners.ParentRunner.runChildren(ParentRunner.java:236)
	at org.junit.runners.ParentRunner.access$000(ParentRunner.java:53)
	at org.junit.runners.ParentRunner$2.evaluate(ParentRunner.java:229)
	at org.junit.internal.runners.statements.RunBefores.evaluate(RunBefores.java:26)
	at org.junit.internal.runners.statements.RunAfters.evaluate(RunAfters.java:27)
	at org.junit.runners.ParentRunner.run(ParentRunner.java:309)
	at org.apache.maven.surefire.junit4.JUnit4Provider.execute(JUnit4Provider.java:264)
	at org.apache.maven.surefire.junit4.JUnit4Provider.executeTestSet(JUnit4Provider.java:153)
	at org.apache.maven.surefire.junit4.JUnit4Provider.invoke(JUnit4Provider.java:124)
	at org.apache.maven.surefire.booter.ForkedBooter.invokeProviderInSameClassLoader(ForkedBooter.java:200)
	at org.apache.maven.surefire.booter.ForkedBooter.runSuitesInProcess(ForkedBooter.java:153)
	at org.apache.maven.surefire.booter.ForkedBooter.main(ForkedBooter.java:103)

"VM Thread" prio=10 tid=0x00007f5b2c263800 nid=0x431b runnable 

"GC task thread#0 (ParallelGC)" prio=10 tid=0x00007f5b2c01f000 nid=0x42fa runnable 

"GC task thread#1 (ParallelGC)" prio=10 tid=0x00007f5b2c020800 nid=0x42fb runnable 

"GC task thread#2 (ParallelGC)" prio=10 tid=0x00007f5b2c022800 nid=0x42fc runnable 

"GC task thread#3 (ParallelGC)" prio=10 tid=0x00007f5b2c024800 nid=0x42fd runnable 

"GC task thread#4 (ParallelGC)" prio=10 tid=0x00007f5b2c026800 nid=0x42fe runnable 

"GC task thread#5 (ParallelGC)" prio=10 tid=0x00007f5b2c028000 nid=0x42ff runnable 

"GC task thread#6 (ParallelGC)" prio=10 tid=0x00007f5b2c02a000 nid=0x4300 runnable 

"GC task thread#7 (ParallelGC)" prio=10 tid=0x00007f5b2c02c000 nid=0x4301 runnable 

"GC task thread#8 (ParallelGC)" prio=10 tid=0x00007f5b2c02d800 nid=0x4303 runnable 

"GC task thread#9 (ParallelGC)" prio=10 tid=0x00007f5b2c02f800 nid=0x4304 runnable 

"GC task thread#10 (ParallelGC)" prio=10 tid=0x00007f5b2c031800 nid=0x4307 runnable 

"GC task thread#11 (ParallelGC)" prio=10 tid=0x00007f5b2c033800 nid=0x4308 runnable 

"GC task thread#12 (ParallelGC)" prio=10 tid=0x00007f5b2c035000 nid=0x4309 runnable 

"VM Periodic Task Thread" prio=10 tid=0x00007f5b2c29a000 nid=0x4325 waiting on condition 

JNI global references: 221

+ echo '************ END  zombies jstack extract'
************ END  zombies jstack extract
+ JIRA_COMMENT='

     {color:red}-1 core zombie tests{color}.  There are 1 zombie test(s): 	at org.apache.camel.test.junit4.CamelTestSupport.doSetUp(CamelTestSupport.java:325)
	at org.apache.camel.test.junit4.CamelTestSupport.setUp(CamelTestSupport.java:238)
	at org.apache.camel.component.jetty.jettyproducer.HttpJettyProducerRecipientListCustomThreadPoolTest.testRecipientList(HttpJettyProducerRecipientListCustomThreadPoolTest.java:40)'
+ BAD=1
+ jps
+ grep surefirebooter
+ xargs kill -9
+ cut -d ' ' -f 1
POST BUILD TASK : SUCCESS
END OF POST BUILD TASK : 0
Archiving artifacts
Sending artifact delta relative to HBase-TRUNK #6477
Archived 2166 artifacts
Archive block size is 32768
Received 112 blocks and 432619517 bytes
Compression is 0.8%
Took 3 min 45 sec
Recording test results
[FINDBUGS] Collecting findbugs analysis files...
[FINDBUGS] Finding all files that match the pattern **/findbugs.xml,**/findbugsXml.xml
[FINDBUGS] Parsing 24 files in <https://builds.apache.org/job/HBase-TRUNK/ws/>
[FINDBUGS] Successfully parsed file <https://builds.apache.org/job/HBase-TRUNK/6479/artifact/hbase-annotations/target/findbugs.xml> of module  with 0 warnings.
[FINDBUGS] Successfully parsed file <https://builds.apache.org/job/HBase-TRUNK/6479/artifact/hbase-annotations/target/findbugsXml.xml> of module  with 0 warnings.
[FINDBUGS] Successfully parsed file <https://builds.apache.org/job/HBase-TRUNK/6479/artifact/hbase-client/target/findbugs.xml> of module  with 0 warnings.
[FINDBUGS] Successfully parsed file <https://builds.apache.org/job/HBase-TRUNK/6479/artifact/hbase-client/target/findbugsXml.xml> of module  with 8 warnings.
[FINDBUGS] Successfully parsed file <https://builds.apache.org/job/HBase-TRUNK/6479/artifact/hbase-common/target/findbugs.xml> of module  with 0 warnings.
[FINDBUGS] Successfully parsed file <https://builds.apache.org/job/HBase-TRUNK/6479/artifact/hbase-common/target/findbugsXml.xml> of module  with 1 warnings.
[FINDBUGS] Successfully parsed file <https://builds.apache.org/job/HBase-TRUNK/6479/artifact/hbase-examples/target/findbugs.xml> of module  with 0 warnings.
[FINDBUGS] Successfully parsed file <https://builds.apache.org/job/HBase-TRUNK/6479/artifact/hbase-examples/target/findbugsXml.xml> of module  with 0 warnings.
[FINDBUGS] Successfully parsed file <https://builds.apache.org/job/HBase-TRUNK/6479/artifact/hbase-hadoop-compat/target/findbugs.xml> of module  with 0 warnings.
[FINDBUGS] Successfully parsed file <https://builds.apache.org/job/HBase-TRUNK/6479/artifact/hbase-hadoop-compat/target/findbugsXml.xml> of module  with 0 warnings.
[FINDBUGS] Successfully parsed file <https://builds.apache.org/job/HBase-TRUNK/6479/artifact/hbase-hadoop2-compat/target/findbugs.xml> of module  with 0 warnings.
[FINDBUGS] Successfully parsed file <https://builds.apache.org/job/HBase-TRUNK/6479/artifact/hbase-hadoop2-compat/target/findbugsXml.xml> of module  with 0 warnings.
[FINDBUGS] Successfully parsed file <https://builds.apache.org/job/HBase-TRUNK/6479/artifact/hbase-prefix-tree/target/findbugs.xml> of module  with 0 warnings.
[FINDBUGS] Successfully parsed file <https://builds.apache.org/job/HBase-TRUNK/6479/artifact/hbase-prefix-tree/target/findbugsXml.xml> of module  with 0 warnings.
[FINDBUGS] Successfully parsed file <https://builds.apache.org/job/HBase-TRUNK/6479/artifact/hbase-procedure/target/findbugs.xml> of module  with 0 warnings.
[FINDBUGS] Successfully parsed file <https://builds.apache.org/job/HBase-TRUNK/6479/artifact/hbase-procedure/target/findbugsXml.xml> of module  with 1 warnings.
[FINDBUGS] Successfully parsed file <https://builds.apache.org/job/HBase-TRUNK/6479/artifact/hbase-protocol/target/findbugs.xml> of module  with 0 warnings.
[FINDBUGS] Successfully parsed file <https://builds.apache.org/job/HBase-TRUNK/6479/artifact/hbase-protocol/target/findbugsXml.xml> of module  with 0 warnings.
[FINDBUGS] Successfully parsed file <https://builds.apache.org/job/HBase-TRUNK/6479/artifact/hbase-rest/target/findbugs.xml> of module  with 0 warnings.
[FINDBUGS] Successfully parsed file <https://builds.apache.org/job/HBase-TRUNK/6479/artifact/hbase-rest/target/findbugsXml.xml> of module  with 2 warnings.
[FINDBUGS] Successfully parsed file <https://builds.apache.org/job/HBase-TRUNK/6479/artifact/hbase-server/target/findbugs.xml> of module  with 0 warnings.
[FINDBUGS] Successfully parsed file <https://builds.apache.org/job/HBase-TRUNK/6479/artifact/hbase-server/target/findbugsXml.xml> of module  with 63 warnings.
[FINDBUGS] Successfully parsed file <https://builds.apache.org/job/HBase-TRUNK/6479/artifact/hbase-thrift/target/findbugs.xml> of module  with 0 warnings.
[FINDBUGS] Successfully parsed file <https://builds.apache.org/job/HBase-TRUNK/6479/artifact/hbase-thrift/target/findbugsXml.xml> of module  with 0 warnings.
[FINDBUGS] Computing warning deltas based on reference build #6477
[CHECKSTYLE] Collecting checkstyle analysis files...
[CHECKSTYLE] Finding all files that match the pattern **/checkstyle-result.xml
[CHECKSTYLE] Parsing 21 files in <https://builds.apache.org/job/HBase-TRUNK/ws/>
[CHECKSTYLE] Successfully parsed file <https://builds.apache.org/job/HBase-TRUNK/6479/artifact/hbase-annotations/target/checkstyle-result.xml> of module  with 0 warnings.
[CHECKSTYLE] Successfully parsed file <https://builds.apache.org/job/HBase-TRUNK/6479/artifact/hbase-assembly/target/checkstyle-result.xml> of module  with 0 warnings.
[CHECKSTYLE] Successfully parsed file <https://builds.apache.org/job/HBase-TRUNK/6479/artifact/hbase-checkstyle/target/checkstyle-result.xml> of module  with 0 warnings.
[CHECKSTYLE] Successfully parsed file <https://builds.apache.org/job/HBase-TRUNK/6479/artifact/hbase-client/target/checkstyle-result.xml> of module  with 212 warnings.
[CHECKSTYLE] Successfully parsed file <https://builds.apache.org/job/HBase-TRUNK/6479/artifact/hbase-common/target/checkstyle-result.xml> of module  with 127 warnings.
[CHECKSTYLE] Successfully parsed file <https://builds.apache.org/job/HBase-TRUNK/6479/artifact/hbase-examples/target/checkstyle-result.xml> of module  with 30 warnings.
[CHECKSTYLE] Successfully parsed file <https://builds.apache.org/job/HBase-TRUNK/6479/artifact/hbase-hadoop-compat/target/checkstyle-result.xml> of module  with 2 warnings.
[CHECKSTYLE] Successfully parsed file <https://builds.apache.org/job/HBase-TRUNK/6479/artifact/hbase-hadoop2-compat/target/checkstyle-result.xml> of module  with 47 warnings.
[CHECKSTYLE] Successfully parsed file <https://builds.apache.org/job/HBase-TRUNK/6479/artifact/hbase-it/target/checkstyle-result.xml> of module  with 0 warnings.
[CHECKSTYLE] Successfully parsed file <https://builds.apache.org/job/HBase-TRUNK/6479/artifact/hbase-prefix-tree/target/checkstyle-result.xml> of module  with 23 warnings.
[CHECKSTYLE] Successfully parsed file <https://builds.apache.org/job/HBase-TRUNK/6479/artifact/hbase-procedure/target/checkstyle-result.xml> of module  with 0 warnings.
[CHECKSTYLE] Successfully parsed file <https://builds.apache.org/job/HBase-TRUNK/6479/artifact/hbase-protocol/target/checkstyle-result.xml> of module  with 3 warnings.
[CHECKSTYLE] Successfully parsed file <https://builds.apache.org/job/HBase-TRUNK/6479/artifact/hbase-rest/target/checkstyle-result.xml> of module  with 42 warnings.
[CHECKSTYLE] Successfully parsed file <https://builds.apache.org/job/HBase-TRUNK/6479/artifact/hbase-server/target/checkstyle-result.xml> of module  with 1377 warnings.
[CHECKSTYLE] Successfully parsed file <https://builds.apache.org/job/HBase-TRUNK/6479/artifact/hbase-shaded/hbase-shaded-client/target/checkstyle-result.xml> of module  with 0 warnings.
[CHECKSTYLE] Successfully parsed file <https://builds.apache.org/job/HBase-TRUNK/6479/artifact/hbase-shaded/hbase-shaded-server/target/checkstyle-result.xml> of module  with 0 warnings.
[CHECKSTYLE] Successfully parsed file <https://builds.apache.org/job/HBase-TRUNK/6479/artifact/hbase-shaded/target/checkstyle-result.xml> of module  with 0 warnings.
[CHECKSTYLE] Successfully parsed file <https://builds.apache.org/job/HBase-TRUNK/6479/artifact/hbase-shell/target/checkstyle-result.xml> of module  with 0 warnings.
[CHECKSTYLE] Successfully parsed file <https://builds.apache.org/job/HBase-TRUNK/6479/artifact/hbase-testing-util/target/checkstyle-result.xml> of module  with 0 warnings.
[CHECKSTYLE] Successfully parsed file <https://builds.apache.org/job/HBase-TRUNK/6479/artifact/hbase-thrift/target/checkstyle-result.xml> of module  with 32 warnings.
[CHECKSTYLE] Successfully parsed file <https://builds.apache.org/job/HBase-TRUNK/6479/artifact/target/checkstyle-result.xml> of module  with 0 warnings.
[CHECKSTYLE] Computing warning deltas based on reference build #6477
Updating HBASE-13662
Updating HBASE-13533

Jenkins build is back to normal : HBase-TRUNK #6481

Posted by Apache Jenkins Server <je...@builds.apache.org>.
See <https://builds.apache.org/job/HBase-TRUNK/6481/changes>


Build failed in Jenkins: HBase-TRUNK #6480

Posted by Apache Jenkins Server <je...@builds.apache.org>.
See <https://builds.apache.org/job/HBase-TRUNK/6480/changes>

Changes:

[larsh] HBASE-13618 ReplicationSource is too eager to remove sinks.

------------------------------------------
[...truncated 4794 lines...]
Running org.apache.hadoop.hbase.wal.TestDefaultWALProvider
Tests run: 5, Failures: 0, Errors: 0, Skipped: 0, Time elapsed: 9.466 sec - in org.apache.hadoop.hbase.wal.TestDefaultWALProvider
Running org.apache.hadoop.hbase.wal.TestWALSplitCompressed
Tests run: 5, Failures: 0, Errors: 0, Skipped: 0, Time elapsed: 24.922 sec - in org.apache.hadoop.hbase.wal.TestBoundedRegionGroupingProvider
Tests run: 1, Failures: 0, Errors: 0, Skipped: 0, Time elapsed: 31.139 sec - in org.apache.hadoop.hbase.wal.TestWALFiltering
Running org.apache.hadoop.hbase.backup.example.TestZooKeeperTableArchiveClient
Tests run: 3, Failures: 0, Errors: 0, Skipped: 0, Time elapsed: 4.64 sec - in org.apache.hadoop.hbase.backup.example.TestZooKeeperTableArchiveClient
Running org.apache.hadoop.hbase.zookeeper.TestHQuorumPeer
Tests run: 4, Failures: 0, Errors: 0, Skipped: 0, Time elapsed: 1.572 sec - in org.apache.hadoop.hbase.zookeeper.TestHQuorumPeer
Running org.apache.hadoop.hbase.backup.TestHFileArchiving
Running org.apache.hadoop.hbase.zookeeper.lock.TestZKInterProcessReadWriteLock
Tests run: 56, Failures: 0, Errors: 0, Skipped: 0, Time elapsed: 334.759 sec - in org.apache.hadoop.hbase.security.access.TestAccessController
Running org.apache.hadoop.hbase.zookeeper.TestRecoverableZooKeeper
Tests run: 1, Failures: 0, Errors: 0, Skipped: 0, Time elapsed: 1.274 sec - in org.apache.hadoop.hbase.zookeeper.TestRecoverableZooKeeper
Running org.apache.hadoop.hbase.zookeeper.TestZKLeaderManager
Tests run: 1, Failures: 0, Errors: 0, Skipped: 0, Time elapsed: 0.11 sec - in org.apache.hadoop.hbase.zookeeper.TestZKLeaderManager
Running org.apache.hadoop.hbase.zookeeper.TestZooKeeperACL
Tests run: 6, Failures: 0, Errors: 0, Skipped: 0, Time elapsed: 0.312 sec - in org.apache.hadoop.hbase.zookeeper.TestZooKeeperACL
Tests run: 6, Failures: 0, Errors: 0, Skipped: 0, Time elapsed: 24.539 sec - in org.apache.hadoop.hbase.zookeeper.lock.TestZKInterProcessReadWriteLock
Running org.apache.hadoop.hbase.zookeeper.TestZooKeeperNodeTracker
Tests run: 3, Failures: 0, Errors: 0, Skipped: 0, Time elapsed: 1.315 sec - in org.apache.hadoop.hbase.zookeeper.TestZooKeeperNodeTracker
Running org.apache.hadoop.hbase.zookeeper.TestZKMulti
Tests run: 8, Failures: 0, Errors: 0, Skipped: 0, Time elapsed: 0.631 sec - in org.apache.hadoop.hbase.zookeeper.TestZKMulti
Running org.apache.hadoop.hbase.TestPartialResultsFromClientSide
Running org.apache.hadoop.hbase.mapreduce.TestTableInputFormatScan2
Tests run: 5, Failures: 0, Errors: 0, Skipped: 0, Time elapsed: 78.675 sec - in org.apache.hadoop.hbase.backup.TestHFileArchiving
Tests run: 13, Failures: 0, Errors: 0, Skipped: 0, Time elapsed: 70.787 sec - in org.apache.hadoop.hbase.TestPartialResultsFromClientSide
Running org.apache.hadoop.hbase.mapreduce.TestTableMapReduce
Running org.apache.hadoop.hbase.mapreduce.TestHLogRecordReader
Tests run: 2, Failures: 0, Errors: 0, Skipped: 0, Time elapsed: 2.612 sec - in org.apache.hadoop.hbase.mapreduce.TestHLogRecordReader
Tests run: 31, Failures: 0, Errors: 0, Skipped: 0, Time elapsed: 204.02 sec - in org.apache.hadoop.hbase.wal.TestWALSplit
Running org.apache.hadoop.hbase.mapreduce.TestImportExport
Tests run: 31, Failures: 0, Errors: 0, Skipped: 0, Time elapsed: 208.04 sec - in org.apache.hadoop.hbase.wal.TestWALSplitCompressed
Running org.apache.hadoop.hbase.mapreduce.TestWALPlayer
Running org.apache.hadoop.hbase.mapreduce.TestCopyTable
Tests run: 4, Failures: 0, Errors: 0, Skipped: 0, Time elapsed: 60.65 sec - in org.apache.hadoop.hbase.mapreduce.TestWALPlayer
Running org.apache.hadoop.hbase.mapreduce.TestImportTSVWithOperationAttributes
Tests run: 2, Failures: 0, Errors: 0, Skipped: 0, Time elapsed: 201.52 sec - in org.apache.hadoop.hbase.mapreduce.TestTableMapReduce
Tests run: 7, Failures: 0, Errors: 0, Skipped: 0, Time elapsed: 277.546 sec - in org.apache.hadoop.hbase.mapreduce.TestTableInputFormatScan2
Running org.apache.hadoop.hbase.mapreduce.TestRowCounter
Running org.apache.hadoop.hbase.mapreduce.TestImportTsv
Tests run: 2, Failures: 0, Errors: 0, Skipped: 0, Time elapsed: 90.331 sec - in org.apache.hadoop.hbase.mapreduce.TestImportTSVWithOperationAttributes
Tests run: 5, Failures: 0, Errors: 0, Skipped: 0, Time elapsed: 161.977 sec - in org.apache.hadoop.hbase.mapreduce.TestCopyTable
Running org.apache.hadoop.hbase.mapreduce.TestLoadIncrementalHFilesUseSecurityEndPoint
Running org.apache.hadoop.hbase.mapreduce.TestSecureLoadIncrementalHFiles
Tests run: 16, Failures: 0, Errors: 0, Skipped: 0, Time elapsed: 117.483 sec - in org.apache.hadoop.hbase.mapreduce.TestLoadIncrementalHFilesUseSecurityEndPoint
Tests run: 16, Failures: 0, Errors: 0, Skipped: 0, Time elapsed: 113.608 sec - in org.apache.hadoop.hbase.mapreduce.TestSecureLoadIncrementalHFiles
Running org.apache.hadoop.hbase.mapreduce.TestTimeRangeMapRed
Running org.apache.hadoop.hbase.mapreduce.TestTableInputFormat
Tests run: 6, Failures: 0, Errors: 0, Skipped: 0, Time elapsed: 212.943 sec - in org.apache.hadoop.hbase.mapreduce.TestRowCounter
Running org.apache.hadoop.hbase.mapreduce.TestTableSnapshotInputFormat
Tests run: 1, Failures: 0, Errors: 0, Skipped: 0, Time elapsed: 59.086 sec - in org.apache.hadoop.hbase.mapreduce.TestTimeRangeMapRed
Running org.apache.hadoop.hbase.mapreduce.TestImportTSVWithTTLs
Tests run: 12, Failures: 0, Errors: 0, Skipped: 0, Time elapsed: 459.846 sec - in org.apache.hadoop.hbase.mapreduce.TestImportExport
Running org.apache.hadoop.hbase.mapreduce.TestLoadIncrementalHFiles
Tests run: 8, Failures: 0, Errors: 0, Skipped: 0, Time elapsed: 95.782 sec - in org.apache.hadoop.hbase.mapreduce.TestTableInputFormat
Tests run: 10, Failures: 0, Errors: 0, Skipped: 0, Time elapsed: 281.468 sec - in org.apache.hadoop.hbase.mapreduce.TestImportTsv
Running org.apache.hadoop.hbase.mapreduce.TestLoadIncrementalHFilesSplitRecovery
Tests run: 1, Failures: 0, Errors: 0, Skipped: 0, Time elapsed: 49.88 sec - in org.apache.hadoop.hbase.mapreduce.TestImportTSVWithTTLs
Running org.apache.hadoop.hbase.mapreduce.TestHRegionPartitioner
Tests run: 1, Failures: 0, Errors: 0, Skipped: 0, Time elapsed: 5.105 sec - in org.apache.hadoop.hbase.mapreduce.TestHRegionPartitioner
Running org.apache.hadoop.hbase.mapreduce.TestHFileOutputFormat
Running org.apache.hadoop.hbase.mapreduce.TestImportTSVWithVisibilityLabels
Tests run: 5, Failures: 0, Errors: 0, Skipped: 0, Time elapsed: 42.78 sec - in org.apache.hadoop.hbase.mapreduce.TestLoadIncrementalHFilesSplitRecovery
Tests run: 16, Failures: 0, Errors: 0, Skipped: 0, Time elapsed: 111.902 sec - in org.apache.hadoop.hbase.mapreduce.TestLoadIncrementalHFiles
Running org.apache.hadoop.hbase.mapreduce.TestMultithreadedTableMapper
Running org.apache.hadoop.hbase.mapreduce.TestHFileOutputFormat2
Tests run: 1, Failures: 0, Errors: 0, Skipped: 0, Time elapsed: 103.237 sec - in org.apache.hadoop.hbase.mapreduce.TestMultithreadedTableMapper
Tests run: 7, Failures: 0, Errors: 0, Skipped: 0, Time elapsed: 323.573 sec - in org.apache.hadoop.hbase.mapreduce.TestTableSnapshotInputFormat
Running org.apache.hadoop.hbase.mapreduce.TestTableInputFormatScan1
Tests run: 5, Failures: 0, Errors: 0, Skipped: 0, Time elapsed: 206.545 sec - in org.apache.hadoop.hbase.mapreduce.TestImportTSVWithVisibilityLabels
Running org.apache.hadoop.hbase.mapreduce.TestWALRecordReader
Tests run: 2, Failures: 0, Errors: 0, Skipped: 0, Time elapsed: 2.194 sec - in org.apache.hadoop.hbase.mapreduce.TestWALRecordReader
Running org.apache.hadoop.hbase.mapreduce.TestCellCounter
Running org.apache.hadoop.hbase.mapreduce.TestMultiTableInputFormat
Tests run: 13, Failures: 0, Errors: 0, Skipped: 1, Time elapsed: 314.092 sec - in org.apache.hadoop.hbase.mapreduce.TestHFileOutputFormat
Running org.apache.hadoop.hbase.mapreduce.TestSecureLoadIncrementalHFilesSplitRecovery
Tests run: 5, Failures: 0, Errors: 0, Skipped: 0, Time elapsed: 31.771 sec - in org.apache.hadoop.hbase.mapreduce.TestSecureLoadIncrementalHFilesSplitRecovery
Tests run: 13, Failures: 0, Errors: 0, Skipped: 1, Time elapsed: 326.417 sec - in org.apache.hadoop.hbase.mapreduce.TestHFileOutputFormat2
Running org.apache.hadoop.hbase.filter.TestMultiRowRangeFilter
Running org.apache.hadoop.hbase.filter.TestScanRowPrefix
Tests run: 1, Failures: 0, Errors: 0, Skipped: 0, Time elapsed: 6.9 sec - in org.apache.hadoop.hbase.filter.TestScanRowPrefix
Tests run: 18, Failures: 0, Errors: 0, Skipped: 0, Time elapsed: 25.467 sec - in org.apache.hadoop.hbase.filter.TestMultiRowRangeFilter
Running org.apache.hadoop.hbase.filter.TestFilterWithScanLimits
Running org.apache.hadoop.hbase.filter.TestFuzzyRowAndColumnRangeFilter
Tests run: 1, Failures: 0, Errors: 0, Skipped: 0, Time elapsed: 3.242 sec - in org.apache.hadoop.hbase.filter.TestFuzzyRowAndColumnRangeFilter
Tests run: 4, Failures: 0, Errors: 0, Skipped: 0, Time elapsed: 194.562 sec - in org.apache.hadoop.hbase.mapreduce.TestMultiTableInputFormat
Tests run: 7, Failures: 0, Errors: 0, Skipped: 0, Time elapsed: 263.917 sec - in org.apache.hadoop.hbase.mapreduce.TestTableInputFormatScan1
Running org.apache.hadoop.hbase.filter.TestColumnRangeFilter
Tests run: 7, Failures: 0, Errors: 0, Skipped: 0, Time elapsed: 242.711 sec - in org.apache.hadoop.hbase.mapreduce.TestCellCounter
Tests run: 1, Failures: 0, Errors: 0, Skipped: 0, Time elapsed: 12.852 sec - in org.apache.hadoop.hbase.filter.TestColumnRangeFilter
Running org.apache.hadoop.hbase.filter.TestFilterWrapper
Tests run: 1, Failures: 0, Errors: 0, Skipped: 0, Time elapsed: 3.663 sec - in org.apache.hadoop.hbase.filter.TestFilterWrapper
Running org.apache.hadoop.hbase.TestMetaTableAccessor
Tests run: 1, Failures: 0, Errors: 0, Skipped: 0, Time elapsed: 52.369 sec - in org.apache.hadoop.hbase.filter.TestFilterWithScanLimits
Tests run: 12, Failures: 0, Errors: 0, Skipped: 0, Time elapsed: 18.862 sec - in org.apache.hadoop.hbase.TestMetaTableAccessor

Results :

Failed tests: 
  TestSplitTransactionOnCluster.testSSHCleanupDaugtherRegionsOfAbortedSplit:998 {b40aebeec0bdced1cc708da31d33d010={b40aebeec0bdced1cc708da31d33d010 state=SPLITTING_NEW, ts=1431497057009, server=pietas.apache.org,59018,1431497047357}, 04f0999252c7d8c4a0abe6151b35cd40={04f0999252c7d8c4a0abe6151b35cd40 state=SPLITTING_NEW, ts=1431497057009, server=pietas.apache.org,59018,1431497047357}, 8519cced503c8d421e7eb7fb8ef0a02a={8519cced503c8d421e7eb7fb8ef0a02a state=SPLITTING, ts=1431497057005, server=pietas.apache.org,59018,1431497047357}} expected:<0> but was:<3>



Tests run: 2454, Failures: 1, Errors: 0, Skipped: 17

[INFO] ------------------------------------------------------------------------
[INFO] Reactor Summary:
[INFO] 
[INFO] HBase ............................................. SUCCESS [  2.837 s]
[INFO] HBase - Checkstyle ................................ SUCCESS [  0.653 s]
[INFO] HBase - Annotations ............................... SUCCESS [  0.204 s]
[INFO] HBase - Protocol .................................. SUCCESS [  2.640 s]
[INFO] HBase - Common .................................... SUCCESS [03:02 min]
[INFO] HBase - Procedure ................................. SUCCESS [01:27 min]
[INFO] HBase - Client .................................... SUCCESS [01:47 min]
[INFO] HBase - Hadoop Compatibility ...................... SUCCESS [ 11.307 s]
[INFO] HBase - Hadoop Two Compatibility .................. SUCCESS [ 14.435 s]
[INFO] HBase - Prefix Tree ............................... SUCCESS [ 17.576 s]
[INFO] HBase - Server .................................... FAILURE [  01:45 h]
[INFO] HBase - Testing Util .............................. SKIPPED
[INFO] HBase - Thrift .................................... SKIPPED
[INFO] HBase - Shell ..................................... SKIPPED
[INFO] HBase - Integration Tests ......................... SKIPPED
[INFO] HBase - Examples .................................. SKIPPED
[INFO] HBase - Rest ...................................... SKIPPED
[INFO] HBase - Assembly .................................. SKIPPED
[INFO] HBase - Shaded .................................... SKIPPED
[INFO] HBase - Shaded - Client ........................... SKIPPED
[INFO] HBase - Shaded - Server ........................... SKIPPED
[INFO] ------------------------------------------------------------------------
[INFO] BUILD FAILURE
[INFO] ------------------------------------------------------------------------
[INFO] Total time: 01:52 h
[INFO] Finished at: 2015-05-13T07:20:34+00:00
[INFO] Final Memory: 61M/545M
[INFO] ------------------------------------------------------------------------
[ERROR] Failed to execute goal org.apache.maven.plugins:maven-surefire-plugin:2.18:test (secondPartTestsExecution) on project hbase-server: There are test failures.
[ERROR] 
[ERROR] Please refer to <https://builds.apache.org/job/HBase-TRUNK/ws/hbase-server/target/surefire-reports> for the individual test results.
[ERROR] -> [Help 1]
[ERROR] 
[ERROR] To see the full stack trace of the errors, re-run Maven with the -e switch.
[ERROR] Re-run Maven using the -X switch to enable full debug logging.
[ERROR] 
[ERROR] For more information about the errors and possible solutions, please read the following articles:
[ERROR] [Help 1] http://cwiki.apache.org/confluence/display/MAVEN/MojoFailureException
[ERROR] 
[ERROR] After correcting the problems, you can resume the build with the command
[ERROR]   mvn <goals> -rf :hbase-server
Build step 'Invoke top-level Maven targets' marked build as failure
Performing Post build task...
Match found for :.* : True
Logical operation result is TRUE
Running script  :   ZOMBIE_TESTS_COUNT=`jps | grep surefirebooter | wc -l`
  if [[ $ZOMBIE_TESTS_COUNT != 0 ]] ; then
    #It seems sometimes the tests are not dying immediately. Let's give them 10s
    echo "Suspicious java process found - waiting 10s to see if there are just slow to stop"
    sleep 10   
    ZOMBIE_TESTS_COUNT=`jps | grep surefirebooter | wc -l`
    if [[ $ZOMBIE_TESTS_COUNT != 0 ]] ; then
      echo "There are $ZOMBIE_TESTS_COUNT zombie tests, they should have been killed by surefire but survived"
      echo "************ BEGIN zombies jstack extract"
      ZB_STACK=`jps | grep surefirebooter | cut -d ' ' -f 1 | xargs -n 1 jstack | grep ".test" | grep "\.java"`
      jps | grep surefirebooter | cut -d ' ' -f 1 | xargs -n 1 jstack
      echo "************ END  zombies jstack extract"
      JIRA_COMMENT="$JIRA_COMMENT

     {color:red}-1 core zombie tests{color}.  There are ${ZOMBIE_TESTS_COUNT} zombie test(s): ${ZB_STACK}"
      BAD=1
      jps | grep surefirebooter | cut -d ' ' -f 1 | xargs kill -9
    else
      echo "We're ok: there is no zombie test, but some tests took some time to stop"
    fi
  else
    echo "We're ok: there is no zombie test"
  fi
[HBase-TRUNK] $ /bin/bash -xe /tmp/hudson7417546445015158850.sh
++ jps
++ wc -l
++ grep surefirebooter
+ ZOMBIE_TESTS_COUNT=0
+ [[ 0 != 0 ]]
+ echo 'We'\''re ok: there is no zombie test'
We're ok: there is no zombie test
POST BUILD TASK : SUCCESS
END OF POST BUILD TASK : 0
Archiving artifacts
Sending artifact delta relative to HBase-TRUNK #6477
Archived 2166 artifacts
Archive block size is 32768
Received 70 blocks and 433010274 bytes
Compression is 0.5%
Took 4 min 29 sec
Recording test results
[FINDBUGS] Collecting findbugs analysis files...
[FINDBUGS] Finding all files that match the pattern **/findbugs.xml,**/findbugsXml.xml
[FINDBUGS] Parsing 24 files in <https://builds.apache.org/job/HBase-TRUNK/ws/>
[FINDBUGS] Successfully parsed file <https://builds.apache.org/job/HBase-TRUNK/6480/artifact/hbase-annotations/target/findbugs.xml> of module  with 0 warnings.
[FINDBUGS] Successfully parsed file <https://builds.apache.org/job/HBase-TRUNK/6480/artifact/hbase-annotations/target/findbugsXml.xml> of module  with 0 warnings.
[FINDBUGS] Successfully parsed file <https://builds.apache.org/job/HBase-TRUNK/6480/artifact/hbase-client/target/findbugs.xml> of module  with 0 warnings.
[FINDBUGS] Successfully parsed file <https://builds.apache.org/job/HBase-TRUNK/6480/artifact/hbase-client/target/findbugsXml.xml> of module  with 8 warnings.
[FINDBUGS] Successfully parsed file <https://builds.apache.org/job/HBase-TRUNK/6480/artifact/hbase-common/target/findbugs.xml> of module  with 0 warnings.
[FINDBUGS] Successfully parsed file <https://builds.apache.org/job/HBase-TRUNK/6480/artifact/hbase-common/target/findbugsXml.xml> of module  with 1 warnings.
[FINDBUGS] Successfully parsed file <https://builds.apache.org/job/HBase-TRUNK/6480/artifact/hbase-examples/target/findbugs.xml> of module  with 0 warnings.
[FINDBUGS] Successfully parsed file <https://builds.apache.org/job/HBase-TRUNK/6480/artifact/hbase-examples/target/findbugsXml.xml> of module  with 0 warnings.
[FINDBUGS] Successfully parsed file <https://builds.apache.org/job/HBase-TRUNK/6480/artifact/hbase-hadoop-compat/target/findbugs.xml> of module  with 0 warnings.
[FINDBUGS] Successfully parsed file <https://builds.apache.org/job/HBase-TRUNK/6480/artifact/hbase-hadoop-compat/target/findbugsXml.xml> of module  with 0 warnings.
[FINDBUGS] Successfully parsed file <https://builds.apache.org/job/HBase-TRUNK/6480/artifact/hbase-hadoop2-compat/target/findbugs.xml> of module  with 0 warnings.
[FINDBUGS] Successfully parsed file <https://builds.apache.org/job/HBase-TRUNK/6480/artifact/hbase-hadoop2-compat/target/findbugsXml.xml> of module  with 0 warnings.
[FINDBUGS] Successfully parsed file <https://builds.apache.org/job/HBase-TRUNK/6480/artifact/hbase-prefix-tree/target/findbugs.xml> of module  with 0 warnings.
[FINDBUGS] Successfully parsed file <https://builds.apache.org/job/HBase-TRUNK/6480/artifact/hbase-prefix-tree/target/findbugsXml.xml> of module  with 0 warnings.
[FINDBUGS] Successfully parsed file <https://builds.apache.org/job/HBase-TRUNK/6480/artifact/hbase-procedure/target/findbugs.xml> of module  with 0 warnings.
[FINDBUGS] Successfully parsed file <https://builds.apache.org/job/HBase-TRUNK/6480/artifact/hbase-procedure/target/findbugsXml.xml> of module  with 1 warnings.
[FINDBUGS] Successfully parsed file <https://builds.apache.org/job/HBase-TRUNK/6480/artifact/hbase-protocol/target/findbugs.xml> of module  with 0 warnings.
[FINDBUGS] Successfully parsed file <https://builds.apache.org/job/HBase-TRUNK/6480/artifact/hbase-protocol/target/findbugsXml.xml> of module  with 0 warnings.
[FINDBUGS] Successfully parsed file <https://builds.apache.org/job/HBase-TRUNK/6480/artifact/hbase-rest/target/findbugs.xml> of module  with 0 warnings.
[FINDBUGS] Successfully parsed file <https://builds.apache.org/job/HBase-TRUNK/6480/artifact/hbase-rest/target/findbugsXml.xml> of module  with 2 warnings.
[FINDBUGS] Successfully parsed file <https://builds.apache.org/job/HBase-TRUNK/6480/artifact/hbase-server/target/findbugs.xml> of module  with 0 warnings.
[FINDBUGS] Successfully parsed file <https://builds.apache.org/job/HBase-TRUNK/6480/artifact/hbase-server/target/findbugsXml.xml> of module  with 63 warnings.
[FINDBUGS] Successfully parsed file <https://builds.apache.org/job/HBase-TRUNK/6480/artifact/hbase-thrift/target/findbugs.xml> of module  with 0 warnings.
[FINDBUGS] Successfully parsed file <https://builds.apache.org/job/HBase-TRUNK/6480/artifact/hbase-thrift/target/findbugsXml.xml> of module  with 0 warnings.
[FINDBUGS] Computing warning deltas based on reference build #6477
[CHECKSTYLE] Collecting checkstyle analysis files...
[CHECKSTYLE] Finding all files that match the pattern **/checkstyle-result.xml
[CHECKSTYLE] Parsing 21 files in <https://builds.apache.org/job/HBase-TRUNK/ws/>
[CHECKSTYLE] Successfully parsed file <https://builds.apache.org/job/HBase-TRUNK/6480/artifact/hbase-annotations/target/checkstyle-result.xml> of module  with 0 warnings.
[CHECKSTYLE] Successfully parsed file <https://builds.apache.org/job/HBase-TRUNK/6480/artifact/hbase-assembly/target/checkstyle-result.xml> of module  with 0 warnings.
[CHECKSTYLE] Successfully parsed file <https://builds.apache.org/job/HBase-TRUNK/6480/artifact/hbase-checkstyle/target/checkstyle-result.xml> of module  with 0 warnings.
[CHECKSTYLE] Successfully parsed file <https://builds.apache.org/job/HBase-TRUNK/6480/artifact/hbase-client/target/checkstyle-result.xml> of module  with 212 warnings.
[CHECKSTYLE] Successfully parsed file <https://builds.apache.org/job/HBase-TRUNK/6480/artifact/hbase-common/target/checkstyle-result.xml> of module  with 127 warnings.
[CHECKSTYLE] Successfully parsed file <https://builds.apache.org/job/HBase-TRUNK/6480/artifact/hbase-examples/target/checkstyle-result.xml> of module  with 30 warnings.
[CHECKSTYLE] Successfully parsed file <https://builds.apache.org/job/HBase-TRUNK/6480/artifact/hbase-hadoop-compat/target/checkstyle-result.xml> of module  with 2 warnings.
[CHECKSTYLE] Successfully parsed file <https://builds.apache.org/job/HBase-TRUNK/6480/artifact/hbase-hadoop2-compat/target/checkstyle-result.xml> of module  with 47 warnings.
[CHECKSTYLE] Successfully parsed file <https://builds.apache.org/job/HBase-TRUNK/6480/artifact/hbase-it/target/checkstyle-result.xml> of module  with 0 warnings.
[CHECKSTYLE] Successfully parsed file <https://builds.apache.org/job/HBase-TRUNK/6480/artifact/hbase-prefix-tree/target/checkstyle-result.xml> of module  with 23 warnings.
[CHECKSTYLE] Successfully parsed file <https://builds.apache.org/job/HBase-TRUNK/6480/artifact/hbase-procedure/target/checkstyle-result.xml> of module  with 0 warnings.
[CHECKSTYLE] Successfully parsed file <https://builds.apache.org/job/HBase-TRUNK/6480/artifact/hbase-protocol/target/checkstyle-result.xml> of module  with 3 warnings.
[CHECKSTYLE] Successfully parsed file <https://builds.apache.org/job/HBase-TRUNK/6480/artifact/hbase-rest/target/checkstyle-result.xml> of module  with 42 warnings.
[CHECKSTYLE] Successfully parsed file <https://builds.apache.org/job/HBase-TRUNK/6480/artifact/hbase-server/target/checkstyle-result.xml> of module  with 1377 warnings.
[CHECKSTYLE] Successfully parsed file <https://builds.apache.org/job/HBase-TRUNK/6480/artifact/hbase-shaded/hbase-shaded-client/target/checkstyle-result.xml> of module  with 0 warnings.
[CHECKSTYLE] Successfully parsed file <https://builds.apache.org/job/HBase-TRUNK/6480/artifact/hbase-shaded/hbase-shaded-server/target/checkstyle-result.xml> of module  with 0 warnings.
[CHECKSTYLE] Successfully parsed file <https://builds.apache.org/job/HBase-TRUNK/6480/artifact/hbase-shaded/target/checkstyle-result.xml> of module  with 0 warnings.
[CHECKSTYLE] Successfully parsed file <https://builds.apache.org/job/HBase-TRUNK/6480/artifact/hbase-shell/target/checkstyle-result.xml> of module  with 0 warnings.
[CHECKSTYLE] Successfully parsed file <https://builds.apache.org/job/HBase-TRUNK/6480/artifact/hbase-testing-util/target/checkstyle-result.xml> of module  with 0 warnings.
[CHECKSTYLE] Successfully parsed file <https://builds.apache.org/job/HBase-TRUNK/6480/artifact/hbase-thrift/target/checkstyle-result.xml> of module  with 32 warnings.
[CHECKSTYLE] Successfully parsed file <https://builds.apache.org/job/HBase-TRUNK/6480/artifact/target/checkstyle-result.xml> of module  with 0 warnings.
[CHECKSTYLE] Computing warning deltas based on reference build #6477
Updating HBASE-13618