You are viewing a plain text version of this content. The canonical link for it is here.
Posted to builds@solr.apache.org by Policeman Jenkins Server <je...@thetaphi.de> on 2024/07/11 03:13:37 UTC
[JENKINS] Solr-main-MacOSX (64bit/hotspot/jdk-11.0.21) - Build # 4545 - Failure!
Build: https://jenkins.thetaphi.de/job/Solr-main-MacOSX/4545/
Java: 64bit/hotspot/jdk-11.0.21 -XX:+UseCompressedOops -XX:+UseParallelGC
All tests passed
[JENKINS] Solr-main-MacOSX (64bit/hotspot/jdk-20) - Build # 4552 - Failure!
Posted by Policeman Jenkins Server <je...@thetaphi.de>.
Build: https://jenkins.thetaphi.de/job/Solr-main-MacOSX/4552/
Java: 64bit/hotspot/jdk-20 -XX:-UseCompressedOops -XX:+UseSerialGC
No tests ran.
[JENKINS] Solr-main-MacOSX (64bit/hotspot/jdk-19) - Build # 4551 - Still unstable!
Posted by Policeman Jenkins Server <je...@thetaphi.de>.
Build: https://jenkins.thetaphi.de/job/Solr-main-MacOSX/4551/
Java: 64bit/hotspot/jdk-19 -XX:+UseCompressedOops -XX:+UseSerialGC
4 tests failed.
FAILED: org.apache.solr.handler.TestUserManagedReplicationWithAuth.doTestAutoReplicationWithAuthEnabled
Error Message:
org.junit.ComparisonFailure: expected:<[OK]> but was:<[FAILURE]>
Stack Trace:
org.junit.ComparisonFailure: expected:<[OK]> but was:<[FAILURE]>
at __randomizedtesting.SeedInfo.seed([4C2F59899E34494B:529CD4409A61DC8A]:0)
at org.junit.Assert.assertEquals(Assert.java:117)
at org.junit.Assert.assertEquals(Assert.java:146)
at org.apache.solr.handler.TestUserManagedReplicationWithAuth.doTestAutoReplicationWithAuthEnabled(TestUserManagedReplicationWithAuth.java:211)
at java.base/jdk.internal.reflect.DirectMethodHandleAccessor.invoke(DirectMethodHandleAccessor.java:104)
at java.base/java.lang.reflect.Method.invoke(Method.java:578)
at com.carrotsearch.randomizedtesting.RandomizedRunner.invoke(RandomizedRunner.java:1758)
at com.carrotsearch.randomizedtesting.RandomizedRunner$8.evaluate(RandomizedRunner.java:946)
at com.carrotsearch.randomizedtesting.RandomizedRunner$9.evaluate(RandomizedRunner.java:982)
at com.carrotsearch.randomizedtesting.RandomizedRunner$10.evaluate(RandomizedRunner.java:996)
at com.carrotsearch.randomizedtesting.rules.SystemPropertiesRestoreRule$1.evaluate(SystemPropertiesRestoreRule.java:80)
at org.junit.rules.RunRules.evaluate(RunRules.java:20)
at org.apache.lucene.tests.util.TestRuleSetupTeardownChained$1.evaluate(TestRuleSetupTeardownChained.java:48)
at org.apache.lucene.tests.util.AbstractBeforeAfterRule$1.evaluate(AbstractBeforeAfterRule.java:43)
at org.apache.lucene.tests.util.TestRuleThreadAndTestName$1.evaluate(TestRuleThreadAndTestName.java:45)
at org.apache.lucene.tests.util.TestRuleIgnoreAfterMaxFailures$1.evaluate(TestRuleIgnoreAfterMaxFailures.java:60)
at org.apache.lucene.tests.util.TestRuleMarkFailure$1.evaluate(TestRuleMarkFailure.java:44)
at org.junit.rules.RunRules.evaluate(RunRules.java:20)
at com.carrotsearch.randomizedtesting.rules.StatementAdapter.evaluate(StatementAdapter.java:36)
at com.carrotsearch.randomizedtesting.ThreadLeakControl$StatementRunner.run(ThreadLeakControl.java:390)
at com.carrotsearch.randomizedtesting.ThreadLeakControl.forkTimeoutingTask(ThreadLeakControl.java:843)
at com.carrotsearch.randomizedtesting.ThreadLeakControl$3.evaluate(ThreadLeakControl.java:490)
at com.carrotsearch.randomizedtesting.RandomizedRunner.runSingleTest(RandomizedRunner.java:955)
at com.carrotsearch.randomizedtesting.RandomizedRunner$5.evaluate(RandomizedRunner.java:840)
at com.carrotsearch.randomizedtesting.RandomizedRunner$6.evaluate(RandomizedRunner.java:891)
at com.carrotsearch.randomizedtesting.RandomizedRunner$7.evaluate(RandomizedRunner.java:902)
at com.carrotsearch.randomizedtesting.rules.StatementAdapter.evaluate(StatementAdapter.java:36)
at com.carrotsearch.randomizedtesting.rules.StatementAdapter.evaluate(StatementAdapter.java:36)
at org.apache.lucene.tests.util.AbstractBeforeAfterRule$1.evaluate(AbstractBeforeAfterRule.java:43)
at com.carrotsearch.randomizedtesting.rules.SystemPropertiesRestoreRule$1.evaluate(SystemPropertiesRestoreRule.java:80)
at org.junit.rules.RunRules.evaluate(RunRules.java:20)
at org.apache.lucene.tests.util.AbstractBeforeAfterRule$1.evaluate(AbstractBeforeAfterRule.java:43)
at com.carrotsearch.randomizedtesting.rules.StatementAdapter.evaluate(StatementAdapter.java:36)
at org.apache.lucene.tests.util.TestRuleStoreClassName$1.evaluate(TestRuleStoreClassName.java:38)
at com.carrotsearch.randomizedtesting.rules.NoShadowingOrOverridesOnMethodsRule$1.evaluate(NoShadowingOrOverridesOnMethodsRule.java:40)
at com.carrotsearch.randomizedtesting.rules.NoShadowingOrOverridesOnMethodsRule$1.evaluate(NoShadowingOrOverridesOnMethodsRule.java:40)
at com.carrotsearch.randomizedtesting.rules.StatementAdapter.evaluate(StatementAdapter.java:36)
at com.carrotsearch.randomizedtesting.rules.StatementAdapter.evaluate(StatementAdapter.java:36)
at org.apache.lucene.tests.util.TestRuleAssertionsRequired$1.evaluate(TestRuleAssertionsRequired.java:53)
at org.apache.lucene.tests.util.AbstractBeforeAfterRule$1.evaluate(AbstractBeforeAfterRule.java:43)
at org.apache.lucene.tests.util.TestRuleMarkFailure$1.evaluate(TestRuleMarkFailure.java:44)
at org.apache.lucene.tests.util.TestRuleIgnoreAfterMaxFailures$1.evaluate(TestRuleIgnoreAfterMaxFailures.java:60)
at org.apache.lucene.tests.util.TestRuleIgnoreTestSuites$1.evaluate(TestRuleIgnoreTestSuites.java:47)
at org.junit.rules.RunRules.evaluate(RunRules.java:20)
at com.carrotsearch.randomizedtesting.rules.StatementAdapter.evaluate(StatementAdapter.java:36)
at com.carrotsearch.randomizedtesting.ThreadLeakControl$StatementRunner.run(ThreadLeakControl.java:390)
at com.carrotsearch.randomizedtesting.ThreadLeakControl.lambda$forkTimeoutingTask$0(ThreadLeakControl.java:850)
at java.base/java.lang.Thread.run(Thread.java:1589)
FAILED: org.apache.solr.cloud.api.collections.LocalFSCloudIncrementalBackupTest.testCustomProperties
Error Message:
org.apache.solr.common.SolrException: Could not find a healthy node to handle the request.
Stack Trace:
org.apache.solr.common.SolrException: Could not find a healthy node to handle the request.
at __randomizedtesting.SeedInfo.seed([4C2F59899E34494B:5E741A589F413D9E]:0)
at app//org.apache.solr.client.solrj.impl.CloudSolrClient.sendRequest(CloudSolrClient.java:1131)
at app//org.apache.solr.client.solrj.impl.CloudSolrClient.requestWithRetryOnStaleState(CloudSolrClient.java:833)
at app//org.apache.solr.client.solrj.impl.CloudSolrClient.requestWithRetryOnStaleState(CloudSolrClient.java:969)
at app//org.apache.solr.client.solrj.impl.CloudSolrClient.requestWithRetryOnStaleState(CloudSolrClient.java:969)
at app//org.apache.solr.client.solrj.impl.CloudSolrClient.requestWithRetryOnStaleState(CloudSolrClient.java:969)
at app//org.apache.solr.client.solrj.impl.CloudSolrClient.requestWithRetryOnStaleState(CloudSolrClient.java:969)
at app//org.apache.solr.client.solrj.impl.CloudSolrClient.requestWithRetryOnStaleState(CloudSolrClient.java:969)
at app//org.apache.solr.client.solrj.impl.CloudSolrClient.request(CloudSolrClient.java:764)
at app//org.apache.solr.client.solrj.SolrRequest.process(SolrRequest.java:229)
at app//org.apache.solr.client.solrj.SolrClient.query(SolrClient.java:927)
at app//org.apache.solr.cloud.api.collections.LocalFSCloudIncrementalBackupTest.testCustomProperties(LocalFSCloudIncrementalBackupTest.java:150)
at java.base@19/jdk.internal.reflect.DirectMethodHandleAccessor.invoke(DirectMethodHandleAccessor.java:104)
at java.base@19/java.lang.reflect.Method.invoke(Method.java:578)
at app//com.carrotsearch.randomizedtesting.RandomizedRunner.invoke(RandomizedRunner.java:1758)
at app//com.carrotsearch.randomizedtesting.RandomizedRunner$8.evaluate(RandomizedRunner.java:946)
at app//com.carrotsearch.randomizedtesting.RandomizedRunner$9.evaluate(RandomizedRunner.java:982)
at app//com.carrotsearch.randomizedtesting.RandomizedRunner$10.evaluate(RandomizedRunner.java:996)
at app//com.carrotsearch.randomizedtesting.rules.SystemPropertiesRestoreRule$1.evaluate(SystemPropertiesRestoreRule.java:80)
at app//org.junit.rules.RunRules.evaluate(RunRules.java:20)
at app//org.apache.lucene.tests.util.TestRuleSetupTeardownChained$1.evaluate(TestRuleSetupTeardownChained.java:48)
at app//org.apache.lucene.tests.util.AbstractBeforeAfterRule$1.evaluate(AbstractBeforeAfterRule.java:43)
at app//org.apache.lucene.tests.util.TestRuleThreadAndTestName$1.evaluate(TestRuleThreadAndTestName.java:45)
at app//org.apache.lucene.tests.util.TestRuleIgnoreAfterMaxFailures$1.evaluate(TestRuleIgnoreAfterMaxFailures.java:60)
at app//org.apache.lucene.tests.util.TestRuleMarkFailure$1.evaluate(TestRuleMarkFailure.java:44)
at app//org.junit.rules.RunRules.evaluate(RunRules.java:20)
at app//com.carrotsearch.randomizedtesting.rules.StatementAdapter.evaluate(StatementAdapter.java:36)
at app//com.carrotsearch.randomizedtesting.ThreadLeakControl$StatementRunner.run(ThreadLeakControl.java:390)
at app//com.carrotsearch.randomizedtesting.ThreadLeakControl.forkTimeoutingTask(ThreadLeakControl.java:843)
at app//com.carrotsearch.randomizedtesting.ThreadLeakControl$3.evaluate(ThreadLeakControl.java:490)
at app//com.carrotsearch.randomizedtesting.RandomizedRunner.runSingleTest(RandomizedRunner.java:955)
at app//com.carrotsearch.randomizedtesting.RandomizedRunner$5.evaluate(RandomizedRunner.java:840)
at app//com.carrotsearch.randomizedtesting.RandomizedRunner$6.evaluate(RandomizedRunner.java:891)
at app//com.carrotsearch.randomizedtesting.RandomizedRunner$7.evaluate(RandomizedRunner.java:902)
at app//com.carrotsearch.randomizedtesting.rules.StatementAdapter.evaluate(StatementAdapter.java:36)
at app//com.carrotsearch.randomizedtesting.rules.StatementAdapter.evaluate(StatementAdapter.java:36)
at app//org.apache.lucene.tests.util.AbstractBeforeAfterRule$1.evaluate(AbstractBeforeAfterRule.java:43)
at app//com.carrotsearch.randomizedtesting.rules.SystemPropertiesRestoreRule$1.evaluate(SystemPropertiesRestoreRule.java:80)
at app//org.junit.rules.RunRules.evaluate(RunRules.java:20)
at app//org.apache.lucene.tests.util.AbstractBeforeAfterRule$1.evaluate(AbstractBeforeAfterRule.java:43)
at app//com.carrotsearch.randomizedtesting.rules.StatementAdapter.evaluate(StatementAdapter.java:36)
at app//org.apache.lucene.tests.util.TestRuleStoreClassName$1.evaluate(TestRuleStoreClassName.java:38)
at app//com.carrotsearch.randomizedtesting.rules.NoShadowingOrOverridesOnMethodsRule$1.evaluate(NoShadowingOrOverridesOnMethodsRule.java:40)
at app//com.carrotsearch.randomizedtesting.rules.NoShadowingOrOverridesOnMethodsRule$1.evaluate(NoShadowingOrOverridesOnMethodsRule.java:40)
at app//com.carrotsearch.randomizedtesting.rules.StatementAdapter.evaluate(StatementAdapter.java:36)
at app//com.carrotsearch.randomizedtesting.rules.StatementAdapter.evaluate(StatementAdapter.java:36)
at app//org.apache.lucene.tests.util.TestRuleAssertionsRequired$1.evaluate(TestRuleAssertionsRequired.java:53)
at app//org.apache.lucene.tests.util.AbstractBeforeAfterRule$1.evaluate(AbstractBeforeAfterRule.java:43)
at app//org.apache.lucene.tests.util.TestRuleMarkFailure$1.evaluate(TestRuleMarkFailure.java:44)
at app//org.apache.lucene.tests.util.TestRuleIgnoreAfterMaxFailures$1.evaluate(TestRuleIgnoreAfterMaxFailures.java:60)
at app//org.apache.lucene.tests.util.TestRuleIgnoreTestSuites$1.evaluate(TestRuleIgnoreTestSuites.java:47)
at app//org.junit.rules.RunRules.evaluate(RunRules.java:20)
at app//com.carrotsearch.randomizedtesting.rules.StatementAdapter.evaluate(StatementAdapter.java:36)
at app//com.carrotsearch.randomizedtesting.ThreadLeakControl$StatementRunner.run(ThreadLeakControl.java:390)
at app//com.carrotsearch.randomizedtesting.ThreadLeakControl.lambda$forkTimeoutingTask$0(ThreadLeakControl.java:850)
at java.base@19/java.lang.Thread.run(Thread.java:1589)
FAILED: org.apache.solr.handler.admin.MetricsHandlerTest.testPrometheusMetricsJvm
Error Message:
java.lang.AssertionError: expected:<0.0> but was:<2555904.0>
Stack Trace:
java.lang.AssertionError: expected:<0.0> but was:<2555904.0>
at __randomizedtesting.SeedInfo.seed([4C2F59899E34494B:44658A9CCD64043B]:0)
at org.junit.Assert.fail(Assert.java:89)
at org.junit.Assert.failNotEquals(Assert.java:835)
at org.junit.Assert.assertEquals(Assert.java:555)
at org.junit.Assert.assertEquals(Assert.java:685)
at org.apache.solr.handler.admin.MetricsHandlerTest.testPrometheusMetricsJvm(MetricsHandlerTest.java:925)
at java.base/jdk.internal.reflect.DirectMethodHandleAccessor.invoke(DirectMethodHandleAccessor.java:104)
at java.base/java.lang.reflect.Method.invoke(Method.java:578)
at com.carrotsearch.randomizedtesting.RandomizedRunner.invoke(RandomizedRunner.java:1758)
at com.carrotsearch.randomizedtesting.RandomizedRunner$8.evaluate(RandomizedRunner.java:946)
at com.carrotsearch.randomizedtesting.RandomizedRunner$9.evaluate(RandomizedRunner.java:982)
at com.carrotsearch.randomizedtesting.RandomizedRunner$10.evaluate(RandomizedRunner.java:996)
at com.carrotsearch.randomizedtesting.rules.SystemPropertiesRestoreRule$1.evaluate(SystemPropertiesRestoreRule.java:80)
at org.junit.rules.RunRules.evaluate(RunRules.java:20)
at org.apache.lucene.tests.util.TestRuleSetupTeardownChained$1.evaluate(TestRuleSetupTeardownChained.java:48)
at org.apache.lucene.tests.util.AbstractBeforeAfterRule$1.evaluate(AbstractBeforeAfterRule.java:43)
at org.apache.lucene.tests.util.TestRuleThreadAndTestName$1.evaluate(TestRuleThreadAndTestName.java:45)
at org.apache.lucene.tests.util.TestRuleIgnoreAfterMaxFailures$1.evaluate(TestRuleIgnoreAfterMaxFailures.java:60)
at org.apache.lucene.tests.util.TestRuleMarkFailure$1.evaluate(TestRuleMarkFailure.java:44)
at org.junit.rules.RunRules.evaluate(RunRules.java:20)
at com.carrotsearch.randomizedtesting.rules.StatementAdapter.evaluate(StatementAdapter.java:36)
at com.carrotsearch.randomizedtesting.ThreadLeakControl$StatementRunner.run(ThreadLeakControl.java:390)
at com.carrotsearch.randomizedtesting.ThreadLeakControl.forkTimeoutingTask(ThreadLeakControl.java:843)
at com.carrotsearch.randomizedtesting.ThreadLeakControl$3.evaluate(ThreadLeakControl.java:490)
at com.carrotsearch.randomizedtesting.RandomizedRunner.runSingleTest(RandomizedRunner.java:955)
at com.carrotsearch.randomizedtesting.RandomizedRunner$5.evaluate(RandomizedRunner.java:840)
at com.carrotsearch.randomizedtesting.RandomizedRunner$6.evaluate(RandomizedRunner.java:891)
at com.carrotsearch.randomizedtesting.RandomizedRunner$7.evaluate(RandomizedRunner.java:902)
at com.carrotsearch.randomizedtesting.rules.StatementAdapter.evaluate(StatementAdapter.java:36)
at com.carrotsearch.randomizedtesting.rules.StatementAdapter.evaluate(StatementAdapter.java:36)
at org.apache.lucene.tests.util.AbstractBeforeAfterRule$1.evaluate(AbstractBeforeAfterRule.java:43)
at com.carrotsearch.randomizedtesting.rules.SystemPropertiesRestoreRule$1.evaluate(SystemPropertiesRestoreRule.java:80)
at org.junit.rules.RunRules.evaluate(RunRules.java:20)
at org.apache.lucene.tests.util.AbstractBeforeAfterRule$1.evaluate(AbstractBeforeAfterRule.java:43)
at com.carrotsearch.randomizedtesting.rules.StatementAdapter.evaluate(StatementAdapter.java:36)
at org.apache.lucene.tests.util.TestRuleStoreClassName$1.evaluate(TestRuleStoreClassName.java:38)
at com.carrotsearch.randomizedtesting.rules.NoShadowingOrOverridesOnMethodsRule$1.evaluate(NoShadowingOrOverridesOnMethodsRule.java:40)
at com.carrotsearch.randomizedtesting.rules.NoShadowingOrOverridesOnMethodsRule$1.evaluate(NoShadowingOrOverridesOnMethodsRule.java:40)
at com.carrotsearch.randomizedtesting.rules.StatementAdapter.evaluate(StatementAdapter.java:36)
at com.carrotsearch.randomizedtesting.rules.StatementAdapter.evaluate(StatementAdapter.java:36)
at org.apache.lucene.tests.util.TestRuleAssertionsRequired$1.evaluate(TestRuleAssertionsRequired.java:53)
at org.apache.lucene.tests.util.AbstractBeforeAfterRule$1.evaluate(AbstractBeforeAfterRule.java:43)
at org.apache.lucene.tests.util.TestRuleMarkFailure$1.evaluate(TestRuleMarkFailure.java:44)
at org.apache.lucene.tests.util.TestRuleIgnoreAfterMaxFailures$1.evaluate(TestRuleIgnoreAfterMaxFailures.java:60)
at org.apache.lucene.tests.util.TestRuleIgnoreTestSuites$1.evaluate(TestRuleIgnoreTestSuites.java:47)
at org.junit.rules.RunRules.evaluate(RunRules.java:20)
at com.carrotsearch.randomizedtesting.rules.StatementAdapter.evaluate(StatementAdapter.java:36)
at com.carrotsearch.randomizedtesting.ThreadLeakControl$StatementRunner.run(ThreadLeakControl.java:390)
at com.carrotsearch.randomizedtesting.ThreadLeakControl.lambda$forkTimeoutingTask$0(ThreadLeakControl.java:850)
at java.base/java.lang.Thread.run(Thread.java:1589)
FAILED: org.apache.solr.response.TestPrometheusResponseWriter.testPrometheusOutput
Error Message:
org.junit.ComparisonFailure: expected:<...mmitted",space="Code[Cache"}
solr_metrics_jvm_memory_pools_bytes{item="committed",space="Compressed-Class-Space"}
solr_metrics_jvm_memory_pools_bytes{item="committed",space="Metaspace"}
solr_metrics_jvm_memory_pools_bytes{item="committed",space="PS-Eden-Space"}
solr_metrics_jvm_memory_pools_bytes{item="committed",space="PS-Old-Gen"}
solr_metrics_jvm_memory_pools_bytes{item="committed",space="PS-Survivor-Space"}
solr_metrics_jvm_memory_pools_bytes{item="init",space="CodeCache"}
solr_metrics_jvm_memory_pools_bytes{item="init",space="Compressed-Class-Space"}
solr_metrics_jvm_memory_pools_bytes{item="init",space="Metaspace"}
solr_metrics_jvm_memory_pools_bytes{item="init",space="PS-Eden-Space"}
solr_metrics_jvm_memory_pools_bytes{item="init",space="PS-Old-Gen"}
solr_metrics_jvm_memory_pools_bytes{item="init",space="PS-Survivor-Space"}
solr_metrics_jvm_memory_pools_bytes{item="max",space="CodeCache"}
solr_metrics_jvm_memory_pools_bytes{item="max",space="Compressed-Class-Space"}
solr_metrics_jvm_memory_pools_bytes{item="max",space="Metaspace"}
solr_metrics_jvm_memory_pools_bytes{item="max",space="PS-Eden-Space"}
solr_metrics_jvm_memory_pools_bytes{item="max",space="PS-Old-Gen"}
solr_metrics_jvm_memory_pools_bytes{item="max",space="PS-Survivor-Space"}
solr_metrics_jvm_memory_pools_bytes{item="usage",space="CodeCache"}
solr_metrics_jvm_memory_pools_bytes{item="usage",space="Compressed-Class-Space"}
solr_metrics_jvm_memory_pools_bytes{item="usage",space="Metaspace"}
solr_metrics_jvm_memory_pools_bytes{item="usage",space="PS-Eden-Space"}
solr_metrics_jvm_memory_pools_bytes{item="usage",space="PS-Old-Gen"}
solr_metrics_jvm_memory_pools_bytes{item="usage",space="PS-Survivor-Space"}
solr_metrics_jvm_memory_pools_bytes{item="used",space="CodeCache"}
solr_metrics_jvm_memory_pools_bytes{item="used",space="Compressed-Class-Space"}
solr_metrics_jvm_memory_pools_bytes{item="used",space="Metaspace"}
solr_metrics_jvm_memory_pools_bytes{item="used",space="PS-Eden-Space"}
solr_metrics_jvm_memory_pools_bytes{item="used",space="PS-Old-Gen"}
solr_metrics_jvm_memory_pools_bytes{item="used",space="PS-Survivor-Space"}
solr_metrics_jvm_memory_pools_bytes{item="used-after-gc",space="PS-Eden-Space"}
solr_metrics_jvm_memory_pools_bytes{item="used-after-gc",space="PS-Old-Gen"}
solr_metrics_jvm_memory_pools_bytes{item="used-after-gc",space="PS-Survivor-Space"}
# TYPE solr_metrics_jvm_threads gauge
solr_metrics_jvm_threads{item="blocked"}
solr_metrics_jvm_threads{item="count"}
solr_metrics_jvm_threads{item="daemon"}
solr_metrics_jvm_threads{item="deadlock"}
solr_metrics_jvm_threads{item="new"}
solr_metrics_jvm_threads{item="peak"}
solr_metrics_jvm_threads{item="runnable"}
solr_metrics_jvm_threads{item="terminated"}
solr_metrics_jvm_threads{item="timed_waiting"}
solr_metrics_jvm_threads{item="total_started"}
solr_metrics_jvm_threads{item="waiti]ng"}
# TYPE solr_met...> but was:<...mmitted",space="Code[Heap-'non-nmethods'"}
solr_metrics_jvm_memory_pools_bytes{item="committed",space="CodeHeap-'non-profiled-nmethods'"}
solr_metrics_jvm_memory_pools_bytes{item="committed",space="CodeHeap-'profiled-nmethods'"}
solr_metrics_jvm_memory_pools_bytes{item="committed",space="Compressed-Class-Space"}
solr_metrics_jvm_memory_pools_bytes{item="committed",space="Eden-Space"}
solr_metrics_jvm_memory_pools_bytes{item="committed",space="Metaspace"}
solr_metrics_jvm_memory_pools_bytes{item="committed",space="Survivor-Space"}
solr_metrics_jvm_memory_pools_bytes{item="committed",space="Tenured-Gen"}
solr_metrics_jvm_memory_pools_bytes{item="init",space="CodeHeap-'non-nmethods'"}
solr_metrics_jvm_memory_pools_bytes{item="init",space="CodeHeap-'non-profiled-nmethods'"}
solr_metrics_jvm_memory_pools_bytes{item="init",space="CodeHeap-'profiled-nmethods'"}
solr_metrics_jvm_memory_pools_bytes{item="init",space="Compressed-Class-Space"}
solr_metrics_jvm_memory_pools_bytes{item="init",space="Eden-Space"}
solr_metrics_jvm_memory_pools_bytes{item="init",space="Metaspace"}
solr_metrics_jvm_memory_pools_bytes{item="init",space="Survivor-Space"}
solr_metrics_jvm_memory_pools_bytes{item="init",space="Tenured-Gen"}
solr_metrics_jvm_memory_pools_bytes{item="max",space="CodeHeap-'non-nmethods'"}
solr_metrics_jvm_memory_pools_bytes{item="max",space="CodeHeap-'non-profiled-nmethods'"}
solr_metrics_jvm_memory_pools_bytes{item="max",space="CodeHeap-'profiled-nmethods'"}
solr_metrics_jvm_memory_pools_bytes{item="max",space="Compressed-Class-Space"}
solr_metrics_jvm_memory_pools_bytes{item="max",space="Eden-Space"}
solr_metrics_jvm_memory_pools_bytes{item="max",space="Metaspace"}
solr_metrics_jvm_memory_pools_bytes{item="max",space="Survivor-Space"}
solr_metrics_jvm_memory_pools_bytes{item="max",space="Tenured-Gen"}
solr_metrics_jvm_memory_pools_bytes{item="usage",space="CodeHeap-'non-nmethods'"}
solr_metrics_jvm_memory_pools_bytes{item="usage",space="CodeHeap-'non-profiled-nmethods'"}
solr_metrics_jvm_memory_pools_bytes{item="usage",space="CodeHeap-'profiled-nmethods'"}
solr_metrics_jvm_memory_pools_bytes{item="usage",space="Compressed-Class-Space"}
solr_metrics_jvm_memory_pools_bytes{item="usage",space="Eden-Space"}
solr_metrics_jvm_memory_pools_bytes{item="usage",space="Metaspace"}
solr_metrics_jvm_memory_pools_bytes{item="usage",space="Survivor-Space"}
solr_metrics_jvm_memory_pools_bytes{item="usage",space="Tenured-Gen"}
solr_metrics_jvm_memory_pools_bytes{item="used",space="CodeHeap-'non-nmethods'"}
solr_metrics_jvm_memory_pools_bytes{item="used",space="CodeHeap-'non-profiled-nmethods'"}
solr_metrics_jvm_memory_pools_bytes{item="used",space="CodeHeap-'profiled-nmethods'"}
solr_metrics_jvm_memory_pools_bytes{item="used",space="Compressed-Class-Space"}
solr_metrics_jvm_memory_pools_bytes{item="used",space="Eden-Space"}
solr_metrics_jvm_memory_pools_bytes{item="used",space="Metaspace"}
solr_metrics_jvm_memory_pools_bytes{item="used",space="Survivor-Space"}
solr_metrics_jvm_memory_pools_bytes{item="used",space="Tenured-Gen"}
solr_metrics_jvm_memory_pools_bytes{item="used-after-gc",space="Eden-Space"}
solr_metrics_jvm_memory_pools_bytes{item="used-after-gc",space="Survivor-Space"}
solr_metrics_jvm_memory_pools_bytes{item="used-after-gc",space="Tenured-Gen"}
# TYPE solr_metrics_jvm_threads gauge
solr_metrics_jvm_threads{item="blocked"}
solr_metrics_jvm_threads{item="count"}
solr_metrics_jvm_threads{item="daemon"}
solr_metrics_jvm_threads{item="deadlock"}
solr_metrics_jvm_threads{item="new"}
solr_metrics_jvm_threads{item="peak"}
solr_metrics_jvm_threads{item="runnable"}
solr_metrics_jvm_threads{item="terminated"}
solr_metrics_jvm_threads{item="termınated"}
solr_metrics_jvm_threads{item="timed_waiting"}
solr_metrics_jvm_threads{item="total_started"}
solr_metrics_jvm_threads{item="tımed_waıtıng"}
solr_metrics_jvm_threads{item="waiting"}
solr_metrics_jvm_threads{item="waıtı]ng"}
# TYPE solr_met...>
Stack Trace:
org.junit.ComparisonFailure: expected:<...mmitted",space="Code[Cache"}
solr_metrics_jvm_memory_pools_bytes{item="committed",space="Compressed-Class-Space"}
solr_metrics_jvm_memory_pools_bytes{item="committed",space="Metaspace"}
solr_metrics_jvm_memory_pools_bytes{item="committed",space="PS-Eden-Space"}
solr_metrics_jvm_memory_pools_bytes{item="committed",space="PS-Old-Gen"}
solr_metrics_jvm_memory_pools_bytes{item="committed",space="PS-Survivor-Space"}
solr_metrics_jvm_memory_pools_bytes{item="init",space="CodeCache"}
solr_metrics_jvm_memory_pools_bytes{item="init",space="Compressed-Class-Space"}
solr_metrics_jvm_memory_pools_bytes{item="init",space="Metaspace"}
solr_metrics_jvm_memory_pools_bytes{item="init",space="PS-Eden-Space"}
solr_metrics_jvm_memory_pools_bytes{item="init",space="PS-Old-Gen"}
solr_metrics_jvm_memory_pools_bytes{item="init",space="PS-Survivor-Space"}
solr_metrics_jvm_memory_pools_bytes{item="max",space="CodeCache"}
solr_metrics_jvm_memory_pools_bytes{item="max",space="Compressed-Class-Space"}
solr_metrics_jvm_memory_pools_bytes{item="max",space="Metaspace"}
solr_metrics_jvm_memory_pools_bytes{item="max",space="PS-Eden-Space"}
solr_metrics_jvm_memory_pools_bytes{item="max",space="PS-Old-Gen"}
solr_metrics_jvm_memory_pools_bytes{item="max",space="PS-Survivor-Space"}
solr_metrics_jvm_memory_pools_bytes{item="usage",space="CodeCache"}
solr_metrics_jvm_memory_pools_bytes{item="usage",space="Compressed-Class-Space"}
solr_metrics_jvm_memory_pools_bytes{item="usage",space="Metaspace"}
solr_metrics_jvm_memory_pools_bytes{item="usage",space="PS-Eden-Space"}
solr_metrics_jvm_memory_pools_bytes{item="usage",space="PS-Old-Gen"}
solr_metrics_jvm_memory_pools_bytes{item="usage",space="PS-Survivor-Space"}
solr_metrics_jvm_memory_pools_bytes{item="used",space="CodeCache"}
solr_metrics_jvm_memory_pools_bytes{item="used",space="Compressed-Class-Space"}
solr_metrics_jvm_memory_pools_bytes{item="used",space="Metaspace"}
solr_metrics_jvm_memory_pools_bytes{item="used",space="PS-Eden-Space"}
solr_metrics_jvm_memory_pools_bytes{item="used",space="PS-Old-Gen"}
solr_metrics_jvm_memory_pools_bytes{item="used",space="PS-Survivor-Space"}
solr_metrics_jvm_memory_pools_bytes{item="used-after-gc",space="PS-Eden-Space"}
solr_metrics_jvm_memory_pools_bytes{item="used-after-gc",space="PS-Old-Gen"}
solr_metrics_jvm_memory_pools_bytes{item="used-after-gc",space="PS-Survivor-Space"}
# TYPE solr_metrics_jvm_threads gauge
solr_metrics_jvm_threads{item="blocked"}
solr_metrics_jvm_threads{item="count"}
solr_metrics_jvm_threads{item="daemon"}
solr_metrics_jvm_threads{item="deadlock"}
solr_metrics_jvm_threads{item="new"}
solr_metrics_jvm_threads{item="peak"}
solr_metrics_jvm_threads{item="runnable"}
solr_metrics_jvm_threads{item="terminated"}
solr_metrics_jvm_threads{item="timed_waiting"}
solr_metrics_jvm_threads{item="total_started"}
solr_metrics_jvm_threads{item="waiti]ng"}
# TYPE solr_met...> but was:<...mmitted",space="Code[Heap-'non-nmethods'"}
solr_metrics_jvm_memory_pools_bytes{item="committed",space="CodeHeap-'non-profiled-nmethods'"}
solr_metrics_jvm_memory_pools_bytes{item="committed",space="CodeHeap-'profiled-nmethods'"}
solr_metrics_jvm_memory_pools_bytes{item="committed",space="Compressed-Class-Space"}
solr_metrics_jvm_memory_pools_bytes{item="committed",space="Eden-Space"}
solr_metrics_jvm_memory_pools_bytes{item="committed",space="Metaspace"}
solr_metrics_jvm_memory_pools_bytes{item="committed",space="Survivor-Space"}
solr_metrics_jvm_memory_pools_bytes{item="committed",space="Tenured-Gen"}
solr_metrics_jvm_memory_pools_bytes{item="init",space="CodeHeap-'non-nmethods'"}
solr_metrics_jvm_memory_pools_bytes{item="init",space="CodeHeap-'non-profiled-nmethods'"}
solr_metrics_jvm_memory_pools_bytes{item="init",space="CodeHeap-'profiled-nmethods'"}
solr_metrics_jvm_memory_pools_bytes{item="init",space="Compressed-Class-Space"}
solr_metrics_jvm_memory_pools_bytes{item="init",space="Eden-Space"}
solr_metrics_jvm_memory_pools_bytes{item="init",space="Metaspace"}
solr_metrics_jvm_memory_pools_bytes{item="init",space="Survivor-Space"}
solr_metrics_jvm_memory_pools_bytes{item="init",space="Tenured-Gen"}
solr_metrics_jvm_memory_pools_bytes{item="max",space="CodeHeap-'non-nmethods'"}
solr_metrics_jvm_memory_pools_bytes{item="max",space="CodeHeap-'non-profiled-nmethods'"}
solr_metrics_jvm_memory_pools_bytes{item="max",space="CodeHeap-'profiled-nmethods'"}
solr_metrics_jvm_memory_pools_bytes{item="max",space="Compressed-Class-Space"}
solr_metrics_jvm_memory_pools_bytes{item="max",space="Eden-Space"}
solr_metrics_jvm_memory_pools_bytes{item="max",space="Metaspace"}
solr_metrics_jvm_memory_pools_bytes{item="max",space="Survivor-Space"}
solr_metrics_jvm_memory_pools_bytes{item="max",space="Tenured-Gen"}
solr_metrics_jvm_memory_pools_bytes{item="usage",space="CodeHeap-'non-nmethods'"}
solr_metrics_jvm_memory_pools_bytes{item="usage",space="CodeHeap-'non-profiled-nmethods'"}
solr_metrics_jvm_memory_pools_bytes{item="usage",space="CodeHeap-'profiled-nmethods'"}
solr_metrics_jvm_memory_pools_bytes{item="usage",space="Compressed-Class-Space"}
solr_metrics_jvm_memory_pools_bytes{item="usage",space="Eden-Space"}
solr_metrics_jvm_memory_pools_bytes{item="usage",space="Metaspace"}
solr_metrics_jvm_memory_pools_bytes{item="usage",space="Survivor-Space"}
solr_metrics_jvm_memory_pools_bytes{item="usage",space="Tenured-Gen"}
solr_metrics_jvm_memory_pools_bytes{item="used",space="CodeHeap-'non-nmethods'"}
solr_metrics_jvm_memory_pools_bytes{item="used",space="CodeHeap-'non-profiled-nmethods'"}
solr_metrics_jvm_memory_pools_bytes{item="used",space="CodeHeap-'profiled-nmethods'"}
solr_metrics_jvm_memory_pools_bytes{item="used",space="Compressed-Class-Space"}
solr_metrics_jvm_memory_pools_bytes{item="used",space="Eden-Space"}
solr_metrics_jvm_memory_pools_bytes{item="used",space="Metaspace"}
solr_metrics_jvm_memory_pools_bytes{item="used",space="Survivor-Space"}
solr_metrics_jvm_memory_pools_bytes{item="used",space="Tenured-Gen"}
solr_metrics_jvm_memory_pools_bytes{item="used-after-gc",space="Eden-Space"}
solr_metrics_jvm_memory_pools_bytes{item="used-after-gc",space="Survivor-Space"}
solr_metrics_jvm_memory_pools_bytes{item="used-after-gc",space="Tenured-Gen"}
# TYPE solr_metrics_jvm_threads gauge
solr_metrics_jvm_threads{item="blocked"}
solr_metrics_jvm_threads{item="count"}
solr_metrics_jvm_threads{item="daemon"}
solr_metrics_jvm_threads{item="deadlock"}
solr_metrics_jvm_threads{item="new"}
solr_metrics_jvm_threads{item="peak"}
solr_metrics_jvm_threads{item="runnable"}
solr_metrics_jvm_threads{item="terminated"}
solr_metrics_jvm_threads{item="termınated"}
solr_metrics_jvm_threads{item="timed_waiting"}
solr_metrics_jvm_threads{item="total_started"}
solr_metrics_jvm_threads{item="tımed_waıtıng"}
solr_metrics_jvm_threads{item="waiting"}
solr_metrics_jvm_threads{item="waıtı]ng"}
# TYPE solr_met...>
at __randomizedtesting.SeedInfo.seed([4C2F59899E34494B:CD3F34A0E791A6BD]:0)
at org.junit.Assert.assertEquals(Assert.java:117)
at org.junit.Assert.assertEquals(Assert.java:146)
at org.apache.solr.response.TestPrometheusResponseWriter.testPrometheusOutput(TestPrometheusResponseWriter.java:86)
at java.base/jdk.internal.reflect.DirectMethodHandleAccessor.invoke(DirectMethodHandleAccessor.java:104)
at java.base/java.lang.reflect.Method.invoke(Method.java:578)
at com.carrotsearch.randomizedtesting.RandomizedRunner.invoke(RandomizedRunner.java:1758)
at com.carrotsearch.randomizedtesting.RandomizedRunner$8.evaluate(RandomizedRunner.java:946)
at com.carrotsearch.randomizedtesting.RandomizedRunner$9.evaluate(RandomizedRunner.java:982)
at com.carrotsearch.randomizedtesting.RandomizedRunner$10.evaluate(RandomizedRunner.java:996)
at com.carrotsearch.randomizedtesting.rules.SystemPropertiesRestoreRule$1.evaluate(SystemPropertiesRestoreRule.java:80)
at org.junit.rules.RunRules.evaluate(RunRules.java:20)
at org.apache.lucene.tests.util.TestRuleSetupTeardownChained$1.evaluate(TestRuleSetupTeardownChained.java:48)
at org.apache.lucene.tests.util.AbstractBeforeAfterRule$1.evaluate(AbstractBeforeAfterRule.java:43)
at org.apache.lucene.tests.util.TestRuleThreadAndTestName$1.evaluate(TestRuleThreadAndTestName.java:45)
at org.apache.lucene.tests.util.TestRuleIgnoreAfterMaxFailures$1.evaluate(TestRuleIgnoreAfterMaxFailures.java:60)
at org.apache.lucene.tests.util.TestRuleMarkFailure$1.evaluate(TestRuleMarkFailure.java:44)
at org.junit.rules.RunRules.evaluate(RunRules.java:20)
at com.carrotsearch.randomizedtesting.rules.StatementAdapter.evaluate(StatementAdapter.java:36)
at com.carrotsearch.randomizedtesting.ThreadLeakControl$StatementRunner.run(ThreadLeakControl.java:390)
at com.carrotsearch.randomizedtesting.ThreadLeakControl.forkTimeoutingTask(ThreadLeakControl.java:843)
at com.carrotsearch.randomizedtesting.ThreadLeakControl$3.evaluate(ThreadLeakControl.java:490)
at com.carrotsearch.randomizedtesting.RandomizedRunner.runSingleTest(RandomizedRunner.java:955)
at com.carrotsearch.randomizedtesting.RandomizedRunner$5.evaluate(RandomizedRunner.java:840)
at com.carrotsearch.randomizedtesting.RandomizedRunner$6.evaluate(RandomizedRunner.java:891)
at com.carrotsearch.randomizedtesting.RandomizedRunner$7.evaluate(RandomizedRunner.java:902)
at org.junit.rules.ExternalResource$1.evaluate(ExternalResource.java:54)
at com.carrotsearch.randomizedtesting.rules.StatementAdapter.evaluate(StatementAdapter.java:36)
at com.carrotsearch.randomizedtesting.rules.StatementAdapter.evaluate(StatementAdapter.java:36)
at org.apache.lucene.tests.util.AbstractBeforeAfterRule$1.evaluate(AbstractBeforeAfterRule.java:43)
at com.carrotsearch.randomizedtesting.rules.SystemPropertiesRestoreRule$1.evaluate(SystemPropertiesRestoreRule.java:80)
at org.junit.rules.RunRules.evaluate(RunRules.java:20)
at org.apache.lucene.tests.util.AbstractBeforeAfterRule$1.evaluate(AbstractBeforeAfterRule.java:43)
at com.carrotsearch.randomizedtesting.rules.StatementAdapter.evaluate(StatementAdapter.java:36)
at org.apache.lucene.tests.util.TestRuleStoreClassName$1.evaluate(TestRuleStoreClassName.java:38)
at com.carrotsearch.randomizedtesting.rules.NoShadowingOrOverridesOnMethodsRule$1.evaluate(NoShadowingOrOverridesOnMethodsRule.java:40)
at com.carrotsearch.randomizedtesting.rules.NoShadowingOrOverridesOnMethodsRule$1.evaluate(NoShadowingOrOverridesOnMethodsRule.java:40)
at com.carrotsearch.randomizedtesting.rules.StatementAdapter.evaluate(StatementAdapter.java:36)
at com.carrotsearch.randomizedtesting.rules.StatementAdapter.evaluate(StatementAdapter.java:36)
at org.apache.lucene.tests.util.TestRuleAssertionsRequired$1.evaluate(TestRuleAssertionsRequired.java:53)
at org.apache.lucene.tests.util.AbstractBeforeAfterRule$1.evaluate(AbstractBeforeAfterRule.java:43)
at org.apache.lucene.tests.util.TestRuleMarkFailure$1.evaluate(TestRuleMarkFailure.java:44)
at org.apache.lucene.tests.util.TestRuleIgnoreAfterMaxFailures$1.evaluate(TestRuleIgnoreAfterMaxFailures.java:60)
at org.apache.lucene.tests.util.TestRuleIgnoreTestSuites$1.evaluate(TestRuleIgnoreTestSuites.java:47)
at org.junit.rules.RunRules.evaluate(RunRules.java:20)
at com.carrotsearch.randomizedtesting.rules.StatementAdapter.evaluate(StatementAdapter.java:36)
at com.carrotsearch.randomizedtesting.ThreadLeakControl$StatementRunner.run(ThreadLeakControl.java:390)
at com.carrotsearch.randomizedtesting.ThreadLeakControl.lambda$forkTimeoutingTask$0(ThreadLeakControl.java:850)
at java.base/java.lang.Thread.run(Thread.java:1589)
[JENKINS] Solr-main-MacOSX (64bit/hotspot/jdk-20) - Build # 4550 - Failure!
Posted by Policeman Jenkins Server <je...@thetaphi.de>.
Build: https://jenkins.thetaphi.de/job/Solr-main-MacOSX/4550/
Java: 64bit/hotspot/jdk-20 -XX:+UseCompressedOops -XX:+UseG1GC
No tests ran.
[JENKINS] Solr-main-MacOSX (64bit/hotspot/jdk-21.0.1) - Build # 4549 - Still Unstable!
Posted by Policeman Jenkins Server <je...@thetaphi.de>.
Build: https://jenkins.thetaphi.de/job/Solr-main-MacOSX/4549/
Java: 64bit/hotspot/jdk-21.0.1 -XX:+UseCompressedOops -XX:+UseG1GC
5 tests failed.
FAILED: org.apache.solr.cloud.HttpPartitionOnCommitTest.test
Error Message:
org.apache.solr.client.solrj.impl.BaseHttpSolrClient$RemoteSolrException: Error from server at http://127.0.0.1:50828/solr: Underlying core creation failed while creating collection: c8n_2x2_commits
Stack Trace:
org.apache.solr.client.solrj.impl.BaseHttpSolrClient$RemoteSolrException: Error from server at http://127.0.0.1:50828/solr: Underlying core creation failed while creating collection: c8n_2x2_commits
at __randomizedtesting.SeedInfo.seed([5CD5A2E057FB3BDB:D4819D3AF9075623]:0)
at app//org.apache.solr.client.solrj.impl.HttpSolrClient.executeMethod(HttpSolrClient.java:717)
at app//org.apache.solr.client.solrj.impl.HttpSolrClient.request(HttpSolrClient.java:255)
at app//org.apache.solr.client.solrj.impl.HttpSolrClient.request(HttpSolrClient.java:234)
at app//org.apache.solr.client.solrj.SolrClient.request(SolrClient.java:1194)
at app//org.apache.solr.cloud.AbstractBasicDistributedZkTestBase.createCollection(AbstractBasicDistributedZkTestBase.java:1154)
at app//org.apache.solr.cloud.AbstractFullDistribZkTestBase.createCollection(AbstractFullDistribZkTestBase.java:2025)
at app//org.apache.solr.cloud.HttpPartitionOnCommitTest.multiShardTest(HttpPartitionOnCommitTest.java:76)
at app//org.apache.solr.cloud.HttpPartitionOnCommitTest.test(HttpPartitionOnCommitTest.java:67)
at java.base@21.0.1/jdk.internal.reflect.DirectMethodHandleAccessor.invoke(DirectMethodHandleAccessor.java:103)
at java.base@21.0.1/java.lang.reflect.Method.invoke(Method.java:580)
at app//com.carrotsearch.randomizedtesting.RandomizedRunner.invoke(RandomizedRunner.java:1758)
at app//com.carrotsearch.randomizedtesting.RandomizedRunner$8.evaluate(RandomizedRunner.java:946)
at app//com.carrotsearch.randomizedtesting.RandomizedRunner$9.evaluate(RandomizedRunner.java:982)
at app//com.carrotsearch.randomizedtesting.RandomizedRunner$10.evaluate(RandomizedRunner.java:996)
at app//org.apache.solr.BaseDistributedSearchTestCase$ShardsRepeatRule$ShardsFixedStatement.callStatement(BaseDistributedSearchTestCase.java:1069)
at app//org.apache.solr.BaseDistributedSearchTestCase$ShardsRepeatRule$ShardsStatement.evaluate(BaseDistributedSearchTestCase.java:1040)
at app//com.carrotsearch.randomizedtesting.rules.SystemPropertiesRestoreRule$1.evaluate(SystemPropertiesRestoreRule.java:80)
at app//org.junit.rules.RunRules.evaluate(RunRules.java:20)
at app//org.apache.lucene.tests.util.TestRuleSetupTeardownChained$1.evaluate(TestRuleSetupTeardownChained.java:48)
at app//org.apache.lucene.tests.util.AbstractBeforeAfterRule$1.evaluate(AbstractBeforeAfterRule.java:43)
at app//org.apache.lucene.tests.util.TestRuleThreadAndTestName$1.evaluate(TestRuleThreadAndTestName.java:45)
at app//org.apache.lucene.tests.util.TestRuleIgnoreAfterMaxFailures$1.evaluate(TestRuleIgnoreAfterMaxFailures.java:60)
at app//org.apache.lucene.tests.util.TestRuleMarkFailure$1.evaluate(TestRuleMarkFailure.java:44)
at app//org.junit.rules.RunRules.evaluate(RunRules.java:20)
at app//com.carrotsearch.randomizedtesting.rules.StatementAdapter.evaluate(StatementAdapter.java:36)
at app//com.carrotsearch.randomizedtesting.ThreadLeakControl$StatementRunner.run(ThreadLeakControl.java:390)
at app//com.carrotsearch.randomizedtesting.ThreadLeakControl.forkTimeoutingTask(ThreadLeakControl.java:843)
at app//com.carrotsearch.randomizedtesting.ThreadLeakControl$3.evaluate(ThreadLeakControl.java:490)
at app//com.carrotsearch.randomizedtesting.RandomizedRunner.runSingleTest(RandomizedRunner.java:955)
at app//com.carrotsearch.randomizedtesting.RandomizedRunner$5.evaluate(RandomizedRunner.java:840)
at app//com.carrotsearch.randomizedtesting.RandomizedRunner$6.evaluate(RandomizedRunner.java:891)
at app//com.carrotsearch.randomizedtesting.RandomizedRunner$7.evaluate(RandomizedRunner.java:902)
at app//com.carrotsearch.randomizedtesting.rules.StatementAdapter.evaluate(StatementAdapter.java:36)
at app//com.carrotsearch.randomizedtesting.rules.StatementAdapter.evaluate(StatementAdapter.java:36)
at app//org.apache.lucene.tests.util.AbstractBeforeAfterRule$1.evaluate(AbstractBeforeAfterRule.java:43)
at app//com.carrotsearch.randomizedtesting.rules.SystemPropertiesRestoreRule$1.evaluate(SystemPropertiesRestoreRule.java:80)
at app//org.junit.rules.RunRules.evaluate(RunRules.java:20)
at app//org.apache.lucene.tests.util.AbstractBeforeAfterRule$1.evaluate(AbstractBeforeAfterRule.java:43)
at app//com.carrotsearch.randomizedtesting.rules.StatementAdapter.evaluate(StatementAdapter.java:36)
at app//org.apache.lucene.tests.util.TestRuleStoreClassName$1.evaluate(TestRuleStoreClassName.java:38)
at app//com.carrotsearch.randomizedtesting.rules.NoShadowingOrOverridesOnMethodsRule$1.evaluate(NoShadowingOrOverridesOnMethodsRule.java:40)
at app//com.carrotsearch.randomizedtesting.rules.NoShadowingOrOverridesOnMethodsRule$1.evaluate(NoShadowingOrOverridesOnMethodsRule.java:40)
at app//com.carrotsearch.randomizedtesting.rules.StatementAdapter.evaluate(StatementAdapter.java:36)
at app//com.carrotsearch.randomizedtesting.rules.StatementAdapter.evaluate(StatementAdapter.java:36)
at app//org.apache.lucene.tests.util.TestRuleAssertionsRequired$1.evaluate(TestRuleAssertionsRequired.java:53)
at app//org.apache.lucene.tests.util.AbstractBeforeAfterRule$1.evaluate(AbstractBeforeAfterRule.java:43)
at app//org.apache.lucene.tests.util.TestRuleMarkFailure$1.evaluate(TestRuleMarkFailure.java:44)
at app//org.apache.lucene.tests.util.TestRuleIgnoreAfterMaxFailures$1.evaluate(TestRuleIgnoreAfterMaxFailures.java:60)
at app//org.apache.lucene.tests.util.TestRuleIgnoreTestSuites$1.evaluate(TestRuleIgnoreTestSuites.java:47)
at app//org.junit.rules.RunRules.evaluate(RunRules.java:20)
at app//com.carrotsearch.randomizedtesting.rules.StatementAdapter.evaluate(StatementAdapter.java:36)
at app//com.carrotsearch.randomizedtesting.ThreadLeakControl$StatementRunner.run(ThreadLeakControl.java:390)
at app//com.carrotsearch.randomizedtesting.ThreadLeakControl.lambda$forkTimeoutingTask$0(ThreadLeakControl.java:850)
at java.base@21.0.1/java.lang.Thread.run(Thread.java:1583)
FAILED: org.apache.solr.cloud.api.collections.LocalFSCloudIncrementalBackupTest.testCustomProperties
Error Message:
org.apache.solr.common.SolrException: Could not find a healthy node to handle the request.
Stack Trace:
org.apache.solr.common.SolrException: Could not find a healthy node to handle the request.
at __randomizedtesting.SeedInfo.seed([5CD5A2E057FB3BDB:4E8EE131568E4F0E]:0)
at app//org.apache.solr.client.solrj.impl.CloudSolrClient.sendRequest(CloudSolrClient.java:1131)
at app//org.apache.solr.client.solrj.impl.CloudSolrClient.requestWithRetryOnStaleState(CloudSolrClient.java:833)
at app//org.apache.solr.client.solrj.impl.CloudSolrClient.requestWithRetryOnStaleState(CloudSolrClient.java:969)
at app//org.apache.solr.client.solrj.impl.CloudSolrClient.requestWithRetryOnStaleState(CloudSolrClient.java:969)
at app//org.apache.solr.client.solrj.impl.CloudSolrClient.requestWithRetryOnStaleState(CloudSolrClient.java:969)
at app//org.apache.solr.client.solrj.impl.CloudSolrClient.requestWithRetryOnStaleState(CloudSolrClient.java:969)
at app//org.apache.solr.client.solrj.impl.CloudSolrClient.requestWithRetryOnStaleState(CloudSolrClient.java:969)
at app//org.apache.solr.client.solrj.impl.CloudSolrClient.request(CloudSolrClient.java:764)
at app//org.apache.solr.client.solrj.SolrRequest.process(SolrRequest.java:229)
at app//org.apache.solr.client.solrj.SolrClient.query(SolrClient.java:927)
at app//org.apache.solr.cloud.api.collections.LocalFSCloudIncrementalBackupTest.testCustomProperties(LocalFSCloudIncrementalBackupTest.java:150)
at java.base@21.0.1/jdk.internal.reflect.DirectMethodHandleAccessor.invoke(DirectMethodHandleAccessor.java:103)
at java.base@21.0.1/java.lang.reflect.Method.invoke(Method.java:580)
at app//com.carrotsearch.randomizedtesting.RandomizedRunner.invoke(RandomizedRunner.java:1758)
at app//com.carrotsearch.randomizedtesting.RandomizedRunner$8.evaluate(RandomizedRunner.java:946)
at app//com.carrotsearch.randomizedtesting.RandomizedRunner$9.evaluate(RandomizedRunner.java:982)
at app//com.carrotsearch.randomizedtesting.RandomizedRunner$10.evaluate(RandomizedRunner.java:996)
at app//com.carrotsearch.randomizedtesting.rules.SystemPropertiesRestoreRule$1.evaluate(SystemPropertiesRestoreRule.java:80)
at app//org.junit.rules.RunRules.evaluate(RunRules.java:20)
at app//org.apache.lucene.tests.util.TestRuleSetupTeardownChained$1.evaluate(TestRuleSetupTeardownChained.java:48)
at app//org.apache.lucene.tests.util.AbstractBeforeAfterRule$1.evaluate(AbstractBeforeAfterRule.java:43)
at app//org.apache.lucene.tests.util.TestRuleThreadAndTestName$1.evaluate(TestRuleThreadAndTestName.java:45)
at app//org.apache.lucene.tests.util.TestRuleIgnoreAfterMaxFailures$1.evaluate(TestRuleIgnoreAfterMaxFailures.java:60)
at app//org.apache.lucene.tests.util.TestRuleMarkFailure$1.evaluate(TestRuleMarkFailure.java:44)
at app//org.junit.rules.RunRules.evaluate(RunRules.java:20)
at app//com.carrotsearch.randomizedtesting.rules.StatementAdapter.evaluate(StatementAdapter.java:36)
at app//com.carrotsearch.randomizedtesting.ThreadLeakControl$StatementRunner.run(ThreadLeakControl.java:390)
at app//com.carrotsearch.randomizedtesting.ThreadLeakControl.forkTimeoutingTask(ThreadLeakControl.java:843)
at app//com.carrotsearch.randomizedtesting.ThreadLeakControl$3.evaluate(ThreadLeakControl.java:490)
at app//com.carrotsearch.randomizedtesting.RandomizedRunner.runSingleTest(RandomizedRunner.java:955)
at app//com.carrotsearch.randomizedtesting.RandomizedRunner$5.evaluate(RandomizedRunner.java:840)
at app//com.carrotsearch.randomizedtesting.RandomizedRunner$6.evaluate(RandomizedRunner.java:891)
at app//com.carrotsearch.randomizedtesting.RandomizedRunner$7.evaluate(RandomizedRunner.java:902)
at app//com.carrotsearch.randomizedtesting.rules.StatementAdapter.evaluate(StatementAdapter.java:36)
at app//com.carrotsearch.randomizedtesting.rules.StatementAdapter.evaluate(StatementAdapter.java:36)
at app//org.apache.lucene.tests.util.AbstractBeforeAfterRule$1.evaluate(AbstractBeforeAfterRule.java:43)
at app//com.carrotsearch.randomizedtesting.rules.SystemPropertiesRestoreRule$1.evaluate(SystemPropertiesRestoreRule.java:80)
at app//org.junit.rules.RunRules.evaluate(RunRules.java:20)
at app//org.apache.lucene.tests.util.AbstractBeforeAfterRule$1.evaluate(AbstractBeforeAfterRule.java:43)
at app//com.carrotsearch.randomizedtesting.rules.StatementAdapter.evaluate(StatementAdapter.java:36)
at app//org.apache.lucene.tests.util.TestRuleStoreClassName$1.evaluate(TestRuleStoreClassName.java:38)
at app//com.carrotsearch.randomizedtesting.rules.NoShadowingOrOverridesOnMethodsRule$1.evaluate(NoShadowingOrOverridesOnMethodsRule.java:40)
at app//com.carrotsearch.randomizedtesting.rules.NoShadowingOrOverridesOnMethodsRule$1.evaluate(NoShadowingOrOverridesOnMethodsRule.java:40)
at app//com.carrotsearch.randomizedtesting.rules.StatementAdapter.evaluate(StatementAdapter.java:36)
at app//com.carrotsearch.randomizedtesting.rules.StatementAdapter.evaluate(StatementAdapter.java:36)
at app//org.apache.lucene.tests.util.TestRuleAssertionsRequired$1.evaluate(TestRuleAssertionsRequired.java:53)
at app//org.apache.lucene.tests.util.AbstractBeforeAfterRule$1.evaluate(AbstractBeforeAfterRule.java:43)
at app//org.apache.lucene.tests.util.TestRuleMarkFailure$1.evaluate(TestRuleMarkFailure.java:44)
at app//org.apache.lucene.tests.util.TestRuleIgnoreAfterMaxFailures$1.evaluate(TestRuleIgnoreAfterMaxFailures.java:60)
at app//org.apache.lucene.tests.util.TestRuleIgnoreTestSuites$1.evaluate(TestRuleIgnoreTestSuites.java:47)
at app//org.junit.rules.RunRules.evaluate(RunRules.java:20)
at app//com.carrotsearch.randomizedtesting.rules.StatementAdapter.evaluate(StatementAdapter.java:36)
at app//com.carrotsearch.randomizedtesting.ThreadLeakControl$StatementRunner.run(ThreadLeakControl.java:390)
at app//com.carrotsearch.randomizedtesting.ThreadLeakControl.lambda$forkTimeoutingTask$0(ThreadLeakControl.java:850)
at java.base@21.0.1/java.lang.Thread.run(Thread.java:1583)
FAILED: org.apache.solr.search.TestCoordinatorRole.testNRTRestart
Error Message:
org.apache.solr.client.solrj.SolrServerException: IOException occurred when talking to server at: http://127.0.0.1:59025/solr
Stack Trace:
org.apache.solr.client.solrj.SolrServerException: IOException occurred when talking to server at: http://127.0.0.1:59025/solr
at __randomizedtesting.SeedInfo.seed([5CD5A2E057FB3BDB:AC41122BF5E6E90D]:0)
at app//org.apache.solr.client.solrj.impl.HttpSolrClient.executeMethod(HttpSolrClient.java:729)
at app//org.apache.solr.client.solrj.impl.HttpSolrClient.request(HttpSolrClient.java:255)
at app//org.apache.solr.client.solrj.impl.HttpSolrClient.request(HttpSolrClient.java:234)
at app//org.apache.solr.client.solrj.SolrRequest.process(SolrRequest.java:229)
at app//org.apache.solr.client.solrj.SolrClient.commit(SolrClient.java:466)
at app//org.apache.solr.client.solrj.SolrClient.commit(SolrClient.java:423)
at app//org.apache.solr.search.TestCoordinatorRole.testNRTRestart(TestCoordinatorRole.java:311)
at java.base@21.0.1/jdk.internal.reflect.DirectMethodHandleAccessor.invoke(DirectMethodHandleAccessor.java:103)
at java.base@21.0.1/java.lang.reflect.Method.invoke(Method.java:580)
at app//com.carrotsearch.randomizedtesting.RandomizedRunner.invoke(RandomizedRunner.java:1758)
at app//com.carrotsearch.randomizedtesting.RandomizedRunner$8.evaluate(RandomizedRunner.java:946)
at app//com.carrotsearch.randomizedtesting.RandomizedRunner$9.evaluate(RandomizedRunner.java:982)
at app//com.carrotsearch.randomizedtesting.RandomizedRunner$10.evaluate(RandomizedRunner.java:996)
at app//com.carrotsearch.randomizedtesting.rules.SystemPropertiesRestoreRule$1.evaluate(SystemPropertiesRestoreRule.java:80)
at app//org.junit.rules.RunRules.evaluate(RunRules.java:20)
at app//org.apache.lucene.tests.util.TestRuleSetupTeardownChained$1.evaluate(TestRuleSetupTeardownChained.java:48)
at app//org.apache.lucene.tests.util.AbstractBeforeAfterRule$1.evaluate(AbstractBeforeAfterRule.java:43)
at app//org.apache.lucene.tests.util.TestRuleThreadAndTestName$1.evaluate(TestRuleThreadAndTestName.java:45)
at app//org.apache.lucene.tests.util.TestRuleIgnoreAfterMaxFailures$1.evaluate(TestRuleIgnoreAfterMaxFailures.java:60)
at app//org.apache.lucene.tests.util.TestRuleMarkFailure$1.evaluate(TestRuleMarkFailure.java:44)
at app//org.junit.rules.RunRules.evaluate(RunRules.java:20)
at app//com.carrotsearch.randomizedtesting.rules.StatementAdapter.evaluate(StatementAdapter.java:36)
at app//com.carrotsearch.randomizedtesting.ThreadLeakControl$StatementRunner.run(ThreadLeakControl.java:390)
at app//com.carrotsearch.randomizedtesting.ThreadLeakControl.forkTimeoutingTask(ThreadLeakControl.java:843)
at app//com.carrotsearch.randomizedtesting.ThreadLeakControl$3.evaluate(ThreadLeakControl.java:490)
at app//com.carrotsearch.randomizedtesting.RandomizedRunner.runSingleTest(RandomizedRunner.java:955)
at app//com.carrotsearch.randomizedtesting.RandomizedRunner$5.evaluate(RandomizedRunner.java:840)
at app//com.carrotsearch.randomizedtesting.RandomizedRunner$6.evaluate(RandomizedRunner.java:891)
at app//com.carrotsearch.randomizedtesting.RandomizedRunner$7.evaluate(RandomizedRunner.java:902)
at app//com.carrotsearch.randomizedtesting.rules.StatementAdapter.evaluate(StatementAdapter.java:36)
at app//com.carrotsearch.randomizedtesting.rules.StatementAdapter.evaluate(StatementAdapter.java:36)
at app//org.apache.lucene.tests.util.AbstractBeforeAfterRule$1.evaluate(AbstractBeforeAfterRule.java:43)
at app//com.carrotsearch.randomizedtesting.rules.SystemPropertiesRestoreRule$1.evaluate(SystemPropertiesRestoreRule.java:80)
at app//org.junit.rules.RunRules.evaluate(RunRules.java:20)
at app//org.apache.lucene.tests.util.AbstractBeforeAfterRule$1.evaluate(AbstractBeforeAfterRule.java:43)
at app//com.carrotsearch.randomizedtesting.rules.StatementAdapter.evaluate(StatementAdapter.java:36)
at app//org.apache.lucene.tests.util.TestRuleStoreClassName$1.evaluate(TestRuleStoreClassName.java:38)
at app//com.carrotsearch.randomizedtesting.rules.NoShadowingOrOverridesOnMethodsRule$1.evaluate(NoShadowingOrOverridesOnMethodsRule.java:40)
at app//com.carrotsearch.randomizedtesting.rules.NoShadowingOrOverridesOnMethodsRule$1.evaluate(NoShadowingOrOverridesOnMethodsRule.java:40)
at app//com.carrotsearch.randomizedtesting.rules.StatementAdapter.evaluate(StatementAdapter.java:36)
at app//com.carrotsearch.randomizedtesting.rules.StatementAdapter.evaluate(StatementAdapter.java:36)
at app//org.apache.lucene.tests.util.TestRuleAssertionsRequired$1.evaluate(TestRuleAssertionsRequired.java:53)
at app//org.apache.lucene.tests.util.AbstractBeforeAfterRule$1.evaluate(AbstractBeforeAfterRule.java:43)
at app//org.apache.lucene.tests.util.TestRuleMarkFailure$1.evaluate(TestRuleMarkFailure.java:44)
at app//org.apache.lucene.tests.util.TestRuleIgnoreAfterMaxFailures$1.evaluate(TestRuleIgnoreAfterMaxFailures.java:60)
at app//org.apache.lucene.tests.util.TestRuleIgnoreTestSuites$1.evaluate(TestRuleIgnoreTestSuites.java:47)
at app//org.junit.rules.RunRules.evaluate(RunRules.java:20)
at app//com.carrotsearch.randomizedtesting.rules.StatementAdapter.evaluate(StatementAdapter.java:36)
at app//com.carrotsearch.randomizedtesting.ThreadLeakControl$StatementRunner.run(ThreadLeakControl.java:390)
at app//com.carrotsearch.randomizedtesting.ThreadLeakControl.lambda$forkTimeoutingTask$0(ThreadLeakControl.java:850)
at java.base@21.0.1/java.lang.Thread.run(Thread.java:1583)
Caused by: org.apache.http.NoHttpResponseException: 127.0.0.1:59025 failed to respond
at app//org.apache.http.impl.conn.DefaultHttpResponseParser.parseHead(DefaultHttpResponseParser.java:141)
at app//org.apache.http.impl.conn.DefaultHttpResponseParser.parseHead(DefaultHttpResponseParser.java:56)
at app//org.apache.http.impl.io.AbstractMessageParser.parse(AbstractMessageParser.java:259)
at app//org.apache.http.impl.DefaultBHttpClientConnection.receiveResponseHeader(DefaultBHttpClientConnection.java:163)
at app//org.apache.http.impl.conn.CPoolProxy.receiveResponseHeader(CPoolProxy.java:157)
at app//org.apache.http.protocol.HttpRequestExecutor.doReceiveResponse(HttpRequestExecutor.java:273)
at app//org.apache.http.protocol.HttpRequestExecutor.execute(HttpRequestExecutor.java:125)
at app//org.apache.http.impl.execchain.MainClientExec.execute(MainClientExec.java:272)
at app//org.apache.http.impl.execchain.ProtocolExec.execute(ProtocolExec.java:186)
at app//org.apache.http.impl.execchain.RetryExec.execute(RetryExec.java:89)
at app//org.apache.http.impl.execchain.RedirectExec.execute(RedirectExec.java:110)
at app//org.apache.http.impl.client.InternalHttpClient.doExecute(InternalHttpClient.java:185)
at app//org.apache.http.impl.client.CloseableHttpClient.execute(CloseableHttpClient.java:83)
at app//org.apache.http.impl.client.CloseableHttpClient.execute(CloseableHttpClient.java:56)
at app//org.apache.solr.client.solrj.impl.HttpSolrClient.executeMethod(HttpSolrClient.java:573)
... 50 more
FAILED: org.apache.solr.handler.admin.MetricsHandlerTest.testPrometheusMetricsJvm
Error Message:
java.lang.AssertionError: expected:<0.0> but was:<2555904.0>
Stack Trace:
java.lang.AssertionError: expected:<0.0> but was:<2555904.0>
at __randomizedtesting.SeedInfo.seed([5CD5A2E057FB3BDB:549F71F504AB76AB]:0)
at org.junit.Assert.fail(Assert.java:89)
at org.junit.Assert.failNotEquals(Assert.java:835)
at org.junit.Assert.assertEquals(Assert.java:555)
at org.junit.Assert.assertEquals(Assert.java:685)
at org.apache.solr.handler.admin.MetricsHandlerTest.testPrometheusMetricsJvm(MetricsHandlerTest.java:925)
at java.base/jdk.internal.reflect.DirectMethodHandleAccessor.invoke(DirectMethodHandleAccessor.java:103)
at java.base/java.lang.reflect.Method.invoke(Method.java:580)
at com.carrotsearch.randomizedtesting.RandomizedRunner.invoke(RandomizedRunner.java:1758)
at com.carrotsearch.randomizedtesting.RandomizedRunner$8.evaluate(RandomizedRunner.java:946)
at com.carrotsearch.randomizedtesting.RandomizedRunner$9.evaluate(RandomizedRunner.java:982)
at com.carrotsearch.randomizedtesting.RandomizedRunner$10.evaluate(RandomizedRunner.java:996)
at com.carrotsearch.randomizedtesting.rules.SystemPropertiesRestoreRule$1.evaluate(SystemPropertiesRestoreRule.java:80)
at org.junit.rules.RunRules.evaluate(RunRules.java:20)
at org.apache.lucene.tests.util.TestRuleSetupTeardownChained$1.evaluate(TestRuleSetupTeardownChained.java:48)
at org.apache.lucene.tests.util.AbstractBeforeAfterRule$1.evaluate(AbstractBeforeAfterRule.java:43)
at org.apache.lucene.tests.util.TestRuleThreadAndTestName$1.evaluate(TestRuleThreadAndTestName.java:45)
at org.apache.lucene.tests.util.TestRuleIgnoreAfterMaxFailures$1.evaluate(TestRuleIgnoreAfterMaxFailures.java:60)
at org.apache.lucene.tests.util.TestRuleMarkFailure$1.evaluate(TestRuleMarkFailure.java:44)
at org.junit.rules.RunRules.evaluate(RunRules.java:20)
at com.carrotsearch.randomizedtesting.rules.StatementAdapter.evaluate(StatementAdapter.java:36)
at com.carrotsearch.randomizedtesting.ThreadLeakControl$StatementRunner.run(ThreadLeakControl.java:390)
at com.carrotsearch.randomizedtesting.ThreadLeakControl.forkTimeoutingTask(ThreadLeakControl.java:843)
at com.carrotsearch.randomizedtesting.ThreadLeakControl$3.evaluate(ThreadLeakControl.java:490)
at com.carrotsearch.randomizedtesting.RandomizedRunner.runSingleTest(RandomizedRunner.java:955)
at com.carrotsearch.randomizedtesting.RandomizedRunner$5.evaluate(RandomizedRunner.java:840)
at com.carrotsearch.randomizedtesting.RandomizedRunner$6.evaluate(RandomizedRunner.java:891)
at com.carrotsearch.randomizedtesting.RandomizedRunner$7.evaluate(RandomizedRunner.java:902)
at com.carrotsearch.randomizedtesting.rules.StatementAdapter.evaluate(StatementAdapter.java:36)
at com.carrotsearch.randomizedtesting.rules.StatementAdapter.evaluate(StatementAdapter.java:36)
at org.apache.lucene.tests.util.AbstractBeforeAfterRule$1.evaluate(AbstractBeforeAfterRule.java:43)
at com.carrotsearch.randomizedtesting.rules.SystemPropertiesRestoreRule$1.evaluate(SystemPropertiesRestoreRule.java:80)
at org.junit.rules.RunRules.evaluate(RunRules.java:20)
at org.apache.lucene.tests.util.AbstractBeforeAfterRule$1.evaluate(AbstractBeforeAfterRule.java:43)
at com.carrotsearch.randomizedtesting.rules.StatementAdapter.evaluate(StatementAdapter.java:36)
at org.apache.lucene.tests.util.TestRuleStoreClassName$1.evaluate(TestRuleStoreClassName.java:38)
at com.carrotsearch.randomizedtesting.rules.NoShadowingOrOverridesOnMethodsRule$1.evaluate(NoShadowingOrOverridesOnMethodsRule.java:40)
at com.carrotsearch.randomizedtesting.rules.NoShadowingOrOverridesOnMethodsRule$1.evaluate(NoShadowingOrOverridesOnMethodsRule.java:40)
at com.carrotsearch.randomizedtesting.rules.StatementAdapter.evaluate(StatementAdapter.java:36)
at com.carrotsearch.randomizedtesting.rules.StatementAdapter.evaluate(StatementAdapter.java:36)
at org.apache.lucene.tests.util.TestRuleAssertionsRequired$1.evaluate(TestRuleAssertionsRequired.java:53)
at org.apache.lucene.tests.util.AbstractBeforeAfterRule$1.evaluate(AbstractBeforeAfterRule.java:43)
at org.apache.lucene.tests.util.TestRuleMarkFailure$1.evaluate(TestRuleMarkFailure.java:44)
at org.apache.lucene.tests.util.TestRuleIgnoreAfterMaxFailures$1.evaluate(TestRuleIgnoreAfterMaxFailures.java:60)
at org.apache.lucene.tests.util.TestRuleIgnoreTestSuites$1.evaluate(TestRuleIgnoreTestSuites.java:47)
at org.junit.rules.RunRules.evaluate(RunRules.java:20)
at com.carrotsearch.randomizedtesting.rules.StatementAdapter.evaluate(StatementAdapter.java:36)
at com.carrotsearch.randomizedtesting.ThreadLeakControl$StatementRunner.run(ThreadLeakControl.java:390)
at com.carrotsearch.randomizedtesting.ThreadLeakControl.lambda$forkTimeoutingTask$0(ThreadLeakControl.java:850)
at java.base/java.lang.Thread.run(Thread.java:1583)
FAILED: org.apache.solr.response.TestPrometheusResponseWriter.testPrometheusOutput
Error Message:
org.junit.ComparisonFailure: expected:<...lr_metrics_jvm_gc{}
[# TYPE solr_metrics_jvm_gc_seconds gauge
solr_metrics_jvm_gc_seconds{}
solr_metrics_jvm_gc_seconds{}
# TYPE solr_metrics_jvm_heap gauge
solr_metrics_jvm_heap{item="committed",memory="heap"}
solr_metrics_jvm_heap{item="committed",memory="non-heap"}
solr_metrics_jvm_heap{item="committed",memory="total"}
solr_metrics_jvm_heap{item="init",memory="heap"}
solr_metrics_jvm_heap{item="init",memory="non-heap"}
solr_metrics_jvm_heap{item="init",memory="total"}
solr_metrics_jvm_heap{item="max",memory="heap"}
solr_metrics_jvm_heap{item="max",memory="non-heap"}
solr_metrics_jvm_heap{item="max",memory="total"}
solr_metrics_jvm_heap{item="usage",memory="heap"}
solr_metrics_jvm_heap{item="usage",memory="non-heap"}
solr_metrics_jvm_heap{item="used",memory="heap"}
solr_metrics_jvm_heap{item="used",memory="non-heap"}
solr_metrics_jvm_heap{item="used",memory="total"}
# TYPE solr_metrics_jvm_memory_pools_bytes gauge
solr_metrics_jvm_memory_pools_bytes{item="committed",space="CodeCache"}
solr_metrics_jvm_memory_pools_bytes{item="committed",space="Compressed-Class-Space"}
solr_metrics_jvm_memory_pools_bytes{item="committed",space="Metaspace"}
solr_metrics_jvm_memory_pools_bytes{item="committed",space="PS-Eden-Space"}
solr_metrics_jvm_memory_pools_bytes{item="committed",space="PS-Old-Gen"}
solr_metrics_jvm_memory_pools_bytes{item="committed",space="PS-Survivor-Space"}
solr_metrics_jvm_memory_pools_bytes{item="init",space="CodeCache"}
solr_metrics_jvm_memory_pools_bytes{item="init",space="Compressed-Class-Space"}
solr_metrics_jvm_memory_pools_bytes{item="init",space="Metaspace"}
solr_metrics_jvm_memory_pools_bytes{item="init",space="PS-Eden-Space"}
solr_metrics_jvm_memory_pools_bytes{item="init",space="PS-Old-Gen"}
solr_metrics_jvm_memory_pools_bytes{item="init",space="PS-Survivor-Space"}
solr_metrics_jvm_memory_pools_bytes{item="max",space="CodeCache"}
solr_metrics_jvm_memory_pools_bytes{item="max",space="Compressed-Class-Space"}
solr_metrics_jvm_memory_pools_bytes{item="max",space="Metaspace"}
solr_metrics_jvm_memory_pools_bytes{item="max",space="PS-Eden-Space"}
solr_metrics_jvm_memory_pools_bytes{item="max",space="PS-Old-Gen"}
solr_metrics_jvm_memory_pools_bytes{item="max",space="PS-Survivor-Space"}
solr_metrics_jvm_memory_pools_bytes{item="usage",space="CodeCache"}
solr_metrics_jvm_memory_pools_bytes{item="usage",space="Compressed-Class-Space"}
solr_metrics_jvm_memory_pools_bytes{item="usage",space="Metaspace"}
solr_metrics_jvm_memory_pools_bytes{item="usage",space="PS-Eden-Space"}
solr_metrics_jvm_memory_pools_bytes{item="usage",space="PS-Old-Gen"}
solr_metrics_jvm_memory_pools_bytes{item="usage",space="PS-Survivor-Space"}
solr_metrics_jvm_memory_pools_bytes{item="used",space="CodeCache"}
solr_metrics_jvm_memory_pools_bytes{item="used",space="Compressed-Class-Space"}
solr_metrics_jvm_memory_pools_bytes{item="used",space="Metaspace"}
solr_metrics_jvm_memory_pools_bytes{item="used",space="PS-Eden-Space"}
solr_metrics_jvm_memory_pools_bytes{item="used",space="PS-Old-Gen"}
solr_metrics_jvm_memory_pools_bytes{item="used",space="PS-Survivor-Space"}
solr_metrics_jvm_memory_pools_bytes{item="used-after-gc",space="PS-Eden-Space"}
solr_metrics_jvm_memory_pools_bytes{item="used-after-gc",space="PS-Old-Gen"}
solr_metrics_jvm_memory_pools_bytes{item="used-after-gc",space="PS-Survivor-Space"}
# TYPE solr_metrics_jvm_threads gauge
solr_metrics_jvm_threads{item="blocked"}
solr_metrics_jvm_threads{item="count"}
solr_metrics_jvm_threads{item="daemon"}
solr_metrics_jvm_threads{item="deadlock"}
solr_metrics_jvm_threads{item="new"}
solr_metrics_jvm_threads{item="peak"}
solr_metrics_jvm_threads{item="runnable"}
solr_metrics_jvm_threads{item="terminated"}
solr_metrics_jvm_threads{item="timed_waiting"}
solr_metrics_jvm_threads{item="total_started"}
solr_metrics_jvm_threads{item="waiti]ng"}
# TYPE solr_met...> but was:<...lr_metrics_jvm_gc{}
[solr_metrics_jvm_gc{}
# TYPE solr_metrics_jvm_gc_seconds gauge
solr_metrics_jvm_gc_seconds{}
solr_metrics_jvm_gc_seconds{}
solr_metrics_jvm_gc_seconds{}
# TYPE solr_metrics_jvm_heap gauge
solr_metrics_jvm_heap{item="committed",memory="heap"}
solr_metrics_jvm_heap{item="committed",memory="non-heap"}
solr_metrics_jvm_heap{item="committed",memory="total"}
solr_metrics_jvm_heap{item="init",memory="heap"}
solr_metrics_jvm_heap{item="init",memory="non-heap"}
solr_metrics_jvm_heap{item="init",memory="total"}
solr_metrics_jvm_heap{item="max",memory="heap"}
solr_metrics_jvm_heap{item="max",memory="non-heap"}
solr_metrics_jvm_heap{item="max",memory="total"}
solr_metrics_jvm_heap{item="usage",memory="heap"}
solr_metrics_jvm_heap{item="usage",memory="non-heap"}
solr_metrics_jvm_heap{item="used",memory="heap"}
solr_metrics_jvm_heap{item="used",memory="non-heap"}
solr_metrics_jvm_heap{item="used",memory="total"}
# TYPE solr_metrics_jvm_memory_pools_bytes gauge
solr_metrics_jvm_memory_pools_bytes{item="committed",space="CodeHeap-'non-nmethods'"}
solr_metrics_jvm_memory_pools_bytes{item="committed",space="CodeHeap-'non-profiled-nmethods'"}
solr_metrics_jvm_memory_pools_bytes{item="committed",space="CodeHeap-'profiled-nmethods'"}
solr_metrics_jvm_memory_pools_bytes{item="committed",space="Compressed-Class-Space"}
solr_metrics_jvm_memory_pools_bytes{item="committed",space="G1-Eden-Space"}
solr_metrics_jvm_memory_pools_bytes{item="committed",space="G1-Old-Gen"}
solr_metrics_jvm_memory_pools_bytes{item="committed",space="G1-Survivor-Space"}
solr_metrics_jvm_memory_pools_bytes{item="committed",space="Metaspace"}
solr_metrics_jvm_memory_pools_bytes{item="init",space="CodeHeap-'non-nmethods'"}
solr_metrics_jvm_memory_pools_bytes{item="init",space="CodeHeap-'non-profiled-nmethods'"}
solr_metrics_jvm_memory_pools_bytes{item="init",space="CodeHeap-'profiled-nmethods'"}
solr_metrics_jvm_memory_pools_bytes{item="init",space="Compressed-Class-Space"}
solr_metrics_jvm_memory_pools_bytes{item="init",space="G1-Eden-Space"}
solr_metrics_jvm_memory_pools_bytes{item="init",space="G1-Old-Gen"}
solr_metrics_jvm_memory_pools_bytes{item="init",space="G1-Survivor-Space"}
solr_metrics_jvm_memory_pools_bytes{item="init",space="Metaspace"}
solr_metrics_jvm_memory_pools_bytes{item="max",space="CodeHeap-'non-nmethods'"}
solr_metrics_jvm_memory_pools_bytes{item="max",space="CodeHeap-'non-profiled-nmethods'"}
solr_metrics_jvm_memory_pools_bytes{item="max",space="CodeHeap-'profiled-nmethods'"}
solr_metrics_jvm_memory_pools_bytes{item="max",space="Compressed-Class-Space"}
solr_metrics_jvm_memory_pools_bytes{item="max",space="G1-Eden-Space"}
solr_metrics_jvm_memory_pools_bytes{item="max",space="G1-Old-Gen"}
solr_metrics_jvm_memory_pools_bytes{item="max",space="G1-Survivor-Space"}
solr_metrics_jvm_memory_pools_bytes{item="max",space="Metaspace"}
solr_metrics_jvm_memory_pools_bytes{item="usage",space="CodeHeap-'non-nmethods'"}
solr_metrics_jvm_memory_pools_bytes{item="usage",space="CodeHeap-'non-profiled-nmethods'"}
solr_metrics_jvm_memory_pools_bytes{item="usage",space="CodeHeap-'profiled-nmethods'"}
solr_metrics_jvm_memory_pools_bytes{item="usage",space="Compressed-Class-Space"}
solr_metrics_jvm_memory_pools_bytes{item="usage",space="G1-Eden-Space"}
solr_metrics_jvm_memory_pools_bytes{item="usage",space="G1-Old-Gen"}
solr_metrics_jvm_memory_pools_bytes{item="usage",space="G1-Survivor-Space"}
solr_metrics_jvm_memory_pools_bytes{item="usage",space="Metaspace"}
solr_metrics_jvm_memory_pools_bytes{item="used",space="CodeHeap-'non-nmethods'"}
solr_metrics_jvm_memory_pools_bytes{item="used",space="CodeHeap-'non-profiled-nmethods'"}
solr_metrics_jvm_memory_pools_bytes{item="used",space="CodeHeap-'profiled-nmethods'"}
solr_metrics_jvm_memory_pools_bytes{item="used",space="Compressed-Class-Space"}
solr_metrics_jvm_memory_pools_bytes{item="used",space="G1-Eden-Space"}
solr_metrics_jvm_memory_pools_bytes{item="used",space="G1-Old-Gen"}
solr_metrics_jvm_memory_pools_bytes{item="used",space="G1-Survivor-Space"}
solr_metrics_jvm_memory_pools_bytes{item="used",space="Metaspace"}
solr_metrics_jvm_memory_pools_bytes{item="used-after-gc",space="G1-Eden-Space"}
solr_metrics_jvm_memory_pools_bytes{item="used-after-gc",space="G1-Old-Gen"}
solr_metrics_jvm_memory_pools_bytes{item="used-after-gc",space="G1-Survivor-Space"}
# TYPE solr_metrics_jvm_threads gauge
solr_metrics_jvm_threads{item="blocked"}
solr_metrics_jvm_threads{item="count"}
solr_metrics_jvm_threads{item="daemon"}
solr_metrics_jvm_threads{item="deadlock"}
solr_metrics_jvm_threads{item="new"}
solr_metrics_jvm_threads{item="peak"}
solr_metrics_jvm_threads{item="runnable"}
solr_metrics_jvm_threads{item="terminated"}
solr_metrics_jvm_threads{item="termınated"}
solr_metrics_jvm_threads{item="timed_waiting"}
solr_metrics_jvm_threads{item="total_started"}
solr_metrics_jvm_threads{item="tımed_waıtıng"}
solr_metrics_jvm_threads{item="waiting"}
solr_metrics_jvm_threads{item="waıtı]ng"}
# TYPE solr_met...>
Stack Trace:
org.junit.ComparisonFailure: expected:<...lr_metrics_jvm_gc{}
[# TYPE solr_metrics_jvm_gc_seconds gauge
solr_metrics_jvm_gc_seconds{}
solr_metrics_jvm_gc_seconds{}
# TYPE solr_metrics_jvm_heap gauge
solr_metrics_jvm_heap{item="committed",memory="heap"}
solr_metrics_jvm_heap{item="committed",memory="non-heap"}
solr_metrics_jvm_heap{item="committed",memory="total"}
solr_metrics_jvm_heap{item="init",memory="heap"}
solr_metrics_jvm_heap{item="init",memory="non-heap"}
solr_metrics_jvm_heap{item="init",memory="total"}
solr_metrics_jvm_heap{item="max",memory="heap"}
solr_metrics_jvm_heap{item="max",memory="non-heap"}
solr_metrics_jvm_heap{item="max",memory="total"}
solr_metrics_jvm_heap{item="usage",memory="heap"}
solr_metrics_jvm_heap{item="usage",memory="non-heap"}
solr_metrics_jvm_heap{item="used",memory="heap"}
solr_metrics_jvm_heap{item="used",memory="non-heap"}
solr_metrics_jvm_heap{item="used",memory="total"}
# TYPE solr_metrics_jvm_memory_pools_bytes gauge
solr_metrics_jvm_memory_pools_bytes{item="committed",space="CodeCache"}
solr_metrics_jvm_memory_pools_bytes{item="committed",space="Compressed-Class-Space"}
solr_metrics_jvm_memory_pools_bytes{item="committed",space="Metaspace"}
solr_metrics_jvm_memory_pools_bytes{item="committed",space="PS-Eden-Space"}
solr_metrics_jvm_memory_pools_bytes{item="committed",space="PS-Old-Gen"}
solr_metrics_jvm_memory_pools_bytes{item="committed",space="PS-Survivor-Space"}
solr_metrics_jvm_memory_pools_bytes{item="init",space="CodeCache"}
solr_metrics_jvm_memory_pools_bytes{item="init",space="Compressed-Class-Space"}
solr_metrics_jvm_memory_pools_bytes{item="init",space="Metaspace"}
solr_metrics_jvm_memory_pools_bytes{item="init",space="PS-Eden-Space"}
solr_metrics_jvm_memory_pools_bytes{item="init",space="PS-Old-Gen"}
solr_metrics_jvm_memory_pools_bytes{item="init",space="PS-Survivor-Space"}
solr_metrics_jvm_memory_pools_bytes{item="max",space="CodeCache"}
solr_metrics_jvm_memory_pools_bytes{item="max",space="Compressed-Class-Space"}
solr_metrics_jvm_memory_pools_bytes{item="max",space="Metaspace"}
solr_metrics_jvm_memory_pools_bytes{item="max",space="PS-Eden-Space"}
solr_metrics_jvm_memory_pools_bytes{item="max",space="PS-Old-Gen"}
solr_metrics_jvm_memory_pools_bytes{item="max",space="PS-Survivor-Space"}
solr_metrics_jvm_memory_pools_bytes{item="usage",space="CodeCache"}
solr_metrics_jvm_memory_pools_bytes{item="usage",space="Compressed-Class-Space"}
solr_metrics_jvm_memory_pools_bytes{item="usage",space="Metaspace"}
solr_metrics_jvm_memory_pools_bytes{item="usage",space="PS-Eden-Space"}
solr_metrics_jvm_memory_pools_bytes{item="usage",space="PS-Old-Gen"}
solr_metrics_jvm_memory_pools_bytes{item="usage",space="PS-Survivor-Space"}
solr_metrics_jvm_memory_pools_bytes{item="used",space="CodeCache"}
solr_metrics_jvm_memory_pools_bytes{item="used",space="Compressed-Class-Space"}
solr_metrics_jvm_memory_pools_bytes{item="used",space="Metaspace"}
solr_metrics_jvm_memory_pools_bytes{item="used",space="PS-Eden-Space"}
solr_metrics_jvm_memory_pools_bytes{item="used",space="PS-Old-Gen"}
solr_metrics_jvm_memory_pools_bytes{item="used",space="PS-Survivor-Space"}
solr_metrics_jvm_memory_pools_bytes{item="used-after-gc",space="PS-Eden-Space"}
solr_metrics_jvm_memory_pools_bytes{item="used-after-gc",space="PS-Old-Gen"}
solr_metrics_jvm_memory_pools_bytes{item="used-after-gc",space="PS-Survivor-Space"}
# TYPE solr_metrics_jvm_threads gauge
solr_metrics_jvm_threads{item="blocked"}
solr_metrics_jvm_threads{item="count"}
solr_metrics_jvm_threads{item="daemon"}
solr_metrics_jvm_threads{item="deadlock"}
solr_metrics_jvm_threads{item="new"}
solr_metrics_jvm_threads{item="peak"}
solr_metrics_jvm_threads{item="runnable"}
solr_metrics_jvm_threads{item="terminated"}
solr_metrics_jvm_threads{item="timed_waiting"}
solr_metrics_jvm_threads{item="total_started"}
solr_metrics_jvm_threads{item="waiti]ng"}
# TYPE solr_met...> but was:<...lr_metrics_jvm_gc{}
[solr_metrics_jvm_gc{}
# TYPE solr_metrics_jvm_gc_seconds gauge
solr_metrics_jvm_gc_seconds{}
solr_metrics_jvm_gc_seconds{}
solr_metrics_jvm_gc_seconds{}
# TYPE solr_metrics_jvm_heap gauge
solr_metrics_jvm_heap{item="committed",memory="heap"}
solr_metrics_jvm_heap{item="committed",memory="non-heap"}
solr_metrics_jvm_heap{item="committed",memory="total"}
solr_metrics_jvm_heap{item="init",memory="heap"}
solr_metrics_jvm_heap{item="init",memory="non-heap"}
solr_metrics_jvm_heap{item="init",memory="total"}
solr_metrics_jvm_heap{item="max",memory="heap"}
solr_metrics_jvm_heap{item="max",memory="non-heap"}
solr_metrics_jvm_heap{item="max",memory="total"}
solr_metrics_jvm_heap{item="usage",memory="heap"}
solr_metrics_jvm_heap{item="usage",memory="non-heap"}
solr_metrics_jvm_heap{item="used",memory="heap"}
solr_metrics_jvm_heap{item="used",memory="non-heap"}
solr_metrics_jvm_heap{item="used",memory="total"}
# TYPE solr_metrics_jvm_memory_pools_bytes gauge
solr_metrics_jvm_memory_pools_bytes{item="committed",space="CodeHeap-'non-nmethods'"}
solr_metrics_jvm_memory_pools_bytes{item="committed",space="CodeHeap-'non-profiled-nmethods'"}
solr_metrics_jvm_memory_pools_bytes{item="committed",space="CodeHeap-'profiled-nmethods'"}
solr_metrics_jvm_memory_pools_bytes{item="committed",space="Compressed-Class-Space"}
solr_metrics_jvm_memory_pools_bytes{item="committed",space="G1-Eden-Space"}
solr_metrics_jvm_memory_pools_bytes{item="committed",space="G1-Old-Gen"}
solr_metrics_jvm_memory_pools_bytes{item="committed",space="G1-Survivor-Space"}
solr_metrics_jvm_memory_pools_bytes{item="committed",space="Metaspace"}
solr_metrics_jvm_memory_pools_bytes{item="init",space="CodeHeap-'non-nmethods'"}
solr_metrics_jvm_memory_pools_bytes{item="init",space="CodeHeap-'non-profiled-nmethods'"}
solr_metrics_jvm_memory_pools_bytes{item="init",space="CodeHeap-'profiled-nmethods'"}
solr_metrics_jvm_memory_pools_bytes{item="init",space="Compressed-Class-Space"}
solr_metrics_jvm_memory_pools_bytes{item="init",space="G1-Eden-Space"}
solr_metrics_jvm_memory_pools_bytes{item="init",space="G1-Old-Gen"}
solr_metrics_jvm_memory_pools_bytes{item="init",space="G1-Survivor-Space"}
solr_metrics_jvm_memory_pools_bytes{item="init",space="Metaspace"}
solr_metrics_jvm_memory_pools_bytes{item="max",space="CodeHeap-'non-nmethods'"}
solr_metrics_jvm_memory_pools_bytes{item="max",space="CodeHeap-'non-profiled-nmethods'"}
solr_metrics_jvm_memory_pools_bytes{item="max",space="CodeHeap-'profiled-nmethods'"}
solr_metrics_jvm_memory_pools_bytes{item="max",space="Compressed-Class-Space"}
solr_metrics_jvm_memory_pools_bytes{item="max",space="G1-Eden-Space"}
solr_metrics_jvm_memory_pools_bytes{item="max",space="G1-Old-Gen"}
solr_metrics_jvm_memory_pools_bytes{item="max",space="G1-Survivor-Space"}
solr_metrics_jvm_memory_pools_bytes{item="max",space="Metaspace"}
solr_metrics_jvm_memory_pools_bytes{item="usage",space="CodeHeap-'non-nmethods'"}
solr_metrics_jvm_memory_pools_bytes{item="usage",space="CodeHeap-'non-profiled-nmethods'"}
solr_metrics_jvm_memory_pools_bytes{item="usage",space="CodeHeap-'profiled-nmethods'"}
solr_metrics_jvm_memory_pools_bytes{item="usage",space="Compressed-Class-Space"}
solr_metrics_jvm_memory_pools_bytes{item="usage",space="G1-Eden-Space"}
solr_metrics_jvm_memory_pools_bytes{item="usage",space="G1-Old-Gen"}
solr_metrics_jvm_memory_pools_bytes{item="usage",space="G1-Survivor-Space"}
solr_metrics_jvm_memory_pools_bytes{item="usage",space="Metaspace"}
solr_metrics_jvm_memory_pools_bytes{item="used",space="CodeHeap-'non-nmethods'"}
solr_metrics_jvm_memory_pools_bytes{item="used",space="CodeHeap-'non-profiled-nmethods'"}
solr_metrics_jvm_memory_pools_bytes{item="used",space="CodeHeap-'profiled-nmethods'"}
solr_metrics_jvm_memory_pools_bytes{item="used",space="Compressed-Class-Space"}
solr_metrics_jvm_memory_pools_bytes{item="used",space="G1-Eden-Space"}
solr_metrics_jvm_memory_pools_bytes{item="used",space="G1-Old-Gen"}
solr_metrics_jvm_memory_pools_bytes{item="used",space="G1-Survivor-Space"}
solr_metrics_jvm_memory_pools_bytes{item="used",space="Metaspace"}
solr_metrics_jvm_memory_pools_bytes{item="used-after-gc",space="G1-Eden-Space"}
solr_metrics_jvm_memory_pools_bytes{item="used-after-gc",space="G1-Old-Gen"}
solr_metrics_jvm_memory_pools_bytes{item="used-after-gc",space="G1-Survivor-Space"}
# TYPE solr_metrics_jvm_threads gauge
solr_metrics_jvm_threads{item="blocked"}
solr_metrics_jvm_threads{item="count"}
solr_metrics_jvm_threads{item="daemon"}
solr_metrics_jvm_threads{item="deadlock"}
solr_metrics_jvm_threads{item="new"}
solr_metrics_jvm_threads{item="peak"}
solr_metrics_jvm_threads{item="runnable"}
solr_metrics_jvm_threads{item="terminated"}
solr_metrics_jvm_threads{item="termınated"}
solr_metrics_jvm_threads{item="timed_waiting"}
solr_metrics_jvm_threads{item="total_started"}
solr_metrics_jvm_threads{item="tımed_waıtıng"}
solr_metrics_jvm_threads{item="waiting"}
solr_metrics_jvm_threads{item="waıtı]ng"}
# TYPE solr_met...>
at __randomizedtesting.SeedInfo.seed([5CD5A2E057FB3BDB:DDC5CFC92E5ED42D]:0)
at org.junit.Assert.assertEquals(Assert.java:117)
at org.junit.Assert.assertEquals(Assert.java:146)
at org.apache.solr.response.TestPrometheusResponseWriter.testPrometheusOutput(TestPrometheusResponseWriter.java:86)
at java.base/jdk.internal.reflect.DirectMethodHandleAccessor.invoke(DirectMethodHandleAccessor.java:103)
at java.base/java.lang.reflect.Method.invoke(Method.java:580)
at com.carrotsearch.randomizedtesting.RandomizedRunner.invoke(RandomizedRunner.java:1758)
at com.carrotsearch.randomizedtesting.RandomizedRunner$8.evaluate(RandomizedRunner.java:946)
at com.carrotsearch.randomizedtesting.RandomizedRunner$9.evaluate(RandomizedRunner.java:982)
at com.carrotsearch.randomizedtesting.RandomizedRunner$10.evaluate(RandomizedRunner.java:996)
at com.carrotsearch.randomizedtesting.rules.SystemPropertiesRestoreRule$1.evaluate(SystemPropertiesRestoreRule.java:80)
at org.junit.rules.RunRules.evaluate(RunRules.java:20)
at org.apache.lucene.tests.util.TestRuleSetupTeardownChained$1.evaluate(TestRuleSetupTeardownChained.java:48)
at org.apache.lucene.tests.util.AbstractBeforeAfterRule$1.evaluate(AbstractBeforeAfterRule.java:43)
at org.apache.lucene.tests.util.TestRuleThreadAndTestName$1.evaluate(TestRuleThreadAndTestName.java:45)
at org.apache.lucene.tests.util.TestRuleIgnoreAfterMaxFailures$1.evaluate(TestRuleIgnoreAfterMaxFailures.java:60)
at org.apache.lucene.tests.util.TestRuleMarkFailure$1.evaluate(TestRuleMarkFailure.java:44)
at org.junit.rules.RunRules.evaluate(RunRules.java:20)
at com.carrotsearch.randomizedtesting.rules.StatementAdapter.evaluate(StatementAdapter.java:36)
at com.carrotsearch.randomizedtesting.ThreadLeakControl$StatementRunner.run(ThreadLeakControl.java:390)
at com.carrotsearch.randomizedtesting.ThreadLeakControl.forkTimeoutingTask(ThreadLeakControl.java:843)
at com.carrotsearch.randomizedtesting.ThreadLeakControl$3.evaluate(ThreadLeakControl.java:490)
at com.carrotsearch.randomizedtesting.RandomizedRunner.runSingleTest(RandomizedRunner.java:955)
at com.carrotsearch.randomizedtesting.RandomizedRunner$5.evaluate(RandomizedRunner.java:840)
at com.carrotsearch.randomizedtesting.RandomizedRunner$6.evaluate(RandomizedRunner.java:891)
at com.carrotsearch.randomizedtesting.RandomizedRunner$7.evaluate(RandomizedRunner.java:902)
at org.junit.rules.ExternalResource$1.evaluate(ExternalResource.java:54)
at com.carrotsearch.randomizedtesting.rules.StatementAdapter.evaluate(StatementAdapter.java:36)
at com.carrotsearch.randomizedtesting.rules.StatementAdapter.evaluate(StatementAdapter.java:36)
at org.apache.lucene.tests.util.AbstractBeforeAfterRule$1.evaluate(AbstractBeforeAfterRule.java:43)
at com.carrotsearch.randomizedtesting.rules.SystemPropertiesRestoreRule$1.evaluate(SystemPropertiesRestoreRule.java:80)
at org.junit.rules.RunRules.evaluate(RunRules.java:20)
at org.apache.lucene.tests.util.AbstractBeforeAfterRule$1.evaluate(AbstractBeforeAfterRule.java:43)
at com.carrotsearch.randomizedtesting.rules.StatementAdapter.evaluate(StatementAdapter.java:36)
at org.apache.lucene.tests.util.TestRuleStoreClassName$1.evaluate(TestRuleStoreClassName.java:38)
at com.carrotsearch.randomizedtesting.rules.NoShadowingOrOverridesOnMethodsRule$1.evaluate(NoShadowingOrOverridesOnMethodsRule.java:40)
at com.carrotsearch.randomizedtesting.rules.NoShadowingOrOverridesOnMethodsRule$1.evaluate(NoShadowingOrOverridesOnMethodsRule.java:40)
at com.carrotsearch.randomizedtesting.rules.StatementAdapter.evaluate(StatementAdapter.java:36)
at com.carrotsearch.randomizedtesting.rules.StatementAdapter.evaluate(StatementAdapter.java:36)
at org.apache.lucene.tests.util.TestRuleAssertionsRequired$1.evaluate(TestRuleAssertionsRequired.java:53)
at org.apache.lucene.tests.util.AbstractBeforeAfterRule$1.evaluate(AbstractBeforeAfterRule.java:43)
at org.apache.lucene.tests.util.TestRuleMarkFailure$1.evaluate(TestRuleMarkFailure.java:44)
at org.apache.lucene.tests.util.TestRuleIgnoreAfterMaxFailures$1.evaluate(TestRuleIgnoreAfterMaxFailures.java:60)
at org.apache.lucene.tests.util.TestRuleIgnoreTestSuites$1.evaluate(TestRuleIgnoreTestSuites.java:47)
at org.junit.rules.RunRules.evaluate(RunRules.java:20)
at com.carrotsearch.randomizedtesting.rules.StatementAdapter.evaluate(StatementAdapter.java:36)
at com.carrotsearch.randomizedtesting.ThreadLeakControl$StatementRunner.run(ThreadLeakControl.java:390)
at com.carrotsearch.randomizedtesting.ThreadLeakControl.lambda$forkTimeoutingTask$0(ThreadLeakControl.java:850)
at java.base/java.lang.Thread.run(Thread.java:1583)
[JENKINS] Solr-main-MacOSX (64bit/hotspot/jdk-19) - Build # 4548 - Still unstable!
Posted by Policeman Jenkins Server <je...@thetaphi.de>.
Build: https://jenkins.thetaphi.de/job/Solr-main-MacOSX/4548/
Java: 64bit/hotspot/jdk-19 -XX:+UseCompressedOops -XX:+UseG1GC
3 tests failed.
FAILED: org.apache.solr.search.TestCoordinatorRole.testNRTRestart
Error Message:
org.apache.solr.client.solrj.SolrServerException: IOException occurred when talking to server at: http://127.0.0.1:52039/solr
Stack Trace:
org.apache.solr.client.solrj.SolrServerException: IOException occurred when talking to server at: http://127.0.0.1:52039/solr
at __randomizedtesting.SeedInfo.seed([751F1E6EDDF3A208:858BAEA57FEE70DE]:0)
at app//org.apache.solr.client.solrj.impl.HttpSolrClient.executeMethod(HttpSolrClient.java:729)
at app//org.apache.solr.client.solrj.impl.HttpSolrClient.request(HttpSolrClient.java:255)
at app//org.apache.solr.client.solrj.impl.HttpSolrClient.request(HttpSolrClient.java:234)
at app//org.apache.solr.client.solrj.SolrRequest.process(SolrRequest.java:229)
at app//org.apache.solr.client.solrj.SolrClient.commit(SolrClient.java:466)
at app//org.apache.solr.client.solrj.SolrClient.commit(SolrClient.java:423)
at app//org.apache.solr.search.TestCoordinatorRole.testNRTRestart(TestCoordinatorRole.java:311)
at java.base@19/jdk.internal.reflect.DirectMethodHandleAccessor.invoke(DirectMethodHandleAccessor.java:104)
at java.base@19/java.lang.reflect.Method.invoke(Method.java:578)
at app//com.carrotsearch.randomizedtesting.RandomizedRunner.invoke(RandomizedRunner.java:1758)
at app//com.carrotsearch.randomizedtesting.RandomizedRunner$8.evaluate(RandomizedRunner.java:946)
at app//com.carrotsearch.randomizedtesting.RandomizedRunner$9.evaluate(RandomizedRunner.java:982)
at app//com.carrotsearch.randomizedtesting.RandomizedRunner$10.evaluate(RandomizedRunner.java:996)
at app//com.carrotsearch.randomizedtesting.rules.SystemPropertiesRestoreRule$1.evaluate(SystemPropertiesRestoreRule.java:80)
at app//org.junit.rules.RunRules.evaluate(RunRules.java:20)
at app//org.apache.lucene.tests.util.TestRuleSetupTeardownChained$1.evaluate(TestRuleSetupTeardownChained.java:48)
at app//org.apache.lucene.tests.util.AbstractBeforeAfterRule$1.evaluate(AbstractBeforeAfterRule.java:43)
at app//org.apache.lucene.tests.util.TestRuleThreadAndTestName$1.evaluate(TestRuleThreadAndTestName.java:45)
at app//org.apache.lucene.tests.util.TestRuleIgnoreAfterMaxFailures$1.evaluate(TestRuleIgnoreAfterMaxFailures.java:60)
at app//org.apache.lucene.tests.util.TestRuleMarkFailure$1.evaluate(TestRuleMarkFailure.java:44)
at app//org.junit.rules.RunRules.evaluate(RunRules.java:20)
at app//com.carrotsearch.randomizedtesting.rules.StatementAdapter.evaluate(StatementAdapter.java:36)
at app//com.carrotsearch.randomizedtesting.ThreadLeakControl$StatementRunner.run(ThreadLeakControl.java:390)
at app//com.carrotsearch.randomizedtesting.ThreadLeakControl.forkTimeoutingTask(ThreadLeakControl.java:843)
at app//com.carrotsearch.randomizedtesting.ThreadLeakControl$3.evaluate(ThreadLeakControl.java:490)
at app//com.carrotsearch.randomizedtesting.RandomizedRunner.runSingleTest(RandomizedRunner.java:955)
at app//com.carrotsearch.randomizedtesting.RandomizedRunner$5.evaluate(RandomizedRunner.java:840)
at app//com.carrotsearch.randomizedtesting.RandomizedRunner$6.evaluate(RandomizedRunner.java:891)
at app//com.carrotsearch.randomizedtesting.RandomizedRunner$7.evaluate(RandomizedRunner.java:902)
at app//com.carrotsearch.randomizedtesting.rules.StatementAdapter.evaluate(StatementAdapter.java:36)
at app//com.carrotsearch.randomizedtesting.rules.StatementAdapter.evaluate(StatementAdapter.java:36)
at app//org.apache.lucene.tests.util.AbstractBeforeAfterRule$1.evaluate(AbstractBeforeAfterRule.java:43)
at app//com.carrotsearch.randomizedtesting.rules.SystemPropertiesRestoreRule$1.evaluate(SystemPropertiesRestoreRule.java:80)
at app//org.junit.rules.RunRules.evaluate(RunRules.java:20)
at app//org.apache.lucene.tests.util.AbstractBeforeAfterRule$1.evaluate(AbstractBeforeAfterRule.java:43)
at app//com.carrotsearch.randomizedtesting.rules.StatementAdapter.evaluate(StatementAdapter.java:36)
at app//org.apache.lucene.tests.util.TestRuleStoreClassName$1.evaluate(TestRuleStoreClassName.java:38)
at app//com.carrotsearch.randomizedtesting.rules.NoShadowingOrOverridesOnMethodsRule$1.evaluate(NoShadowingOrOverridesOnMethodsRule.java:40)
at app//com.carrotsearch.randomizedtesting.rules.NoShadowingOrOverridesOnMethodsRule$1.evaluate(NoShadowingOrOverridesOnMethodsRule.java:40)
at app//com.carrotsearch.randomizedtesting.rules.StatementAdapter.evaluate(StatementAdapter.java:36)
at app//com.carrotsearch.randomizedtesting.rules.StatementAdapter.evaluate(StatementAdapter.java:36)
at app//org.apache.lucene.tests.util.TestRuleAssertionsRequired$1.evaluate(TestRuleAssertionsRequired.java:53)
at app//org.apache.lucene.tests.util.AbstractBeforeAfterRule$1.evaluate(AbstractBeforeAfterRule.java:43)
at app//org.apache.lucene.tests.util.TestRuleMarkFailure$1.evaluate(TestRuleMarkFailure.java:44)
at app//org.apache.lucene.tests.util.TestRuleIgnoreAfterMaxFailures$1.evaluate(TestRuleIgnoreAfterMaxFailures.java:60)
at app//org.apache.lucene.tests.util.TestRuleIgnoreTestSuites$1.evaluate(TestRuleIgnoreTestSuites.java:47)
at app//org.junit.rules.RunRules.evaluate(RunRules.java:20)
at app//com.carrotsearch.randomizedtesting.rules.StatementAdapter.evaluate(StatementAdapter.java:36)
at app//com.carrotsearch.randomizedtesting.ThreadLeakControl$StatementRunner.run(ThreadLeakControl.java:390)
at app//com.carrotsearch.randomizedtesting.ThreadLeakControl.lambda$forkTimeoutingTask$0(ThreadLeakControl.java:850)
at java.base@19/java.lang.Thread.run(Thread.java:1589)
Caused by: org.apache.http.NoHttpResponseException: 127.0.0.1:52039 failed to respond
at app//org.apache.http.impl.conn.DefaultHttpResponseParser.parseHead(DefaultHttpResponseParser.java:141)
at app//org.apache.http.impl.conn.DefaultHttpResponseParser.parseHead(DefaultHttpResponseParser.java:56)
at app//org.apache.http.impl.io.AbstractMessageParser.parse(AbstractMessageParser.java:259)
at app//org.apache.http.impl.DefaultBHttpClientConnection.receiveResponseHeader(DefaultBHttpClientConnection.java:163)
at app//org.apache.http.impl.conn.CPoolProxy.receiveResponseHeader(CPoolProxy.java:157)
at app//org.apache.http.protocol.HttpRequestExecutor.doReceiveResponse(HttpRequestExecutor.java:273)
at app//org.apache.http.protocol.HttpRequestExecutor.execute(HttpRequestExecutor.java:125)
at app//org.apache.http.impl.execchain.MainClientExec.execute(MainClientExec.java:272)
at app//org.apache.http.impl.execchain.ProtocolExec.execute(ProtocolExec.java:186)
at app//org.apache.http.impl.execchain.RetryExec.execute(RetryExec.java:89)
at app//org.apache.http.impl.execchain.RedirectExec.execute(RedirectExec.java:110)
at app//org.apache.http.impl.client.InternalHttpClient.doExecute(InternalHttpClient.java:185)
at app//org.apache.http.impl.client.CloseableHttpClient.execute(CloseableHttpClient.java:83)
at app//org.apache.http.impl.client.CloseableHttpClient.execute(CloseableHttpClient.java:56)
at app//org.apache.solr.client.solrj.impl.HttpSolrClient.executeMethod(HttpSolrClient.java:573)
... 50 more
FAILED: org.apache.solr.handler.admin.MetricsHandlerTest.testPrometheusMetricsJvm
Error Message:
java.lang.AssertionError: expected:<0.0> but was:<2555904.0>
Stack Trace:
java.lang.AssertionError: expected:<0.0> but was:<2555904.0>
at __randomizedtesting.SeedInfo.seed([751F1E6EDDF3A208:7D55CD7B8EA3EF78]:0)
at org.junit.Assert.fail(Assert.java:89)
at org.junit.Assert.failNotEquals(Assert.java:835)
at org.junit.Assert.assertEquals(Assert.java:555)
at org.junit.Assert.assertEquals(Assert.java:685)
at org.apache.solr.handler.admin.MetricsHandlerTest.testPrometheusMetricsJvm(MetricsHandlerTest.java:925)
at java.base/jdk.internal.reflect.DirectMethodHandleAccessor.invoke(DirectMethodHandleAccessor.java:104)
at java.base/java.lang.reflect.Method.invoke(Method.java:578)
at com.carrotsearch.randomizedtesting.RandomizedRunner.invoke(RandomizedRunner.java:1758)
at com.carrotsearch.randomizedtesting.RandomizedRunner$8.evaluate(RandomizedRunner.java:946)
at com.carrotsearch.randomizedtesting.RandomizedRunner$9.evaluate(RandomizedRunner.java:982)
at com.carrotsearch.randomizedtesting.RandomizedRunner$10.evaluate(RandomizedRunner.java:996)
at com.carrotsearch.randomizedtesting.rules.SystemPropertiesRestoreRule$1.evaluate(SystemPropertiesRestoreRule.java:80)
at org.junit.rules.RunRules.evaluate(RunRules.java:20)
at org.apache.lucene.tests.util.TestRuleSetupTeardownChained$1.evaluate(TestRuleSetupTeardownChained.java:48)
at org.apache.lucene.tests.util.AbstractBeforeAfterRule$1.evaluate(AbstractBeforeAfterRule.java:43)
at org.apache.lucene.tests.util.TestRuleThreadAndTestName$1.evaluate(TestRuleThreadAndTestName.java:45)
at org.apache.lucene.tests.util.TestRuleIgnoreAfterMaxFailures$1.evaluate(TestRuleIgnoreAfterMaxFailures.java:60)
at org.apache.lucene.tests.util.TestRuleMarkFailure$1.evaluate(TestRuleMarkFailure.java:44)
at org.junit.rules.RunRules.evaluate(RunRules.java:20)
at com.carrotsearch.randomizedtesting.rules.StatementAdapter.evaluate(StatementAdapter.java:36)
at com.carrotsearch.randomizedtesting.ThreadLeakControl$StatementRunner.run(ThreadLeakControl.java:390)
at com.carrotsearch.randomizedtesting.ThreadLeakControl.forkTimeoutingTask(ThreadLeakControl.java:843)
at com.carrotsearch.randomizedtesting.ThreadLeakControl$3.evaluate(ThreadLeakControl.java:490)
at com.carrotsearch.randomizedtesting.RandomizedRunner.runSingleTest(RandomizedRunner.java:955)
at com.carrotsearch.randomizedtesting.RandomizedRunner$5.evaluate(RandomizedRunner.java:840)
at com.carrotsearch.randomizedtesting.RandomizedRunner$6.evaluate(RandomizedRunner.java:891)
at com.carrotsearch.randomizedtesting.RandomizedRunner$7.evaluate(RandomizedRunner.java:902)
at com.carrotsearch.randomizedtesting.rules.StatementAdapter.evaluate(StatementAdapter.java:36)
at com.carrotsearch.randomizedtesting.rules.StatementAdapter.evaluate(StatementAdapter.java:36)
at org.apache.lucene.tests.util.AbstractBeforeAfterRule$1.evaluate(AbstractBeforeAfterRule.java:43)
at com.carrotsearch.randomizedtesting.rules.SystemPropertiesRestoreRule$1.evaluate(SystemPropertiesRestoreRule.java:80)
at org.junit.rules.RunRules.evaluate(RunRules.java:20)
at org.apache.lucene.tests.util.AbstractBeforeAfterRule$1.evaluate(AbstractBeforeAfterRule.java:43)
at com.carrotsearch.randomizedtesting.rules.StatementAdapter.evaluate(StatementAdapter.java:36)
at org.apache.lucene.tests.util.TestRuleStoreClassName$1.evaluate(TestRuleStoreClassName.java:38)
at com.carrotsearch.randomizedtesting.rules.NoShadowingOrOverridesOnMethodsRule$1.evaluate(NoShadowingOrOverridesOnMethodsRule.java:40)
at com.carrotsearch.randomizedtesting.rules.NoShadowingOrOverridesOnMethodsRule$1.evaluate(NoShadowingOrOverridesOnMethodsRule.java:40)
at com.carrotsearch.randomizedtesting.rules.StatementAdapter.evaluate(StatementAdapter.java:36)
at com.carrotsearch.randomizedtesting.rules.StatementAdapter.evaluate(StatementAdapter.java:36)
at org.apache.lucene.tests.util.TestRuleAssertionsRequired$1.evaluate(TestRuleAssertionsRequired.java:53)
at org.apache.lucene.tests.util.AbstractBeforeAfterRule$1.evaluate(AbstractBeforeAfterRule.java:43)
at org.apache.lucene.tests.util.TestRuleMarkFailure$1.evaluate(TestRuleMarkFailure.java:44)
at org.apache.lucene.tests.util.TestRuleIgnoreAfterMaxFailures$1.evaluate(TestRuleIgnoreAfterMaxFailures.java:60)
at org.apache.lucene.tests.util.TestRuleIgnoreTestSuites$1.evaluate(TestRuleIgnoreTestSuites.java:47)
at org.junit.rules.RunRules.evaluate(RunRules.java:20)
at com.carrotsearch.randomizedtesting.rules.StatementAdapter.evaluate(StatementAdapter.java:36)
at com.carrotsearch.randomizedtesting.ThreadLeakControl$StatementRunner.run(ThreadLeakControl.java:390)
at com.carrotsearch.randomizedtesting.ThreadLeakControl.lambda$forkTimeoutingTask$0(ThreadLeakControl.java:850)
at java.base/java.lang.Thread.run(Thread.java:1589)
FAILED: org.apache.solr.response.TestPrometheusResponseWriter.testPrometheusOutput
Error Message:
org.junit.ComparisonFailure: expected:<...mmitted",space="Code[Cache"}
solr_metrics_jvm_memory_pools_bytes{item="committed",space="Compressed-Class-Space"}
solr_metrics_jvm_memory_pools_bytes{item="committed",space="Metaspace"}
solr_metrics_jvm_memory_pools_bytes{item="committed",space="PS-Eden-Space"}
solr_metrics_jvm_memory_pools_bytes{item="committed",space="PS-Old-Gen"}
solr_metrics_jvm_memory_pools_bytes{item="committed",space="PS-Survivor-Space"}
solr_metrics_jvm_memory_pools_bytes{item="init",space="CodeCache"}
solr_metrics_jvm_memory_pools_bytes{item="init",space="Compressed-Class-Space"}
solr_metrics_jvm_memory_pools_bytes{item="init",space="Metaspace"}
solr_metrics_jvm_memory_pools_bytes{item="init",space="PS-Eden-Space"}
solr_metrics_jvm_memory_pools_bytes{item="init",space="PS-Old-Gen"}
solr_metrics_jvm_memory_pools_bytes{item="init",space="PS-Survivor-Space"}
solr_metrics_jvm_memory_pools_bytes{item="max",space="CodeCache"}
solr_metrics_jvm_memory_pools_bytes{item="max",space="Compressed-Class-Space"}
solr_metrics_jvm_memory_pools_bytes{item="max",space="Metaspace"}
solr_metrics_jvm_memory_pools_bytes{item="max",space="PS-Eden-Space"}
solr_metrics_jvm_memory_pools_bytes{item="max",space="PS-Old-Gen"}
solr_metrics_jvm_memory_pools_bytes{item="max",space="PS-Survivor-Space"}
solr_metrics_jvm_memory_pools_bytes{item="usage",space="CodeCache"}
solr_metrics_jvm_memory_pools_bytes{item="usage",space="Compressed-Class-Space"}
solr_metrics_jvm_memory_pools_bytes{item="usage",space="Metaspace"}
solr_metrics_jvm_memory_pools_bytes{item="usage",space="PS-Eden-Space"}
solr_metrics_jvm_memory_pools_bytes{item="usage",space="PS-Old-Gen"}
solr_metrics_jvm_memory_pools_bytes{item="usage",space="PS-Survivor-Space"}
solr_metrics_jvm_memory_pools_bytes{item="used",space="CodeCache"}
solr_metrics_jvm_memory_pools_bytes{item="used",space="Compressed-Class-Space"}
solr_metrics_jvm_memory_pools_bytes{item="used",space="Metaspace"}
solr_metrics_jvm_memory_pools_bytes{item="used",space="PS-Eden-Space"}
solr_metrics_jvm_memory_pools_bytes{item="used",space="PS-Old-Gen"}
solr_metrics_jvm_memory_pools_bytes{item="used",space="PS-Survivor-Space"}
solr_metrics_jvm_memory_pools_bytes{item="used-after-gc",space="PS-Eden-Space"}
solr_metrics_jvm_memory_pools_bytes{item="used-after-gc",space="PS-Old-Gen"}
solr_metrics_jvm_memory_pools_bytes{item="used-after-gc",space="PS-Survivor-Space"}
# TYPE solr_metrics_jvm_threads gauge
solr_metrics_jvm_threads{item="blocked"}
solr_metrics_jvm_threads{item="count"}
solr_metrics_jvm_threads{item="daemon"}
solr_metrics_jvm_threads{item="deadlock"}
solr_metrics_jvm_threads{item="new"}
solr_metrics_jvm_threads{item="peak"}
solr_metrics_jvm_threads{item="runnable"}
solr_metrics_jvm_threads{item="terminated"}
solr_metrics_jvm_threads{item="timed_waiting"}
solr_metrics_jvm_threads{item="total_started"}
solr_metrics_jvm_threads{item="waiti]ng"}
# TYPE solr_met...> but was:<...mmitted",space="Code[Heap-'non-nmethods'"}
solr_metrics_jvm_memory_pools_bytes{item="committed",space="CodeHeap-'non-profiled-nmethods'"}
solr_metrics_jvm_memory_pools_bytes{item="committed",space="CodeHeap-'profiled-nmethods'"}
solr_metrics_jvm_memory_pools_bytes{item="committed",space="Compressed-Class-Space"}
solr_metrics_jvm_memory_pools_bytes{item="committed",space="G1-Eden-Space"}
solr_metrics_jvm_memory_pools_bytes{item="committed",space="G1-Old-Gen"}
solr_metrics_jvm_memory_pools_bytes{item="committed",space="G1-Survivor-Space"}
solr_metrics_jvm_memory_pools_bytes{item="committed",space="Metaspace"}
solr_metrics_jvm_memory_pools_bytes{item="init",space="CodeHeap-'non-nmethods'"}
solr_metrics_jvm_memory_pools_bytes{item="init",space="CodeHeap-'non-profiled-nmethods'"}
solr_metrics_jvm_memory_pools_bytes{item="init",space="CodeHeap-'profiled-nmethods'"}
solr_metrics_jvm_memory_pools_bytes{item="init",space="Compressed-Class-Space"}
solr_metrics_jvm_memory_pools_bytes{item="init",space="G1-Eden-Space"}
solr_metrics_jvm_memory_pools_bytes{item="init",space="G1-Old-Gen"}
solr_metrics_jvm_memory_pools_bytes{item="init",space="G1-Survivor-Space"}
solr_metrics_jvm_memory_pools_bytes{item="init",space="Metaspace"}
solr_metrics_jvm_memory_pools_bytes{item="max",space="CodeHeap-'non-nmethods'"}
solr_metrics_jvm_memory_pools_bytes{item="max",space="CodeHeap-'non-profiled-nmethods'"}
solr_metrics_jvm_memory_pools_bytes{item="max",space="CodeHeap-'profiled-nmethods'"}
solr_metrics_jvm_memory_pools_bytes{item="max",space="Compressed-Class-Space"}
solr_metrics_jvm_memory_pools_bytes{item="max",space="G1-Eden-Space"}
solr_metrics_jvm_memory_pools_bytes{item="max",space="G1-Old-Gen"}
solr_metrics_jvm_memory_pools_bytes{item="max",space="G1-Survivor-Space"}
solr_metrics_jvm_memory_pools_bytes{item="max",space="Metaspace"}
solr_metrics_jvm_memory_pools_bytes{item="usage",space="CodeHeap-'non-nmethods'"}
solr_metrics_jvm_memory_pools_bytes{item="usage",space="CodeHeap-'non-profiled-nmethods'"}
solr_metrics_jvm_memory_pools_bytes{item="usage",space="CodeHeap-'profiled-nmethods'"}
solr_metrics_jvm_memory_pools_bytes{item="usage",space="Compressed-Class-Space"}
solr_metrics_jvm_memory_pools_bytes{item="usage",space="G1-Eden-Space"}
solr_metrics_jvm_memory_pools_bytes{item="usage",space="G1-Old-Gen"}
solr_metrics_jvm_memory_pools_bytes{item="usage",space="G1-Survivor-Space"}
solr_metrics_jvm_memory_pools_bytes{item="usage",space="Metaspace"}
solr_metrics_jvm_memory_pools_bytes{item="used",space="CodeHeap-'non-nmethods'"}
solr_metrics_jvm_memory_pools_bytes{item="used",space="CodeHeap-'non-profiled-nmethods'"}
solr_metrics_jvm_memory_pools_bytes{item="used",space="CodeHeap-'profiled-nmethods'"}
solr_metrics_jvm_memory_pools_bytes{item="used",space="Compressed-Class-Space"}
solr_metrics_jvm_memory_pools_bytes{item="used",space="G1-Eden-Space"}
solr_metrics_jvm_memory_pools_bytes{item="used",space="G1-Old-Gen"}
solr_metrics_jvm_memory_pools_bytes{item="used",space="G1-Survivor-Space"}
solr_metrics_jvm_memory_pools_bytes{item="used",space="Metaspace"}
solr_metrics_jvm_memory_pools_bytes{item="used-after-gc",space="G1-Eden-Space"}
solr_metrics_jvm_memory_pools_bytes{item="used-after-gc",space="G1-Old-Gen"}
solr_metrics_jvm_memory_pools_bytes{item="used-after-gc",space="G1-Survivor-Space"}
# TYPE solr_metrics_jvm_threads gauge
solr_metrics_jvm_threads{item="blocked"}
solr_metrics_jvm_threads{item="count"}
solr_metrics_jvm_threads{item="daemon"}
solr_metrics_jvm_threads{item="deadlock"}
solr_metrics_jvm_threads{item="new"}
solr_metrics_jvm_threads{item="peak"}
solr_metrics_jvm_threads{item="runnable"}
solr_metrics_jvm_threads{item="terminated"}
solr_metrics_jvm_threads{item="termınated"}
solr_metrics_jvm_threads{item="timed_waiting"}
solr_metrics_jvm_threads{item="total_started"}
solr_metrics_jvm_threads{item="tımed_waıtıng"}
solr_metrics_jvm_threads{item="waiting"}
solr_metrics_jvm_threads{item="waıtı]ng"}
# TYPE solr_met...>
Stack Trace:
org.junit.ComparisonFailure: expected:<...mmitted",space="Code[Cache"}
solr_metrics_jvm_memory_pools_bytes{item="committed",space="Compressed-Class-Space"}
solr_metrics_jvm_memory_pools_bytes{item="committed",space="Metaspace"}
solr_metrics_jvm_memory_pools_bytes{item="committed",space="PS-Eden-Space"}
solr_metrics_jvm_memory_pools_bytes{item="committed",space="PS-Old-Gen"}
solr_metrics_jvm_memory_pools_bytes{item="committed",space="PS-Survivor-Space"}
solr_metrics_jvm_memory_pools_bytes{item="init",space="CodeCache"}
solr_metrics_jvm_memory_pools_bytes{item="init",space="Compressed-Class-Space"}
solr_metrics_jvm_memory_pools_bytes{item="init",space="Metaspace"}
solr_metrics_jvm_memory_pools_bytes{item="init",space="PS-Eden-Space"}
solr_metrics_jvm_memory_pools_bytes{item="init",space="PS-Old-Gen"}
solr_metrics_jvm_memory_pools_bytes{item="init",space="PS-Survivor-Space"}
solr_metrics_jvm_memory_pools_bytes{item="max",space="CodeCache"}
solr_metrics_jvm_memory_pools_bytes{item="max",space="Compressed-Class-Space"}
solr_metrics_jvm_memory_pools_bytes{item="max",space="Metaspace"}
solr_metrics_jvm_memory_pools_bytes{item="max",space="PS-Eden-Space"}
solr_metrics_jvm_memory_pools_bytes{item="max",space="PS-Old-Gen"}
solr_metrics_jvm_memory_pools_bytes{item="max",space="PS-Survivor-Space"}
solr_metrics_jvm_memory_pools_bytes{item="usage",space="CodeCache"}
solr_metrics_jvm_memory_pools_bytes{item="usage",space="Compressed-Class-Space"}
solr_metrics_jvm_memory_pools_bytes{item="usage",space="Metaspace"}
solr_metrics_jvm_memory_pools_bytes{item="usage",space="PS-Eden-Space"}
solr_metrics_jvm_memory_pools_bytes{item="usage",space="PS-Old-Gen"}
solr_metrics_jvm_memory_pools_bytes{item="usage",space="PS-Survivor-Space"}
solr_metrics_jvm_memory_pools_bytes{item="used",space="CodeCache"}
solr_metrics_jvm_memory_pools_bytes{item="used",space="Compressed-Class-Space"}
solr_metrics_jvm_memory_pools_bytes{item="used",space="Metaspace"}
solr_metrics_jvm_memory_pools_bytes{item="used",space="PS-Eden-Space"}
solr_metrics_jvm_memory_pools_bytes{item="used",space="PS-Old-Gen"}
solr_metrics_jvm_memory_pools_bytes{item="used",space="PS-Survivor-Space"}
solr_metrics_jvm_memory_pools_bytes{item="used-after-gc",space="PS-Eden-Space"}
solr_metrics_jvm_memory_pools_bytes{item="used-after-gc",space="PS-Old-Gen"}
solr_metrics_jvm_memory_pools_bytes{item="used-after-gc",space="PS-Survivor-Space"}
# TYPE solr_metrics_jvm_threads gauge
solr_metrics_jvm_threads{item="blocked"}
solr_metrics_jvm_threads{item="count"}
solr_metrics_jvm_threads{item="daemon"}
solr_metrics_jvm_threads{item="deadlock"}
solr_metrics_jvm_threads{item="new"}
solr_metrics_jvm_threads{item="peak"}
solr_metrics_jvm_threads{item="runnable"}
solr_metrics_jvm_threads{item="terminated"}
solr_metrics_jvm_threads{item="timed_waiting"}
solr_metrics_jvm_threads{item="total_started"}
solr_metrics_jvm_threads{item="waiti]ng"}
# TYPE solr_met...> but was:<...mmitted",space="Code[Heap-'non-nmethods'"}
solr_metrics_jvm_memory_pools_bytes{item="committed",space="CodeHeap-'non-profiled-nmethods'"}
solr_metrics_jvm_memory_pools_bytes{item="committed",space="CodeHeap-'profiled-nmethods'"}
solr_metrics_jvm_memory_pools_bytes{item="committed",space="Compressed-Class-Space"}
solr_metrics_jvm_memory_pools_bytes{item="committed",space="G1-Eden-Space"}
solr_metrics_jvm_memory_pools_bytes{item="committed",space="G1-Old-Gen"}
solr_metrics_jvm_memory_pools_bytes{item="committed",space="G1-Survivor-Space"}
solr_metrics_jvm_memory_pools_bytes{item="committed",space="Metaspace"}
solr_metrics_jvm_memory_pools_bytes{item="init",space="CodeHeap-'non-nmethods'"}
solr_metrics_jvm_memory_pools_bytes{item="init",space="CodeHeap-'non-profiled-nmethods'"}
solr_metrics_jvm_memory_pools_bytes{item="init",space="CodeHeap-'profiled-nmethods'"}
solr_metrics_jvm_memory_pools_bytes{item="init",space="Compressed-Class-Space"}
solr_metrics_jvm_memory_pools_bytes{item="init",space="G1-Eden-Space"}
solr_metrics_jvm_memory_pools_bytes{item="init",space="G1-Old-Gen"}
solr_metrics_jvm_memory_pools_bytes{item="init",space="G1-Survivor-Space"}
solr_metrics_jvm_memory_pools_bytes{item="init",space="Metaspace"}
solr_metrics_jvm_memory_pools_bytes{item="max",space="CodeHeap-'non-nmethods'"}
solr_metrics_jvm_memory_pools_bytes{item="max",space="CodeHeap-'non-profiled-nmethods'"}
solr_metrics_jvm_memory_pools_bytes{item="max",space="CodeHeap-'profiled-nmethods'"}
solr_metrics_jvm_memory_pools_bytes{item="max",space="Compressed-Class-Space"}
solr_metrics_jvm_memory_pools_bytes{item="max",space="G1-Eden-Space"}
solr_metrics_jvm_memory_pools_bytes{item="max",space="G1-Old-Gen"}
solr_metrics_jvm_memory_pools_bytes{item="max",space="G1-Survivor-Space"}
solr_metrics_jvm_memory_pools_bytes{item="max",space="Metaspace"}
solr_metrics_jvm_memory_pools_bytes{item="usage",space="CodeHeap-'non-nmethods'"}
solr_metrics_jvm_memory_pools_bytes{item="usage",space="CodeHeap-'non-profiled-nmethods'"}
solr_metrics_jvm_memory_pools_bytes{item="usage",space="CodeHeap-'profiled-nmethods'"}
solr_metrics_jvm_memory_pools_bytes{item="usage",space="Compressed-Class-Space"}
solr_metrics_jvm_memory_pools_bytes{item="usage",space="G1-Eden-Space"}
solr_metrics_jvm_memory_pools_bytes{item="usage",space="G1-Old-Gen"}
solr_metrics_jvm_memory_pools_bytes{item="usage",space="G1-Survivor-Space"}
solr_metrics_jvm_memory_pools_bytes{item="usage",space="Metaspace"}
solr_metrics_jvm_memory_pools_bytes{item="used",space="CodeHeap-'non-nmethods'"}
solr_metrics_jvm_memory_pools_bytes{item="used",space="CodeHeap-'non-profiled-nmethods'"}
solr_metrics_jvm_memory_pools_bytes{item="used",space="CodeHeap-'profiled-nmethods'"}
solr_metrics_jvm_memory_pools_bytes{item="used",space="Compressed-Class-Space"}
solr_metrics_jvm_memory_pools_bytes{item="used",space="G1-Eden-Space"}
solr_metrics_jvm_memory_pools_bytes{item="used",space="G1-Old-Gen"}
solr_metrics_jvm_memory_pools_bytes{item="used",space="G1-Survivor-Space"}
solr_metrics_jvm_memory_pools_bytes{item="used",space="Metaspace"}
solr_metrics_jvm_memory_pools_bytes{item="used-after-gc",space="G1-Eden-Space"}
solr_metrics_jvm_memory_pools_bytes{item="used-after-gc",space="G1-Old-Gen"}
solr_metrics_jvm_memory_pools_bytes{item="used-after-gc",space="G1-Survivor-Space"}
# TYPE solr_metrics_jvm_threads gauge
solr_metrics_jvm_threads{item="blocked"}
solr_metrics_jvm_threads{item="count"}
solr_metrics_jvm_threads{item="daemon"}
solr_metrics_jvm_threads{item="deadlock"}
solr_metrics_jvm_threads{item="new"}
solr_metrics_jvm_threads{item="peak"}
solr_metrics_jvm_threads{item="runnable"}
solr_metrics_jvm_threads{item="terminated"}
solr_metrics_jvm_threads{item="termınated"}
solr_metrics_jvm_threads{item="timed_waiting"}
solr_metrics_jvm_threads{item="total_started"}
solr_metrics_jvm_threads{item="tımed_waıtıng"}
solr_metrics_jvm_threads{item="waiting"}
solr_metrics_jvm_threads{item="waıtı]ng"}
# TYPE solr_met...>
at __randomizedtesting.SeedInfo.seed([751F1E6EDDF3A208:F40F7347A4564DFE]:0)
at org.junit.Assert.assertEquals(Assert.java:117)
at org.junit.Assert.assertEquals(Assert.java:146)
at org.apache.solr.response.TestPrometheusResponseWriter.testPrometheusOutput(TestPrometheusResponseWriter.java:86)
at java.base/jdk.internal.reflect.DirectMethodHandleAccessor.invoke(DirectMethodHandleAccessor.java:104)
at java.base/java.lang.reflect.Method.invoke(Method.java:578)
at com.carrotsearch.randomizedtesting.RandomizedRunner.invoke(RandomizedRunner.java:1758)
at com.carrotsearch.randomizedtesting.RandomizedRunner$8.evaluate(RandomizedRunner.java:946)
at com.carrotsearch.randomizedtesting.RandomizedRunner$9.evaluate(RandomizedRunner.java:982)
at com.carrotsearch.randomizedtesting.RandomizedRunner$10.evaluate(RandomizedRunner.java:996)
at com.carrotsearch.randomizedtesting.rules.SystemPropertiesRestoreRule$1.evaluate(SystemPropertiesRestoreRule.java:80)
at org.junit.rules.RunRules.evaluate(RunRules.java:20)
at org.apache.lucene.tests.util.TestRuleSetupTeardownChained$1.evaluate(TestRuleSetupTeardownChained.java:48)
at org.apache.lucene.tests.util.AbstractBeforeAfterRule$1.evaluate(AbstractBeforeAfterRule.java:43)
at org.apache.lucene.tests.util.TestRuleThreadAndTestName$1.evaluate(TestRuleThreadAndTestName.java:45)
at org.apache.lucene.tests.util.TestRuleIgnoreAfterMaxFailures$1.evaluate(TestRuleIgnoreAfterMaxFailures.java:60)
at org.apache.lucene.tests.util.TestRuleMarkFailure$1.evaluate(TestRuleMarkFailure.java:44)
at org.junit.rules.RunRules.evaluate(RunRules.java:20)
at com.carrotsearch.randomizedtesting.rules.StatementAdapter.evaluate(StatementAdapter.java:36)
at com.carrotsearch.randomizedtesting.ThreadLeakControl$StatementRunner.run(ThreadLeakControl.java:390)
at com.carrotsearch.randomizedtesting.ThreadLeakControl.forkTimeoutingTask(ThreadLeakControl.java:843)
at com.carrotsearch.randomizedtesting.ThreadLeakControl$3.evaluate(ThreadLeakControl.java:490)
at com.carrotsearch.randomizedtesting.RandomizedRunner.runSingleTest(RandomizedRunner.java:955)
at com.carrotsearch.randomizedtesting.RandomizedRunner$5.evaluate(RandomizedRunner.java:840)
at com.carrotsearch.randomizedtesting.RandomizedRunner$6.evaluate(RandomizedRunner.java:891)
at com.carrotsearch.randomizedtesting.RandomizedRunner$7.evaluate(RandomizedRunner.java:902)
at org.junit.rules.ExternalResource$1.evaluate(ExternalResource.java:54)
at com.carrotsearch.randomizedtesting.rules.StatementAdapter.evaluate(StatementAdapter.java:36)
at com.carrotsearch.randomizedtesting.rules.StatementAdapter.evaluate(StatementAdapter.java:36)
at org.apache.lucene.tests.util.AbstractBeforeAfterRule$1.evaluate(AbstractBeforeAfterRule.java:43)
at com.carrotsearch.randomizedtesting.rules.SystemPropertiesRestoreRule$1.evaluate(SystemPropertiesRestoreRule.java:80)
at org.junit.rules.RunRules.evaluate(RunRules.java:20)
at org.apache.lucene.tests.util.AbstractBeforeAfterRule$1.evaluate(AbstractBeforeAfterRule.java:43)
at com.carrotsearch.randomizedtesting.rules.StatementAdapter.evaluate(StatementAdapter.java:36)
at org.apache.lucene.tests.util.TestRuleStoreClassName$1.evaluate(TestRuleStoreClassName.java:38)
at com.carrotsearch.randomizedtesting.rules.NoShadowingOrOverridesOnMethodsRule$1.evaluate(NoShadowingOrOverridesOnMethodsRule.java:40)
at com.carrotsearch.randomizedtesting.rules.NoShadowingOrOverridesOnMethodsRule$1.evaluate(NoShadowingOrOverridesOnMethodsRule.java:40)
at com.carrotsearch.randomizedtesting.rules.StatementAdapter.evaluate(StatementAdapter.java:36)
at com.carrotsearch.randomizedtesting.rules.StatementAdapter.evaluate(StatementAdapter.java:36)
at org.apache.lucene.tests.util.TestRuleAssertionsRequired$1.evaluate(TestRuleAssertionsRequired.java:53)
at org.apache.lucene.tests.util.AbstractBeforeAfterRule$1.evaluate(AbstractBeforeAfterRule.java:43)
at org.apache.lucene.tests.util.TestRuleMarkFailure$1.evaluate(TestRuleMarkFailure.java:44)
at org.apache.lucene.tests.util.TestRuleIgnoreAfterMaxFailures$1.evaluate(TestRuleIgnoreAfterMaxFailures.java:60)
at org.apache.lucene.tests.util.TestRuleIgnoreTestSuites$1.evaluate(TestRuleIgnoreTestSuites.java:47)
at org.junit.rules.RunRules.evaluate(RunRules.java:20)
at com.carrotsearch.randomizedtesting.rules.StatementAdapter.evaluate(StatementAdapter.java:36)
at com.carrotsearch.randomizedtesting.ThreadLeakControl$StatementRunner.run(ThreadLeakControl.java:390)
at com.carrotsearch.randomizedtesting.ThreadLeakControl.lambda$forkTimeoutingTask$0(ThreadLeakControl.java:850)
at java.base/java.lang.Thread.run(Thread.java:1589)
[JENKINS] Solr-main-MacOSX (64bit/hotspot/jdk-17.0.9) - Build # 4547 - Failure!
Posted by Policeman Jenkins Server <je...@thetaphi.de>.
Build: https://jenkins.thetaphi.de/job/Solr-main-MacOSX/4547/
Java: 64bit/hotspot/jdk-17.0.9 -XX:+UseCompressedOops -XX:+UseSerialGC
3 tests failed.
FAILED: org.apache.solr.search.TestCoordinatorRole.testNRTRestart
Error Message:
org.apache.solr.client.solrj.SolrServerException: IOException occurred when talking to server at: http://127.0.0.1:63047/solr
Stack Trace:
org.apache.solr.client.solrj.SolrServerException: IOException occurred when talking to server at: http://127.0.0.1:63047/solr
at __randomizedtesting.SeedInfo.seed([5F9282135A82103D:AF0632D8F89FC2EB]:0)
at app//org.apache.solr.client.solrj.impl.HttpSolrClient.executeMethod(HttpSolrClient.java:729)
at app//org.apache.solr.client.solrj.impl.HttpSolrClient.request(HttpSolrClient.java:255)
at app//org.apache.solr.client.solrj.impl.HttpSolrClient.request(HttpSolrClient.java:234)
at app//org.apache.solr.client.solrj.SolrRequest.process(SolrRequest.java:229)
at app//org.apache.solr.client.solrj.SolrClient.commit(SolrClient.java:466)
at app//org.apache.solr.client.solrj.SolrClient.commit(SolrClient.java:423)
at app//org.apache.solr.search.TestCoordinatorRole.testNRTRestart(TestCoordinatorRole.java:311)
at java.base@17.0.9/jdk.internal.reflect.NativeMethodAccessorImpl.invoke0(Native Method)
at java.base@17.0.9/jdk.internal.reflect.NativeMethodAccessorImpl.invoke(NativeMethodAccessorImpl.java:77)
at java.base@17.0.9/jdk.internal.reflect.DelegatingMethodAccessorImpl.invoke(DelegatingMethodAccessorImpl.java:43)
at java.base@17.0.9/java.lang.reflect.Method.invoke(Method.java:568)
at app//com.carrotsearch.randomizedtesting.RandomizedRunner.invoke(RandomizedRunner.java:1758)
at app//com.carrotsearch.randomizedtesting.RandomizedRunner$8.evaluate(RandomizedRunner.java:946)
at app//com.carrotsearch.randomizedtesting.RandomizedRunner$9.evaluate(RandomizedRunner.java:982)
at app//com.carrotsearch.randomizedtesting.RandomizedRunner$10.evaluate(RandomizedRunner.java:996)
at app//com.carrotsearch.randomizedtesting.rules.SystemPropertiesRestoreRule$1.evaluate(SystemPropertiesRestoreRule.java:80)
at app//org.junit.rules.RunRules.evaluate(RunRules.java:20)
at app//org.apache.lucene.tests.util.TestRuleSetupTeardownChained$1.evaluate(TestRuleSetupTeardownChained.java:48)
at app//org.apache.lucene.tests.util.AbstractBeforeAfterRule$1.evaluate(AbstractBeforeAfterRule.java:43)
at app//org.apache.lucene.tests.util.TestRuleThreadAndTestName$1.evaluate(TestRuleThreadAndTestName.java:45)
at app//org.apache.lucene.tests.util.TestRuleIgnoreAfterMaxFailures$1.evaluate(TestRuleIgnoreAfterMaxFailures.java:60)
at app//org.apache.lucene.tests.util.TestRuleMarkFailure$1.evaluate(TestRuleMarkFailure.java:44)
at app//org.junit.rules.RunRules.evaluate(RunRules.java:20)
at app//com.carrotsearch.randomizedtesting.rules.StatementAdapter.evaluate(StatementAdapter.java:36)
at app//com.carrotsearch.randomizedtesting.ThreadLeakControl$StatementRunner.run(ThreadLeakControl.java:390)
at app//com.carrotsearch.randomizedtesting.ThreadLeakControl.forkTimeoutingTask(ThreadLeakControl.java:843)
at app//com.carrotsearch.randomizedtesting.ThreadLeakControl$3.evaluate(ThreadLeakControl.java:490)
at app//com.carrotsearch.randomizedtesting.RandomizedRunner.runSingleTest(RandomizedRunner.java:955)
at app//com.carrotsearch.randomizedtesting.RandomizedRunner$5.evaluate(RandomizedRunner.java:840)
at app//com.carrotsearch.randomizedtesting.RandomizedRunner$6.evaluate(RandomizedRunner.java:891)
at app//com.carrotsearch.randomizedtesting.RandomizedRunner$7.evaluate(RandomizedRunner.java:902)
at app//com.carrotsearch.randomizedtesting.rules.StatementAdapter.evaluate(StatementAdapter.java:36)
at app//com.carrotsearch.randomizedtesting.rules.StatementAdapter.evaluate(StatementAdapter.java:36)
at app//org.apache.lucene.tests.util.AbstractBeforeAfterRule$1.evaluate(AbstractBeforeAfterRule.java:43)
at app//com.carrotsearch.randomizedtesting.rules.SystemPropertiesRestoreRule$1.evaluate(SystemPropertiesRestoreRule.java:80)
at app//org.junit.rules.RunRules.evaluate(RunRules.java:20)
at app//org.apache.lucene.tests.util.AbstractBeforeAfterRule$1.evaluate(AbstractBeforeAfterRule.java:43)
at app//com.carrotsearch.randomizedtesting.rules.StatementAdapter.evaluate(StatementAdapter.java:36)
at app//org.apache.lucene.tests.util.TestRuleStoreClassName$1.evaluate(TestRuleStoreClassName.java:38)
at app//com.carrotsearch.randomizedtesting.rules.NoShadowingOrOverridesOnMethodsRule$1.evaluate(NoShadowingOrOverridesOnMethodsRule.java:40)
at app//com.carrotsearch.randomizedtesting.rules.NoShadowingOrOverridesOnMethodsRule$1.evaluate(NoShadowingOrOverridesOnMethodsRule.java:40)
at app//com.carrotsearch.randomizedtesting.rules.StatementAdapter.evaluate(StatementAdapter.java:36)
at app//com.carrotsearch.randomizedtesting.rules.StatementAdapter.evaluate(StatementAdapter.java:36)
at app//org.apache.lucene.tests.util.TestRuleAssertionsRequired$1.evaluate(TestRuleAssertionsRequired.java:53)
at app//org.apache.lucene.tests.util.AbstractBeforeAfterRule$1.evaluate(AbstractBeforeAfterRule.java:43)
at app//org.apache.lucene.tests.util.TestRuleMarkFailure$1.evaluate(TestRuleMarkFailure.java:44)
at app//org.apache.lucene.tests.util.TestRuleIgnoreAfterMaxFailures$1.evaluate(TestRuleIgnoreAfterMaxFailures.java:60)
at app//org.apache.lucene.tests.util.TestRuleIgnoreTestSuites$1.evaluate(TestRuleIgnoreTestSuites.java:47)
at app//org.junit.rules.RunRules.evaluate(RunRules.java:20)
at app//com.carrotsearch.randomizedtesting.rules.StatementAdapter.evaluate(StatementAdapter.java:36)
at app//com.carrotsearch.randomizedtesting.ThreadLeakControl$StatementRunner.run(ThreadLeakControl.java:390)
at app//com.carrotsearch.randomizedtesting.ThreadLeakControl.lambda$forkTimeoutingTask$0(ThreadLeakControl.java:850)
at java.base@17.0.9/java.lang.Thread.run(Thread.java:840)
Caused by: org.apache.http.NoHttpResponseException: 127.0.0.1:63047 failed to respond
at app//org.apache.http.impl.conn.DefaultHttpResponseParser.parseHead(DefaultHttpResponseParser.java:141)
at app//org.apache.http.impl.conn.DefaultHttpResponseParser.parseHead(DefaultHttpResponseParser.java:56)
at app//org.apache.http.impl.io.AbstractMessageParser.parse(AbstractMessageParser.java:259)
at app//org.apache.http.impl.DefaultBHttpClientConnection.receiveResponseHeader(DefaultBHttpClientConnection.java:163)
at app//org.apache.http.impl.conn.CPoolProxy.receiveResponseHeader(CPoolProxy.java:157)
at app//org.apache.http.protocol.HttpRequestExecutor.doReceiveResponse(HttpRequestExecutor.java:273)
at app//org.apache.http.protocol.HttpRequestExecutor.execute(HttpRequestExecutor.java:125)
at app//org.apache.http.impl.execchain.MainClientExec.execute(MainClientExec.java:272)
at app//org.apache.http.impl.execchain.ProtocolExec.execute(ProtocolExec.java:186)
at app//org.apache.http.impl.execchain.RetryExec.execute(RetryExec.java:89)
at app//org.apache.http.impl.execchain.RedirectExec.execute(RedirectExec.java:110)
at app//org.apache.http.impl.client.InternalHttpClient.doExecute(InternalHttpClient.java:185)
at app//org.apache.http.impl.client.CloseableHttpClient.execute(CloseableHttpClient.java:83)
at app//org.apache.http.impl.client.CloseableHttpClient.execute(CloseableHttpClient.java:56)
at app//org.apache.solr.client.solrj.impl.HttpSolrClient.executeMethod(HttpSolrClient.java:573)
... 52 more
FAILED: org.apache.solr.handler.admin.MetricsHandlerTest.testPrometheusMetricsJvm
Error Message:
java.lang.AssertionError: expected:<0.0> but was:<2555904.0>
Stack Trace:
java.lang.AssertionError: expected:<0.0> but was:<2555904.0>
at __randomizedtesting.SeedInfo.seed([5F9282135A82103D:57D8510609D25D4D]:0)
at org.junit.Assert.fail(Assert.java:89)
at org.junit.Assert.failNotEquals(Assert.java:835)
at org.junit.Assert.assertEquals(Assert.java:555)
at org.junit.Assert.assertEquals(Assert.java:685)
at org.apache.solr.handler.admin.MetricsHandlerTest.testPrometheusMetricsJvm(MetricsHandlerTest.java:925)
at java.base/jdk.internal.reflect.NativeMethodAccessorImpl.invoke0(Native Method)
at java.base/jdk.internal.reflect.NativeMethodAccessorImpl.invoke(NativeMethodAccessorImpl.java:77)
at java.base/jdk.internal.reflect.DelegatingMethodAccessorImpl.invoke(DelegatingMethodAccessorImpl.java:43)
at java.base/java.lang.reflect.Method.invoke(Method.java:568)
at com.carrotsearch.randomizedtesting.RandomizedRunner.invoke(RandomizedRunner.java:1758)
at com.carrotsearch.randomizedtesting.RandomizedRunner$8.evaluate(RandomizedRunner.java:946)
at com.carrotsearch.randomizedtesting.RandomizedRunner$9.evaluate(RandomizedRunner.java:982)
at com.carrotsearch.randomizedtesting.RandomizedRunner$10.evaluate(RandomizedRunner.java:996)
at com.carrotsearch.randomizedtesting.rules.SystemPropertiesRestoreRule$1.evaluate(SystemPropertiesRestoreRule.java:80)
at org.junit.rules.RunRules.evaluate(RunRules.java:20)
at org.apache.lucene.tests.util.TestRuleSetupTeardownChained$1.evaluate(TestRuleSetupTeardownChained.java:48)
at org.apache.lucene.tests.util.AbstractBeforeAfterRule$1.evaluate(AbstractBeforeAfterRule.java:43)
at org.apache.lucene.tests.util.TestRuleThreadAndTestName$1.evaluate(TestRuleThreadAndTestName.java:45)
at org.apache.lucene.tests.util.TestRuleIgnoreAfterMaxFailures$1.evaluate(TestRuleIgnoreAfterMaxFailures.java:60)
at org.apache.lucene.tests.util.TestRuleMarkFailure$1.evaluate(TestRuleMarkFailure.java:44)
at org.junit.rules.RunRules.evaluate(RunRules.java:20)
at com.carrotsearch.randomizedtesting.rules.StatementAdapter.evaluate(StatementAdapter.java:36)
at com.carrotsearch.randomizedtesting.ThreadLeakControl$StatementRunner.run(ThreadLeakControl.java:390)
at com.carrotsearch.randomizedtesting.ThreadLeakControl.forkTimeoutingTask(ThreadLeakControl.java:843)
at com.carrotsearch.randomizedtesting.ThreadLeakControl$3.evaluate(ThreadLeakControl.java:490)
at com.carrotsearch.randomizedtesting.RandomizedRunner.runSingleTest(RandomizedRunner.java:955)
at com.carrotsearch.randomizedtesting.RandomizedRunner$5.evaluate(RandomizedRunner.java:840)
at com.carrotsearch.randomizedtesting.RandomizedRunner$6.evaluate(RandomizedRunner.java:891)
at com.carrotsearch.randomizedtesting.RandomizedRunner$7.evaluate(RandomizedRunner.java:902)
at com.carrotsearch.randomizedtesting.rules.StatementAdapter.evaluate(StatementAdapter.java:36)
at com.carrotsearch.randomizedtesting.rules.StatementAdapter.evaluate(StatementAdapter.java:36)
at org.apache.lucene.tests.util.AbstractBeforeAfterRule$1.evaluate(AbstractBeforeAfterRule.java:43)
at com.carrotsearch.randomizedtesting.rules.SystemPropertiesRestoreRule$1.evaluate(SystemPropertiesRestoreRule.java:80)
at org.junit.rules.RunRules.evaluate(RunRules.java:20)
at org.apache.lucene.tests.util.AbstractBeforeAfterRule$1.evaluate(AbstractBeforeAfterRule.java:43)
at com.carrotsearch.randomizedtesting.rules.StatementAdapter.evaluate(StatementAdapter.java:36)
at org.apache.lucene.tests.util.TestRuleStoreClassName$1.evaluate(TestRuleStoreClassName.java:38)
at com.carrotsearch.randomizedtesting.rules.NoShadowingOrOverridesOnMethodsRule$1.evaluate(NoShadowingOrOverridesOnMethodsRule.java:40)
at com.carrotsearch.randomizedtesting.rules.NoShadowingOrOverridesOnMethodsRule$1.evaluate(NoShadowingOrOverridesOnMethodsRule.java:40)
at com.carrotsearch.randomizedtesting.rules.StatementAdapter.evaluate(StatementAdapter.java:36)
at com.carrotsearch.randomizedtesting.rules.StatementAdapter.evaluate(StatementAdapter.java:36)
at org.apache.lucene.tests.util.TestRuleAssertionsRequired$1.evaluate(TestRuleAssertionsRequired.java:53)
at org.apache.lucene.tests.util.AbstractBeforeAfterRule$1.evaluate(AbstractBeforeAfterRule.java:43)
at org.apache.lucene.tests.util.TestRuleMarkFailure$1.evaluate(TestRuleMarkFailure.java:44)
at org.apache.lucene.tests.util.TestRuleIgnoreAfterMaxFailures$1.evaluate(TestRuleIgnoreAfterMaxFailures.java:60)
at org.apache.lucene.tests.util.TestRuleIgnoreTestSuites$1.evaluate(TestRuleIgnoreTestSuites.java:47)
at org.junit.rules.RunRules.evaluate(RunRules.java:20)
at com.carrotsearch.randomizedtesting.rules.StatementAdapter.evaluate(StatementAdapter.java:36)
at com.carrotsearch.randomizedtesting.ThreadLeakControl$StatementRunner.run(ThreadLeakControl.java:390)
at com.carrotsearch.randomizedtesting.ThreadLeakControl.lambda$forkTimeoutingTask$0(ThreadLeakControl.java:850)
at java.base/java.lang.Thread.run(Thread.java:840)
FAILED: org.apache.solr.response.TestPrometheusResponseWriter.testPrometheusOutput
Error Message:
org.junit.ComparisonFailure: expected:<...mmitted",space="Code[Cache"}
solr_metrics_jvm_memory_pools_bytes{item="committed",space="Compressed-Class-Space"}
solr_metrics_jvm_memory_pools_bytes{item="committed",space="Metaspace"}
solr_metrics_jvm_memory_pools_bytes{item="committed",space="PS-Eden-Space"}
solr_metrics_jvm_memory_pools_bytes{item="committed",space="PS-Old-Gen"}
solr_metrics_jvm_memory_pools_bytes{item="committed",space="PS-Survivor-Space"}
solr_metrics_jvm_memory_pools_bytes{item="init",space="CodeCache"}
solr_metrics_jvm_memory_pools_bytes{item="init",space="Compressed-Class-Space"}
solr_metrics_jvm_memory_pools_bytes{item="init",space="Metaspace"}
solr_metrics_jvm_memory_pools_bytes{item="init",space="PS-Eden-Space"}
solr_metrics_jvm_memory_pools_bytes{item="init",space="PS-Old-Gen"}
solr_metrics_jvm_memory_pools_bytes{item="init",space="PS-Survivor-Space"}
solr_metrics_jvm_memory_pools_bytes{item="max",space="CodeCache"}
solr_metrics_jvm_memory_pools_bytes{item="max",space="Compressed-Class-Space"}
solr_metrics_jvm_memory_pools_bytes{item="max",space="Metaspace"}
solr_metrics_jvm_memory_pools_bytes{item="max",space="PS-Eden-Space"}
solr_metrics_jvm_memory_pools_bytes{item="max",space="PS-Old-Gen"}
solr_metrics_jvm_memory_pools_bytes{item="max",space="PS-Survivor-Space"}
solr_metrics_jvm_memory_pools_bytes{item="usage",space="CodeCache"}
solr_metrics_jvm_memory_pools_bytes{item="usage",space="Compressed-Class-Space"}
solr_metrics_jvm_memory_pools_bytes{item="usage",space="Metaspace"}
solr_metrics_jvm_memory_pools_bytes{item="usage",space="PS-Eden-Space"}
solr_metrics_jvm_memory_pools_bytes{item="usage",space="PS-Old-Gen"}
solr_metrics_jvm_memory_pools_bytes{item="usage",space="PS-Survivor-Space"}
solr_metrics_jvm_memory_pools_bytes{item="used",space="CodeCache"}
solr_metrics_jvm_memory_pools_bytes{item="used",space="Compressed-Class-Space"}
solr_metrics_jvm_memory_pools_bytes{item="used",space="Metaspace"}
solr_metrics_jvm_memory_pools_bytes{item="used",space="PS-Eden-Space"}
solr_metrics_jvm_memory_pools_bytes{item="used",space="PS-Old-Gen"}
solr_metrics_jvm_memory_pools_bytes{item="used",space="PS-Survivor-Space"}
solr_metrics_jvm_memory_pools_bytes{item="used-after-gc",space="PS-Eden-Space"}
solr_metrics_jvm_memory_pools_bytes{item="used-after-gc",space="PS-Old-Gen"}
solr_metrics_jvm_memory_pools_bytes{item="used-after-gc",space="PS-Survivor-Space]"}
# TYPE solr_metri...> but was:<...mmitted",space="Code[Heap-'non-nmethods'"}
solr_metrics_jvm_memory_pools_bytes{item="committed",space="CodeHeap-'non-profiled-nmethods'"}
solr_metrics_jvm_memory_pools_bytes{item="committed",space="CodeHeap-'profiled-nmethods'"}
solr_metrics_jvm_memory_pools_bytes{item="committed",space="Compressed-Class-Space"}
solr_metrics_jvm_memory_pools_bytes{item="committed",space="Eden-Space"}
solr_metrics_jvm_memory_pools_bytes{item="committed",space="Metaspace"}
solr_metrics_jvm_memory_pools_bytes{item="committed",space="Survivor-Space"}
solr_metrics_jvm_memory_pools_bytes{item="committed",space="Tenured-Gen"}
solr_metrics_jvm_memory_pools_bytes{item="init",space="CodeHeap-'non-nmethods'"}
solr_metrics_jvm_memory_pools_bytes{item="init",space="CodeHeap-'non-profiled-nmethods'"}
solr_metrics_jvm_memory_pools_bytes{item="init",space="CodeHeap-'profiled-nmethods'"}
solr_metrics_jvm_memory_pools_bytes{item="init",space="Compressed-Class-Space"}
solr_metrics_jvm_memory_pools_bytes{item="init",space="Eden-Space"}
solr_metrics_jvm_memory_pools_bytes{item="init",space="Metaspace"}
solr_metrics_jvm_memory_pools_bytes{item="init",space="Survivor-Space"}
solr_metrics_jvm_memory_pools_bytes{item="init",space="Tenured-Gen"}
solr_metrics_jvm_memory_pools_bytes{item="max",space="CodeHeap-'non-nmethods'"}
solr_metrics_jvm_memory_pools_bytes{item="max",space="CodeHeap-'non-profiled-nmethods'"}
solr_metrics_jvm_memory_pools_bytes{item="max",space="CodeHeap-'profiled-nmethods'"}
solr_metrics_jvm_memory_pools_bytes{item="max",space="Compressed-Class-Space"}
solr_metrics_jvm_memory_pools_bytes{item="max",space="Eden-Space"}
solr_metrics_jvm_memory_pools_bytes{item="max",space="Metaspace"}
solr_metrics_jvm_memory_pools_bytes{item="max",space="Survivor-Space"}
solr_metrics_jvm_memory_pools_bytes{item="max",space="Tenured-Gen"}
solr_metrics_jvm_memory_pools_bytes{item="usage",space="CodeHeap-'non-nmethods'"}
solr_metrics_jvm_memory_pools_bytes{item="usage",space="CodeHeap-'non-profiled-nmethods'"}
solr_metrics_jvm_memory_pools_bytes{item="usage",space="CodeHeap-'profiled-nmethods'"}
solr_metrics_jvm_memory_pools_bytes{item="usage",space="Compressed-Class-Space"}
solr_metrics_jvm_memory_pools_bytes{item="usage",space="Eden-Space"}
solr_metrics_jvm_memory_pools_bytes{item="usage",space="Metaspace"}
solr_metrics_jvm_memory_pools_bytes{item="usage",space="Survivor-Space"}
solr_metrics_jvm_memory_pools_bytes{item="usage",space="Tenured-Gen"}
solr_metrics_jvm_memory_pools_bytes{item="used",space="CodeHeap-'non-nmethods'"}
solr_metrics_jvm_memory_pools_bytes{item="used",space="CodeHeap-'non-profiled-nmethods'"}
solr_metrics_jvm_memory_pools_bytes{item="used",space="CodeHeap-'profiled-nmethods'"}
solr_metrics_jvm_memory_pools_bytes{item="used",space="Compressed-Class-Space"}
solr_metrics_jvm_memory_pools_bytes{item="used",space="Eden-Space"}
solr_metrics_jvm_memory_pools_bytes{item="used",space="Metaspace"}
solr_metrics_jvm_memory_pools_bytes{item="used",space="Survivor-Space"}
solr_metrics_jvm_memory_pools_bytes{item="used",space="Tenured-Gen"}
solr_metrics_jvm_memory_pools_bytes{item="used-after-gc",space="Eden-Space"}
solr_metrics_jvm_memory_pools_bytes{item="used-after-gc",space="Survivor-Space"}
solr_metrics_jvm_memory_pools_bytes{item="used-after-gc",space="Tenured-Gen]"}
# TYPE solr_metri...>
Stack Trace:
org.junit.ComparisonFailure: expected:<...mmitted",space="Code[Cache"}
solr_metrics_jvm_memory_pools_bytes{item="committed",space="Compressed-Class-Space"}
solr_metrics_jvm_memory_pools_bytes{item="committed",space="Metaspace"}
solr_metrics_jvm_memory_pools_bytes{item="committed",space="PS-Eden-Space"}
solr_metrics_jvm_memory_pools_bytes{item="committed",space="PS-Old-Gen"}
solr_metrics_jvm_memory_pools_bytes{item="committed",space="PS-Survivor-Space"}
solr_metrics_jvm_memory_pools_bytes{item="init",space="CodeCache"}
solr_metrics_jvm_memory_pools_bytes{item="init",space="Compressed-Class-Space"}
solr_metrics_jvm_memory_pools_bytes{item="init",space="Metaspace"}
solr_metrics_jvm_memory_pools_bytes{item="init",space="PS-Eden-Space"}
solr_metrics_jvm_memory_pools_bytes{item="init",space="PS-Old-Gen"}
solr_metrics_jvm_memory_pools_bytes{item="init",space="PS-Survivor-Space"}
solr_metrics_jvm_memory_pools_bytes{item="max",space="CodeCache"}
solr_metrics_jvm_memory_pools_bytes{item="max",space="Compressed-Class-Space"}
solr_metrics_jvm_memory_pools_bytes{item="max",space="Metaspace"}
solr_metrics_jvm_memory_pools_bytes{item="max",space="PS-Eden-Space"}
solr_metrics_jvm_memory_pools_bytes{item="max",space="PS-Old-Gen"}
solr_metrics_jvm_memory_pools_bytes{item="max",space="PS-Survivor-Space"}
solr_metrics_jvm_memory_pools_bytes{item="usage",space="CodeCache"}
solr_metrics_jvm_memory_pools_bytes{item="usage",space="Compressed-Class-Space"}
solr_metrics_jvm_memory_pools_bytes{item="usage",space="Metaspace"}
solr_metrics_jvm_memory_pools_bytes{item="usage",space="PS-Eden-Space"}
solr_metrics_jvm_memory_pools_bytes{item="usage",space="PS-Old-Gen"}
solr_metrics_jvm_memory_pools_bytes{item="usage",space="PS-Survivor-Space"}
solr_metrics_jvm_memory_pools_bytes{item="used",space="CodeCache"}
solr_metrics_jvm_memory_pools_bytes{item="used",space="Compressed-Class-Space"}
solr_metrics_jvm_memory_pools_bytes{item="used",space="Metaspace"}
solr_metrics_jvm_memory_pools_bytes{item="used",space="PS-Eden-Space"}
solr_metrics_jvm_memory_pools_bytes{item="used",space="PS-Old-Gen"}
solr_metrics_jvm_memory_pools_bytes{item="used",space="PS-Survivor-Space"}
solr_metrics_jvm_memory_pools_bytes{item="used-after-gc",space="PS-Eden-Space"}
solr_metrics_jvm_memory_pools_bytes{item="used-after-gc",space="PS-Old-Gen"}
solr_metrics_jvm_memory_pools_bytes{item="used-after-gc",space="PS-Survivor-Space]"}
# TYPE solr_metri...> but was:<...mmitted",space="Code[Heap-'non-nmethods'"}
solr_metrics_jvm_memory_pools_bytes{item="committed",space="CodeHeap-'non-profiled-nmethods'"}
solr_metrics_jvm_memory_pools_bytes{item="committed",space="CodeHeap-'profiled-nmethods'"}
solr_metrics_jvm_memory_pools_bytes{item="committed",space="Compressed-Class-Space"}
solr_metrics_jvm_memory_pools_bytes{item="committed",space="Eden-Space"}
solr_metrics_jvm_memory_pools_bytes{item="committed",space="Metaspace"}
solr_metrics_jvm_memory_pools_bytes{item="committed",space="Survivor-Space"}
solr_metrics_jvm_memory_pools_bytes{item="committed",space="Tenured-Gen"}
solr_metrics_jvm_memory_pools_bytes{item="init",space="CodeHeap-'non-nmethods'"}
solr_metrics_jvm_memory_pools_bytes{item="init",space="CodeHeap-'non-profiled-nmethods'"}
solr_metrics_jvm_memory_pools_bytes{item="init",space="CodeHeap-'profiled-nmethods'"}
solr_metrics_jvm_memory_pools_bytes{item="init",space="Compressed-Class-Space"}
solr_metrics_jvm_memory_pools_bytes{item="init",space="Eden-Space"}
solr_metrics_jvm_memory_pools_bytes{item="init",space="Metaspace"}
solr_metrics_jvm_memory_pools_bytes{item="init",space="Survivor-Space"}
solr_metrics_jvm_memory_pools_bytes{item="init",space="Tenured-Gen"}
solr_metrics_jvm_memory_pools_bytes{item="max",space="CodeHeap-'non-nmethods'"}
solr_metrics_jvm_memory_pools_bytes{item="max",space="CodeHeap-'non-profiled-nmethods'"}
solr_metrics_jvm_memory_pools_bytes{item="max",space="CodeHeap-'profiled-nmethods'"}
solr_metrics_jvm_memory_pools_bytes{item="max",space="Compressed-Class-Space"}
solr_metrics_jvm_memory_pools_bytes{item="max",space="Eden-Space"}
solr_metrics_jvm_memory_pools_bytes{item="max",space="Metaspace"}
solr_metrics_jvm_memory_pools_bytes{item="max",space="Survivor-Space"}
solr_metrics_jvm_memory_pools_bytes{item="max",space="Tenured-Gen"}
solr_metrics_jvm_memory_pools_bytes{item="usage",space="CodeHeap-'non-nmethods'"}
solr_metrics_jvm_memory_pools_bytes{item="usage",space="CodeHeap-'non-profiled-nmethods'"}
solr_metrics_jvm_memory_pools_bytes{item="usage",space="CodeHeap-'profiled-nmethods'"}
solr_metrics_jvm_memory_pools_bytes{item="usage",space="Compressed-Class-Space"}
solr_metrics_jvm_memory_pools_bytes{item="usage",space="Eden-Space"}
solr_metrics_jvm_memory_pools_bytes{item="usage",space="Metaspace"}
solr_metrics_jvm_memory_pools_bytes{item="usage",space="Survivor-Space"}
solr_metrics_jvm_memory_pools_bytes{item="usage",space="Tenured-Gen"}
solr_metrics_jvm_memory_pools_bytes{item="used",space="CodeHeap-'non-nmethods'"}
solr_metrics_jvm_memory_pools_bytes{item="used",space="CodeHeap-'non-profiled-nmethods'"}
solr_metrics_jvm_memory_pools_bytes{item="used",space="CodeHeap-'profiled-nmethods'"}
solr_metrics_jvm_memory_pools_bytes{item="used",space="Compressed-Class-Space"}
solr_metrics_jvm_memory_pools_bytes{item="used",space="Eden-Space"}
solr_metrics_jvm_memory_pools_bytes{item="used",space="Metaspace"}
solr_metrics_jvm_memory_pools_bytes{item="used",space="Survivor-Space"}
solr_metrics_jvm_memory_pools_bytes{item="used",space="Tenured-Gen"}
solr_metrics_jvm_memory_pools_bytes{item="used-after-gc",space="Eden-Space"}
solr_metrics_jvm_memory_pools_bytes{item="used-after-gc",space="Survivor-Space"}
solr_metrics_jvm_memory_pools_bytes{item="used-after-gc",space="Tenured-Gen]"}
# TYPE solr_metri...>
at __randomizedtesting.SeedInfo.seed([5F9282135A82103D:DE82EF3A2327FFCB]:0)
at org.junit.Assert.assertEquals(Assert.java:117)
at org.junit.Assert.assertEquals(Assert.java:146)
at org.apache.solr.response.TestPrometheusResponseWriter.testPrometheusOutput(TestPrometheusResponseWriter.java:86)
at java.base/jdk.internal.reflect.NativeMethodAccessorImpl.invoke0(Native Method)
at java.base/jdk.internal.reflect.NativeMethodAccessorImpl.invoke(NativeMethodAccessorImpl.java:77)
at java.base/jdk.internal.reflect.DelegatingMethodAccessorImpl.invoke(DelegatingMethodAccessorImpl.java:43)
at java.base/java.lang.reflect.Method.invoke(Method.java:568)
at com.carrotsearch.randomizedtesting.RandomizedRunner.invoke(RandomizedRunner.java:1758)
at com.carrotsearch.randomizedtesting.RandomizedRunner$8.evaluate(RandomizedRunner.java:946)
at com.carrotsearch.randomizedtesting.RandomizedRunner$9.evaluate(RandomizedRunner.java:982)
at com.carrotsearch.randomizedtesting.RandomizedRunner$10.evaluate(RandomizedRunner.java:996)
at com.carrotsearch.randomizedtesting.rules.SystemPropertiesRestoreRule$1.evaluate(SystemPropertiesRestoreRule.java:80)
at org.junit.rules.RunRules.evaluate(RunRules.java:20)
at org.apache.lucene.tests.util.TestRuleSetupTeardownChained$1.evaluate(TestRuleSetupTeardownChained.java:48)
at org.apache.lucene.tests.util.AbstractBeforeAfterRule$1.evaluate(AbstractBeforeAfterRule.java:43)
at org.apache.lucene.tests.util.TestRuleThreadAndTestName$1.evaluate(TestRuleThreadAndTestName.java:45)
at org.apache.lucene.tests.util.TestRuleIgnoreAfterMaxFailures$1.evaluate(TestRuleIgnoreAfterMaxFailures.java:60)
at org.apache.lucene.tests.util.TestRuleMarkFailure$1.evaluate(TestRuleMarkFailure.java:44)
at org.junit.rules.RunRules.evaluate(RunRules.java:20)
at com.carrotsearch.randomizedtesting.rules.StatementAdapter.evaluate(StatementAdapter.java:36)
at com.carrotsearch.randomizedtesting.ThreadLeakControl$StatementRunner.run(ThreadLeakControl.java:390)
at com.carrotsearch.randomizedtesting.ThreadLeakControl.forkTimeoutingTask(ThreadLeakControl.java:843)
at com.carrotsearch.randomizedtesting.ThreadLeakControl$3.evaluate(ThreadLeakControl.java:490)
at com.carrotsearch.randomizedtesting.RandomizedRunner.runSingleTest(RandomizedRunner.java:955)
at com.carrotsearch.randomizedtesting.RandomizedRunner$5.evaluate(RandomizedRunner.java:840)
at com.carrotsearch.randomizedtesting.RandomizedRunner$6.evaluate(RandomizedRunner.java:891)
at com.carrotsearch.randomizedtesting.RandomizedRunner$7.evaluate(RandomizedRunner.java:902)
at org.junit.rules.ExternalResource$1.evaluate(ExternalResource.java:54)
at com.carrotsearch.randomizedtesting.rules.StatementAdapter.evaluate(StatementAdapter.java:36)
at com.carrotsearch.randomizedtesting.rules.StatementAdapter.evaluate(StatementAdapter.java:36)
at org.apache.lucene.tests.util.AbstractBeforeAfterRule$1.evaluate(AbstractBeforeAfterRule.java:43)
at com.carrotsearch.randomizedtesting.rules.SystemPropertiesRestoreRule$1.evaluate(SystemPropertiesRestoreRule.java:80)
at org.junit.rules.RunRules.evaluate(RunRules.java:20)
at org.apache.lucene.tests.util.AbstractBeforeAfterRule$1.evaluate(AbstractBeforeAfterRule.java:43)
at com.carrotsearch.randomizedtesting.rules.StatementAdapter.evaluate(StatementAdapter.java:36)
at org.apache.lucene.tests.util.TestRuleStoreClassName$1.evaluate(TestRuleStoreClassName.java:38)
at com.carrotsearch.randomizedtesting.rules.NoShadowingOrOverridesOnMethodsRule$1.evaluate(NoShadowingOrOverridesOnMethodsRule.java:40)
at com.carrotsearch.randomizedtesting.rules.NoShadowingOrOverridesOnMethodsRule$1.evaluate(NoShadowingOrOverridesOnMethodsRule.java:40)
at com.carrotsearch.randomizedtesting.rules.StatementAdapter.evaluate(StatementAdapter.java:36)
at com.carrotsearch.randomizedtesting.rules.StatementAdapter.evaluate(StatementAdapter.java:36)
at org.apache.lucene.tests.util.TestRuleAssertionsRequired$1.evaluate(TestRuleAssertionsRequired.java:53)
at org.apache.lucene.tests.util.AbstractBeforeAfterRule$1.evaluate(AbstractBeforeAfterRule.java:43)
at org.apache.lucene.tests.util.TestRuleMarkFailure$1.evaluate(TestRuleMarkFailure.java:44)
at org.apache.lucene.tests.util.TestRuleIgnoreAfterMaxFailures$1.evaluate(TestRuleIgnoreAfterMaxFailures.java:60)
at org.apache.lucene.tests.util.TestRuleIgnoreTestSuites$1.evaluate(TestRuleIgnoreTestSuites.java:47)
at org.junit.rules.RunRules.evaluate(RunRules.java:20)
at com.carrotsearch.randomizedtesting.rules.StatementAdapter.evaluate(StatementAdapter.java:36)
at com.carrotsearch.randomizedtesting.ThreadLeakControl$StatementRunner.run(ThreadLeakControl.java:390)
at com.carrotsearch.randomizedtesting.ThreadLeakControl.lambda$forkTimeoutingTask$0(ThreadLeakControl.java:850)
at java.base/java.lang.Thread.run(Thread.java:840)
[JENKINS] Solr-main-MacOSX (64bit/hotspot/jdk-11.0.21) - Build # 4546 - Still unstable!
Posted by Policeman Jenkins Server <je...@thetaphi.de>.
Build: https://jenkins.thetaphi.de/job/Solr-main-MacOSX/4546/
Java: 64bit/hotspot/jdk-11.0.21 -XX:-UseCompressedOops -XX:+UseSerialGC
3 tests failed.
FAILED: org.apache.solr.cloud.api.collections.LocalFSCloudIncrementalBackupTest.testSimple
Error Message:
org.apache.solr.common.SolrException: Could not find a healthy node to handle the request.
Stack Trace:
org.apache.solr.common.SolrException: Could not find a healthy node to handle the request.
at __randomizedtesting.SeedInfo.seed([CD0814EAAA158D7D:F5BB30148DE659AC]:0)
at app//org.apache.solr.client.solrj.impl.CloudSolrClient.sendRequest(CloudSolrClient.java:1131)
at app//org.apache.solr.client.solrj.impl.CloudSolrClient.requestWithRetryOnStaleState(CloudSolrClient.java:833)
at app//org.apache.solr.client.solrj.impl.CloudSolrClient.requestWithRetryOnStaleState(CloudSolrClient.java:969)
at app//org.apache.solr.client.solrj.impl.CloudSolrClient.requestWithRetryOnStaleState(CloudSolrClient.java:969)
at app//org.apache.solr.client.solrj.impl.CloudSolrClient.requestWithRetryOnStaleState(CloudSolrClient.java:969)
at app//org.apache.solr.client.solrj.impl.CloudSolrClient.requestWithRetryOnStaleState(CloudSolrClient.java:969)
at app//org.apache.solr.client.solrj.impl.CloudSolrClient.requestWithRetryOnStaleState(CloudSolrClient.java:969)
at app//org.apache.solr.client.solrj.impl.CloudSolrClient.request(CloudSolrClient.java:764)
at app//org.apache.solr.client.solrj.SolrRequest.process(SolrRequest.java:229)
at app//org.apache.solr.client.solrj.SolrClient.query(SolrClient.java:927)
at app//org.apache.solr.cloud.api.collections.AbstractIncrementalBackupTest.testSimple(AbstractIncrementalBackupTest.java:188)
at java.base@11.0.21/jdk.internal.reflect.NativeMethodAccessorImpl.invoke0(Native Method)
at java.base@11.0.21/jdk.internal.reflect.NativeMethodAccessorImpl.invoke(NativeMethodAccessorImpl.java:62)
at java.base@11.0.21/jdk.internal.reflect.DelegatingMethodAccessorImpl.invoke(DelegatingMethodAccessorImpl.java:43)
at java.base@11.0.21/java.lang.reflect.Method.invoke(Method.java:566)
at app//com.carrotsearch.randomizedtesting.RandomizedRunner.invoke(RandomizedRunner.java:1758)
at app//com.carrotsearch.randomizedtesting.RandomizedRunner$8.evaluate(RandomizedRunner.java:946)
at app//com.carrotsearch.randomizedtesting.RandomizedRunner$9.evaluate(RandomizedRunner.java:982)
at app//com.carrotsearch.randomizedtesting.RandomizedRunner$10.evaluate(RandomizedRunner.java:996)
at app//com.carrotsearch.randomizedtesting.rules.SystemPropertiesRestoreRule$1.evaluate(SystemPropertiesRestoreRule.java:80)
at app//org.junit.rules.RunRules.evaluate(RunRules.java:20)
at app//org.apache.lucene.tests.util.TestRuleSetupTeardownChained$1.evaluate(TestRuleSetupTeardownChained.java:48)
at app//org.apache.lucene.tests.util.AbstractBeforeAfterRule$1.evaluate(AbstractBeforeAfterRule.java:43)
at app//org.apache.lucene.tests.util.TestRuleThreadAndTestName$1.evaluate(TestRuleThreadAndTestName.java:45)
at app//org.apache.lucene.tests.util.TestRuleIgnoreAfterMaxFailures$1.evaluate(TestRuleIgnoreAfterMaxFailures.java:60)
at app//org.apache.lucene.tests.util.TestRuleMarkFailure$1.evaluate(TestRuleMarkFailure.java:44)
at app//org.junit.rules.RunRules.evaluate(RunRules.java:20)
at app//com.carrotsearch.randomizedtesting.rules.StatementAdapter.evaluate(StatementAdapter.java:36)
at app//com.carrotsearch.randomizedtesting.ThreadLeakControl$StatementRunner.run(ThreadLeakControl.java:390)
at app//com.carrotsearch.randomizedtesting.ThreadLeakControl.forkTimeoutingTask(ThreadLeakControl.java:843)
at app//com.carrotsearch.randomizedtesting.ThreadLeakControl$3.evaluate(ThreadLeakControl.java:490)
at app//com.carrotsearch.randomizedtesting.RandomizedRunner.runSingleTest(RandomizedRunner.java:955)
at app//com.carrotsearch.randomizedtesting.RandomizedRunner$5.evaluate(RandomizedRunner.java:840)
at app//com.carrotsearch.randomizedtesting.RandomizedRunner$6.evaluate(RandomizedRunner.java:891)
at app//com.carrotsearch.randomizedtesting.RandomizedRunner$7.evaluate(RandomizedRunner.java:902)
at app//com.carrotsearch.randomizedtesting.rules.StatementAdapter.evaluate(StatementAdapter.java:36)
at app//com.carrotsearch.randomizedtesting.rules.StatementAdapter.evaluate(StatementAdapter.java:36)
at app//org.apache.lucene.tests.util.AbstractBeforeAfterRule$1.evaluate(AbstractBeforeAfterRule.java:43)
at app//com.carrotsearch.randomizedtesting.rules.SystemPropertiesRestoreRule$1.evaluate(SystemPropertiesRestoreRule.java:80)
at app//org.junit.rules.RunRules.evaluate(RunRules.java:20)
at app//org.apache.lucene.tests.util.AbstractBeforeAfterRule$1.evaluate(AbstractBeforeAfterRule.java:43)
at app//com.carrotsearch.randomizedtesting.rules.StatementAdapter.evaluate(StatementAdapter.java:36)
at app//org.apache.lucene.tests.util.TestRuleStoreClassName$1.evaluate(TestRuleStoreClassName.java:38)
at app//com.carrotsearch.randomizedtesting.rules.NoShadowingOrOverridesOnMethodsRule$1.evaluate(NoShadowingOrOverridesOnMethodsRule.java:40)
at app//com.carrotsearch.randomizedtesting.rules.NoShadowingOrOverridesOnMethodsRule$1.evaluate(NoShadowingOrOverridesOnMethodsRule.java:40)
at app//com.carrotsearch.randomizedtesting.rules.StatementAdapter.evaluate(StatementAdapter.java:36)
at app//com.carrotsearch.randomizedtesting.rules.StatementAdapter.evaluate(StatementAdapter.java:36)
at app//org.apache.lucene.tests.util.TestRuleAssertionsRequired$1.evaluate(TestRuleAssertionsRequired.java:53)
at app//org.apache.lucene.tests.util.AbstractBeforeAfterRule$1.evaluate(AbstractBeforeAfterRule.java:43)
at app//org.apache.lucene.tests.util.TestRuleMarkFailure$1.evaluate(TestRuleMarkFailure.java:44)
at app//org.apache.lucene.tests.util.TestRuleIgnoreAfterMaxFailures$1.evaluate(TestRuleIgnoreAfterMaxFailures.java:60)
at app//org.apache.lucene.tests.util.TestRuleIgnoreTestSuites$1.evaluate(TestRuleIgnoreTestSuites.java:47)
at app//org.junit.rules.RunRules.evaluate(RunRules.java:20)
at app//com.carrotsearch.randomizedtesting.rules.StatementAdapter.evaluate(StatementAdapter.java:36)
at app//com.carrotsearch.randomizedtesting.ThreadLeakControl$StatementRunner.run(ThreadLeakControl.java:390)
at app//com.carrotsearch.randomizedtesting.ThreadLeakControl.lambda$forkTimeoutingTask$0(ThreadLeakControl.java:850)
at java.base@11.0.21/java.lang.Thread.run(Thread.java:829)
FAILED: org.apache.solr.handler.admin.MetricsHandlerTest.testPrometheusMetricsJvm
Error Message:
java.lang.AssertionError: expected:<0.0> but was:<2555904.0>
Stack Trace:
java.lang.AssertionError: expected:<0.0> but was:<2555904.0>
at __randomizedtesting.SeedInfo.seed([CD0814EAAA158D7D:C542C7FFF945C00D]:0)
at org.junit.Assert.fail(Assert.java:89)
at org.junit.Assert.failNotEquals(Assert.java:835)
at org.junit.Assert.assertEquals(Assert.java:555)
at org.junit.Assert.assertEquals(Assert.java:685)
at org.apache.solr.handler.admin.MetricsHandlerTest.testPrometheusMetricsJvm(MetricsHandlerTest.java:925)
at java.base/jdk.internal.reflect.NativeMethodAccessorImpl.invoke0(Native Method)
at java.base/jdk.internal.reflect.NativeMethodAccessorImpl.invoke(NativeMethodAccessorImpl.java:62)
at java.base/jdk.internal.reflect.DelegatingMethodAccessorImpl.invoke(DelegatingMethodAccessorImpl.java:43)
at java.base/java.lang.reflect.Method.invoke(Method.java:566)
at com.carrotsearch.randomizedtesting.RandomizedRunner.invoke(RandomizedRunner.java:1758)
at com.carrotsearch.randomizedtesting.RandomizedRunner$8.evaluate(RandomizedRunner.java:946)
at com.carrotsearch.randomizedtesting.RandomizedRunner$9.evaluate(RandomizedRunner.java:982)
at com.carrotsearch.randomizedtesting.RandomizedRunner$10.evaluate(RandomizedRunner.java:996)
at com.carrotsearch.randomizedtesting.rules.SystemPropertiesRestoreRule$1.evaluate(SystemPropertiesRestoreRule.java:80)
at org.junit.rules.RunRules.evaluate(RunRules.java:20)
at org.apache.lucene.tests.util.TestRuleSetupTeardownChained$1.evaluate(TestRuleSetupTeardownChained.java:48)
at org.apache.lucene.tests.util.AbstractBeforeAfterRule$1.evaluate(AbstractBeforeAfterRule.java:43)
at org.apache.lucene.tests.util.TestRuleThreadAndTestName$1.evaluate(TestRuleThreadAndTestName.java:45)
at org.apache.lucene.tests.util.TestRuleIgnoreAfterMaxFailures$1.evaluate(TestRuleIgnoreAfterMaxFailures.java:60)
at org.apache.lucene.tests.util.TestRuleMarkFailure$1.evaluate(TestRuleMarkFailure.java:44)
at org.junit.rules.RunRules.evaluate(RunRules.java:20)
at com.carrotsearch.randomizedtesting.rules.StatementAdapter.evaluate(StatementAdapter.java:36)
at com.carrotsearch.randomizedtesting.ThreadLeakControl$StatementRunner.run(ThreadLeakControl.java:390)
at com.carrotsearch.randomizedtesting.ThreadLeakControl.forkTimeoutingTask(ThreadLeakControl.java:843)
at com.carrotsearch.randomizedtesting.ThreadLeakControl$3.evaluate(ThreadLeakControl.java:490)
at com.carrotsearch.randomizedtesting.RandomizedRunner.runSingleTest(RandomizedRunner.java:955)
at com.carrotsearch.randomizedtesting.RandomizedRunner$5.evaluate(RandomizedRunner.java:840)
at com.carrotsearch.randomizedtesting.RandomizedRunner$6.evaluate(RandomizedRunner.java:891)
at com.carrotsearch.randomizedtesting.RandomizedRunner$7.evaluate(RandomizedRunner.java:902)
at com.carrotsearch.randomizedtesting.rules.StatementAdapter.evaluate(StatementAdapter.java:36)
at com.carrotsearch.randomizedtesting.rules.StatementAdapter.evaluate(StatementAdapter.java:36)
at org.apache.lucene.tests.util.AbstractBeforeAfterRule$1.evaluate(AbstractBeforeAfterRule.java:43)
at com.carrotsearch.randomizedtesting.rules.SystemPropertiesRestoreRule$1.evaluate(SystemPropertiesRestoreRule.java:80)
at org.junit.rules.RunRules.evaluate(RunRules.java:20)
at org.apache.lucene.tests.util.AbstractBeforeAfterRule$1.evaluate(AbstractBeforeAfterRule.java:43)
at com.carrotsearch.randomizedtesting.rules.StatementAdapter.evaluate(StatementAdapter.java:36)
at org.apache.lucene.tests.util.TestRuleStoreClassName$1.evaluate(TestRuleStoreClassName.java:38)
at com.carrotsearch.randomizedtesting.rules.NoShadowingOrOverridesOnMethodsRule$1.evaluate(NoShadowingOrOverridesOnMethodsRule.java:40)
at com.carrotsearch.randomizedtesting.rules.NoShadowingOrOverridesOnMethodsRule$1.evaluate(NoShadowingOrOverridesOnMethodsRule.java:40)
at com.carrotsearch.randomizedtesting.rules.StatementAdapter.evaluate(StatementAdapter.java:36)
at com.carrotsearch.randomizedtesting.rules.StatementAdapter.evaluate(StatementAdapter.java:36)
at org.apache.lucene.tests.util.TestRuleAssertionsRequired$1.evaluate(TestRuleAssertionsRequired.java:53)
at org.apache.lucene.tests.util.AbstractBeforeAfterRule$1.evaluate(AbstractBeforeAfterRule.java:43)
at org.apache.lucene.tests.util.TestRuleMarkFailure$1.evaluate(TestRuleMarkFailure.java:44)
at org.apache.lucene.tests.util.TestRuleIgnoreAfterMaxFailures$1.evaluate(TestRuleIgnoreAfterMaxFailures.java:60)
at org.apache.lucene.tests.util.TestRuleIgnoreTestSuites$1.evaluate(TestRuleIgnoreTestSuites.java:47)
at org.junit.rules.RunRules.evaluate(RunRules.java:20)
at com.carrotsearch.randomizedtesting.rules.StatementAdapter.evaluate(StatementAdapter.java:36)
at com.carrotsearch.randomizedtesting.ThreadLeakControl$StatementRunner.run(ThreadLeakControl.java:390)
at com.carrotsearch.randomizedtesting.ThreadLeakControl.lambda$forkTimeoutingTask$0(ThreadLeakControl.java:850)
at java.base/java.lang.Thread.run(Thread.java:829)
FAILED: org.apache.solr.response.TestPrometheusResponseWriter.testPrometheusOutput
Error Message:
org.junit.ComparisonFailure: expected:<...mmitted",space="Code[Cache"}
solr_metrics_jvm_memory_pools_bytes{item="committed",space="Compressed-Class-Space"}
solr_metrics_jvm_memory_pools_bytes{item="committed",space="Metaspace"}
solr_metrics_jvm_memory_pools_bytes{item="committed",space="PS-Eden-Space"}
solr_metrics_jvm_memory_pools_bytes{item="committed",space="PS-Old-Gen"}
solr_metrics_jvm_memory_pools_bytes{item="committed",space="PS-Survivor-Space"}
solr_metrics_jvm_memory_pools_bytes{item="init",space="CodeCache"}
solr_metrics_jvm_memory_pools_bytes{item="init",space="Compressed-Class-Space"}
solr_metrics_jvm_memory_pools_bytes{item="init",space="Metaspace"}
solr_metrics_jvm_memory_pools_bytes{item="init",space="PS-Eden-Space"}
solr_metrics_jvm_memory_pools_bytes{item="init",space="PS-Old-Gen"}
solr_metrics_jvm_memory_pools_bytes{item="init",space="PS-Survivor-Space"}
solr_metrics_jvm_memory_pools_bytes{item="max",space="CodeCache"}
solr_metrics_jvm_memory_pools_bytes{item="max",space="Compressed-Class-Space"}
solr_metrics_jvm_memory_pools_bytes{item="max",space="Metaspace"}
solr_metrics_jvm_memory_pools_bytes{item="max",space="PS-Eden-Space"}
solr_metrics_jvm_memory_pools_bytes{item="max",space="PS-Old-Gen"}
solr_metrics_jvm_memory_pools_bytes{item="max",space="PS-Survivor-Space"}
solr_metrics_jvm_memory_pools_bytes{item="usage",space="CodeCache"}
solr_metrics_jvm_memory_pools_bytes{item="usage",space="Compressed-Class-Space"}
solr_metrics_jvm_memory_pools_bytes{item="usage",space="Metaspace"}
solr_metrics_jvm_memory_pools_bytes{item="usage",space="PS-Eden-Space"}
solr_metrics_jvm_memory_pools_bytes{item="usage",space="PS-Old-Gen"}
solr_metrics_jvm_memory_pools_bytes{item="usage",space="PS-Survivor-Space"}
solr_metrics_jvm_memory_pools_bytes{item="used",space="CodeCache"}
solr_metrics_jvm_memory_pools_bytes{item="used",space="Compressed-Class-Space"}
solr_metrics_jvm_memory_pools_bytes{item="used",space="Metaspace"}
solr_metrics_jvm_memory_pools_bytes{item="used",space="PS-Eden-Space"}
solr_metrics_jvm_memory_pools_bytes{item="used",space="PS-Old-Gen"}
solr_metrics_jvm_memory_pools_bytes{item="used",space="PS-Survivor-Space"}
solr_metrics_jvm_memory_pools_bytes{item="used-after-gc",space="PS-Eden-Space"}
solr_metrics_jvm_memory_pools_bytes{item="used-after-gc",space="PS-Old-Gen"}
solr_metrics_jvm_memory_pools_bytes{item="used-after-gc",space="PS-Survivor-Space]"}
# TYPE solr_metri...> but was:<...mmitted",space="Code[Heap-'non-nmethods'"}
solr_metrics_jvm_memory_pools_bytes{item="committed",space="CodeHeap-'non-profiled-nmethods'"}
solr_metrics_jvm_memory_pools_bytes{item="committed",space="CodeHeap-'profiled-nmethods'"}
solr_metrics_jvm_memory_pools_bytes{item="committed",space="Eden-Space"}
solr_metrics_jvm_memory_pools_bytes{item="committed",space="Metaspace"}
solr_metrics_jvm_memory_pools_bytes{item="committed",space="Survivor-Space"}
solr_metrics_jvm_memory_pools_bytes{item="committed",space="Tenured-Gen"}
solr_metrics_jvm_memory_pools_bytes{item="init",space="CodeHeap-'non-nmethods'"}
solr_metrics_jvm_memory_pools_bytes{item="init",space="CodeHeap-'non-profiled-nmethods'"}
solr_metrics_jvm_memory_pools_bytes{item="init",space="CodeHeap-'profiled-nmethods'"}
solr_metrics_jvm_memory_pools_bytes{item="init",space="Eden-Space"}
solr_metrics_jvm_memory_pools_bytes{item="init",space="Metaspace"}
solr_metrics_jvm_memory_pools_bytes{item="init",space="Survivor-Space"}
solr_metrics_jvm_memory_pools_bytes{item="init",space="Tenured-Gen"}
solr_metrics_jvm_memory_pools_bytes{item="max",space="CodeHeap-'non-nmethods'"}
solr_metrics_jvm_memory_pools_bytes{item="max",space="CodeHeap-'non-profiled-nmethods'"}
solr_metrics_jvm_memory_pools_bytes{item="max",space="CodeHeap-'profiled-nmethods'"}
solr_metrics_jvm_memory_pools_bytes{item="max",space="Eden-Space"}
solr_metrics_jvm_memory_pools_bytes{item="max",space="Metaspace"}
solr_metrics_jvm_memory_pools_bytes{item="max",space="Survivor-Space"}
solr_metrics_jvm_memory_pools_bytes{item="max",space="Tenured-Gen"}
solr_metrics_jvm_memory_pools_bytes{item="usage",space="CodeHeap-'non-nmethods'"}
solr_metrics_jvm_memory_pools_bytes{item="usage",space="CodeHeap-'non-profiled-nmethods'"}
solr_metrics_jvm_memory_pools_bytes{item="usage",space="CodeHeap-'profiled-nmethods'"}
solr_metrics_jvm_memory_pools_bytes{item="usage",space="Eden-Space"}
solr_metrics_jvm_memory_pools_bytes{item="usage",space="Metaspace"}
solr_metrics_jvm_memory_pools_bytes{item="usage",space="Survivor-Space"}
solr_metrics_jvm_memory_pools_bytes{item="usage",space="Tenured-Gen"}
solr_metrics_jvm_memory_pools_bytes{item="used",space="CodeHeap-'non-nmethods'"}
solr_metrics_jvm_memory_pools_bytes{item="used",space="CodeHeap-'non-profiled-nmethods'"}
solr_metrics_jvm_memory_pools_bytes{item="used",space="CodeHeap-'profiled-nmethods'"}
solr_metrics_jvm_memory_pools_bytes{item="used",space="Eden-Space"}
solr_metrics_jvm_memory_pools_bytes{item="used",space="Metaspace"}
solr_metrics_jvm_memory_pools_bytes{item="used",space="Survivor-Space"}
solr_metrics_jvm_memory_pools_bytes{item="used",space="Tenured-Gen"}
solr_metrics_jvm_memory_pools_bytes{item="used-after-gc",space="Eden-Space"}
solr_metrics_jvm_memory_pools_bytes{item="used-after-gc",space="Survivor-Space"}
solr_metrics_jvm_memory_pools_bytes{item="used-after-gc",space="Tenured-Gen]"}
# TYPE solr_metri...>
Stack Trace:
org.junit.ComparisonFailure: expected:<...mmitted",space="Code[Cache"}
solr_metrics_jvm_memory_pools_bytes{item="committed",space="Compressed-Class-Space"}
solr_metrics_jvm_memory_pools_bytes{item="committed",space="Metaspace"}
solr_metrics_jvm_memory_pools_bytes{item="committed",space="PS-Eden-Space"}
solr_metrics_jvm_memory_pools_bytes{item="committed",space="PS-Old-Gen"}
solr_metrics_jvm_memory_pools_bytes{item="committed",space="PS-Survivor-Space"}
solr_metrics_jvm_memory_pools_bytes{item="init",space="CodeCache"}
solr_metrics_jvm_memory_pools_bytes{item="init",space="Compressed-Class-Space"}
solr_metrics_jvm_memory_pools_bytes{item="init",space="Metaspace"}
solr_metrics_jvm_memory_pools_bytes{item="init",space="PS-Eden-Space"}
solr_metrics_jvm_memory_pools_bytes{item="init",space="PS-Old-Gen"}
solr_metrics_jvm_memory_pools_bytes{item="init",space="PS-Survivor-Space"}
solr_metrics_jvm_memory_pools_bytes{item="max",space="CodeCache"}
solr_metrics_jvm_memory_pools_bytes{item="max",space="Compressed-Class-Space"}
solr_metrics_jvm_memory_pools_bytes{item="max",space="Metaspace"}
solr_metrics_jvm_memory_pools_bytes{item="max",space="PS-Eden-Space"}
solr_metrics_jvm_memory_pools_bytes{item="max",space="PS-Old-Gen"}
solr_metrics_jvm_memory_pools_bytes{item="max",space="PS-Survivor-Space"}
solr_metrics_jvm_memory_pools_bytes{item="usage",space="CodeCache"}
solr_metrics_jvm_memory_pools_bytes{item="usage",space="Compressed-Class-Space"}
solr_metrics_jvm_memory_pools_bytes{item="usage",space="Metaspace"}
solr_metrics_jvm_memory_pools_bytes{item="usage",space="PS-Eden-Space"}
solr_metrics_jvm_memory_pools_bytes{item="usage",space="PS-Old-Gen"}
solr_metrics_jvm_memory_pools_bytes{item="usage",space="PS-Survivor-Space"}
solr_metrics_jvm_memory_pools_bytes{item="used",space="CodeCache"}
solr_metrics_jvm_memory_pools_bytes{item="used",space="Compressed-Class-Space"}
solr_metrics_jvm_memory_pools_bytes{item="used",space="Metaspace"}
solr_metrics_jvm_memory_pools_bytes{item="used",space="PS-Eden-Space"}
solr_metrics_jvm_memory_pools_bytes{item="used",space="PS-Old-Gen"}
solr_metrics_jvm_memory_pools_bytes{item="used",space="PS-Survivor-Space"}
solr_metrics_jvm_memory_pools_bytes{item="used-after-gc",space="PS-Eden-Space"}
solr_metrics_jvm_memory_pools_bytes{item="used-after-gc",space="PS-Old-Gen"}
solr_metrics_jvm_memory_pools_bytes{item="used-after-gc",space="PS-Survivor-Space]"}
# TYPE solr_metri...> but was:<...mmitted",space="Code[Heap-'non-nmethods'"}
solr_metrics_jvm_memory_pools_bytes{item="committed",space="CodeHeap-'non-profiled-nmethods'"}
solr_metrics_jvm_memory_pools_bytes{item="committed",space="CodeHeap-'profiled-nmethods'"}
solr_metrics_jvm_memory_pools_bytes{item="committed",space="Eden-Space"}
solr_metrics_jvm_memory_pools_bytes{item="committed",space="Metaspace"}
solr_metrics_jvm_memory_pools_bytes{item="committed",space="Survivor-Space"}
solr_metrics_jvm_memory_pools_bytes{item="committed",space="Tenured-Gen"}
solr_metrics_jvm_memory_pools_bytes{item="init",space="CodeHeap-'non-nmethods'"}
solr_metrics_jvm_memory_pools_bytes{item="init",space="CodeHeap-'non-profiled-nmethods'"}
solr_metrics_jvm_memory_pools_bytes{item="init",space="CodeHeap-'profiled-nmethods'"}
solr_metrics_jvm_memory_pools_bytes{item="init",space="Eden-Space"}
solr_metrics_jvm_memory_pools_bytes{item="init",space="Metaspace"}
solr_metrics_jvm_memory_pools_bytes{item="init",space="Survivor-Space"}
solr_metrics_jvm_memory_pools_bytes{item="init",space="Tenured-Gen"}
solr_metrics_jvm_memory_pools_bytes{item="max",space="CodeHeap-'non-nmethods'"}
solr_metrics_jvm_memory_pools_bytes{item="max",space="CodeHeap-'non-profiled-nmethods'"}
solr_metrics_jvm_memory_pools_bytes{item="max",space="CodeHeap-'profiled-nmethods'"}
solr_metrics_jvm_memory_pools_bytes{item="max",space="Eden-Space"}
solr_metrics_jvm_memory_pools_bytes{item="max",space="Metaspace"}
solr_metrics_jvm_memory_pools_bytes{item="max",space="Survivor-Space"}
solr_metrics_jvm_memory_pools_bytes{item="max",space="Tenured-Gen"}
solr_metrics_jvm_memory_pools_bytes{item="usage",space="CodeHeap-'non-nmethods'"}
solr_metrics_jvm_memory_pools_bytes{item="usage",space="CodeHeap-'non-profiled-nmethods'"}
solr_metrics_jvm_memory_pools_bytes{item="usage",space="CodeHeap-'profiled-nmethods'"}
solr_metrics_jvm_memory_pools_bytes{item="usage",space="Eden-Space"}
solr_metrics_jvm_memory_pools_bytes{item="usage",space="Metaspace"}
solr_metrics_jvm_memory_pools_bytes{item="usage",space="Survivor-Space"}
solr_metrics_jvm_memory_pools_bytes{item="usage",space="Tenured-Gen"}
solr_metrics_jvm_memory_pools_bytes{item="used",space="CodeHeap-'non-nmethods'"}
solr_metrics_jvm_memory_pools_bytes{item="used",space="CodeHeap-'non-profiled-nmethods'"}
solr_metrics_jvm_memory_pools_bytes{item="used",space="CodeHeap-'profiled-nmethods'"}
solr_metrics_jvm_memory_pools_bytes{item="used",space="Eden-Space"}
solr_metrics_jvm_memory_pools_bytes{item="used",space="Metaspace"}
solr_metrics_jvm_memory_pools_bytes{item="used",space="Survivor-Space"}
solr_metrics_jvm_memory_pools_bytes{item="used",space="Tenured-Gen"}
solr_metrics_jvm_memory_pools_bytes{item="used-after-gc",space="Eden-Space"}
solr_metrics_jvm_memory_pools_bytes{item="used-after-gc",space="Survivor-Space"}
solr_metrics_jvm_memory_pools_bytes{item="used-after-gc",space="Tenured-Gen]"}
# TYPE solr_metri...>
at __randomizedtesting.SeedInfo.seed([CD0814EAAA158D7D:4C1879C3D3B0628B]:0)
at org.junit.Assert.assertEquals(Assert.java:117)
at org.junit.Assert.assertEquals(Assert.java:146)
at org.apache.solr.response.TestPrometheusResponseWriter.testPrometheusOutput(TestPrometheusResponseWriter.java:86)
at java.base/jdk.internal.reflect.NativeMethodAccessorImpl.invoke0(Native Method)
at java.base/jdk.internal.reflect.NativeMethodAccessorImpl.invoke(NativeMethodAccessorImpl.java:62)
at java.base/jdk.internal.reflect.DelegatingMethodAccessorImpl.invoke(DelegatingMethodAccessorImpl.java:43)
at java.base/java.lang.reflect.Method.invoke(Method.java:566)
at com.carrotsearch.randomizedtesting.RandomizedRunner.invoke(RandomizedRunner.java:1758)
at com.carrotsearch.randomizedtesting.RandomizedRunner$8.evaluate(RandomizedRunner.java:946)
at com.carrotsearch.randomizedtesting.RandomizedRunner$9.evaluate(RandomizedRunner.java:982)
at com.carrotsearch.randomizedtesting.RandomizedRunner$10.evaluate(RandomizedRunner.java:996)
at com.carrotsearch.randomizedtesting.rules.SystemPropertiesRestoreRule$1.evaluate(SystemPropertiesRestoreRule.java:80)
at org.junit.rules.RunRules.evaluate(RunRules.java:20)
at org.apache.lucene.tests.util.TestRuleSetupTeardownChained$1.evaluate(TestRuleSetupTeardownChained.java:48)
at org.apache.lucene.tests.util.AbstractBeforeAfterRule$1.evaluate(AbstractBeforeAfterRule.java:43)
at org.apache.lucene.tests.util.TestRuleThreadAndTestName$1.evaluate(TestRuleThreadAndTestName.java:45)
at org.apache.lucene.tests.util.TestRuleIgnoreAfterMaxFailures$1.evaluate(TestRuleIgnoreAfterMaxFailures.java:60)
at org.apache.lucene.tests.util.TestRuleMarkFailure$1.evaluate(TestRuleMarkFailure.java:44)
at org.junit.rules.RunRules.evaluate(RunRules.java:20)
at com.carrotsearch.randomizedtesting.rules.StatementAdapter.evaluate(StatementAdapter.java:36)
at com.carrotsearch.randomizedtesting.ThreadLeakControl$StatementRunner.run(ThreadLeakControl.java:390)
at com.carrotsearch.randomizedtesting.ThreadLeakControl.forkTimeoutingTask(ThreadLeakControl.java:843)
at com.carrotsearch.randomizedtesting.ThreadLeakControl$3.evaluate(ThreadLeakControl.java:490)
at com.carrotsearch.randomizedtesting.RandomizedRunner.runSingleTest(RandomizedRunner.java:955)
at com.carrotsearch.randomizedtesting.RandomizedRunner$5.evaluate(RandomizedRunner.java:840)
at com.carrotsearch.randomizedtesting.RandomizedRunner$6.evaluate(RandomizedRunner.java:891)
at com.carrotsearch.randomizedtesting.RandomizedRunner$7.evaluate(RandomizedRunner.java:902)
at org.junit.rules.ExternalResource$1.evaluate(ExternalResource.java:54)
at com.carrotsearch.randomizedtesting.rules.StatementAdapter.evaluate(StatementAdapter.java:36)
at com.carrotsearch.randomizedtesting.rules.StatementAdapter.evaluate(StatementAdapter.java:36)
at org.apache.lucene.tests.util.AbstractBeforeAfterRule$1.evaluate(AbstractBeforeAfterRule.java:43)
at com.carrotsearch.randomizedtesting.rules.SystemPropertiesRestoreRule$1.evaluate(SystemPropertiesRestoreRule.java:80)
at org.junit.rules.RunRules.evaluate(RunRules.java:20)
at org.apache.lucene.tests.util.AbstractBeforeAfterRule$1.evaluate(AbstractBeforeAfterRule.java:43)
at com.carrotsearch.randomizedtesting.rules.StatementAdapter.evaluate(StatementAdapter.java:36)
at org.apache.lucene.tests.util.TestRuleStoreClassName$1.evaluate(TestRuleStoreClassName.java:38)
at com.carrotsearch.randomizedtesting.rules.NoShadowingOrOverridesOnMethodsRule$1.evaluate(NoShadowingOrOverridesOnMethodsRule.java:40)
at com.carrotsearch.randomizedtesting.rules.NoShadowingOrOverridesOnMethodsRule$1.evaluate(NoShadowingOrOverridesOnMethodsRule.java:40)
at com.carrotsearch.randomizedtesting.rules.StatementAdapter.evaluate(StatementAdapter.java:36)
at com.carrotsearch.randomizedtesting.rules.StatementAdapter.evaluate(StatementAdapter.java:36)
at org.apache.lucene.tests.util.TestRuleAssertionsRequired$1.evaluate(TestRuleAssertionsRequired.java:53)
at org.apache.lucene.tests.util.AbstractBeforeAfterRule$1.evaluate(AbstractBeforeAfterRule.java:43)
at org.apache.lucene.tests.util.TestRuleMarkFailure$1.evaluate(TestRuleMarkFailure.java:44)
at org.apache.lucene.tests.util.TestRuleIgnoreAfterMaxFailures$1.evaluate(TestRuleIgnoreAfterMaxFailures.java:60)
at org.apache.lucene.tests.util.TestRuleIgnoreTestSuites$1.evaluate(TestRuleIgnoreTestSuites.java:47)
at org.junit.rules.RunRules.evaluate(RunRules.java:20)
at com.carrotsearch.randomizedtesting.rules.StatementAdapter.evaluate(StatementAdapter.java:36)
at com.carrotsearch.randomizedtesting.ThreadLeakControl$StatementRunner.run(ThreadLeakControl.java:390)
at com.carrotsearch.randomizedtesting.ThreadLeakControl.lambda$forkTimeoutingTask$0(ThreadLeakControl.java:850)
at java.base/java.lang.Thread.run(Thread.java:829)