You are viewing a plain text version of this content. The canonical link for it is here.
Posted to dev@lucene.apache.org by Policeman Jenkins Server <je...@thetaphi.de> on 2016/10/04 21:26:27 UTC
[JENKINS] Lucene-Solr-6.x-Solaris (64bit/jdk1.8.0) - Build # 431 -
Failure!
Build: https://jenkins.thetaphi.de/job/Lucene-Solr-6.x-Solaris/431/
Java: 64bit/jdk1.8.0 -XX:-UseCompressedOops -XX:+UseG1GC
All tests passed
Build Log:
[...truncated 53590 lines...]
-ecj-javadoc-lint-src:
[mkdir] Created dir: /var/tmp/ecj1427533562
[ecj-lint] Compiling 232 source files to /var/tmp/ecj1427533562
[ecj-lint] ----------
[ecj-lint] 1. ERROR in /export/home/jenkins/workspace/Lucene-Solr-6.x-Solaris/lucene/queryparser/src/java/org/apache/lucene/queryparser/classic/MultiFieldQueryParser.java (at line 30)
[ecj-lint] import org.apache.lucene.search.TermQuery;
[ecj-lint] ^^^^^^^^^^^^^^^^^^^^^^^^^^^^^^^^^^
[ecj-lint] The import org.apache.lucene.search.TermQuery is never used
[ecj-lint] ----------
[ecj-lint] 1 problem (1 error)
BUILD FAILED
/export/home/jenkins/workspace/Lucene-Solr-6.x-Solaris/build.xml:763: The following error occurred while executing this line:
/export/home/jenkins/workspace/Lucene-Solr-6.x-Solaris/build.xml:101: The following error occurred while executing this line:
/export/home/jenkins/workspace/Lucene-Solr-6.x-Solaris/lucene/build.xml:204: The following error occurred while executing this line:
/export/home/jenkins/workspace/Lucene-Solr-6.x-Solaris/lucene/common-build.xml:2177: The following error occurred while executing this line:
/export/home/jenkins/workspace/Lucene-Solr-6.x-Solaris/lucene/common-build.xml:1992: The following error occurred while executing this line:
/export/home/jenkins/workspace/Lucene-Solr-6.x-Solaris/lucene/common-build.xml:2031: Compile failed; see the compiler error output for details.
Total time: 81 minutes 3 seconds
Build step 'Invoke Ant' marked build as failure
Archiving artifacts
[WARNINGS] Skipping publisher since build result is FAILURE
Recording test results
Email was triggered for: Failure - Any
Sending email for trigger: Failure - Any
Re: [JENKINS] Lucene-Solr-6.x-Solaris (64bit/jdk1.8.0) - Build # 432
- Unstable!
Posted by Michael McCandless <lu...@mikemccandless.com>.
I'll dig.
Mike McCandless
http://blog.mikemccandless.com
On Wed, Oct 5, 2016 at 4:12 AM, Policeman Jenkins Server
<je...@thetaphi.de> wrote:
> Build: https://jenkins.thetaphi.de/job/Lucene-Solr-6.x-Solaris/432/
> Java: 64bit/jdk1.8.0 -XX:-UseCompressedOops -XX:+UseSerialGC
>
> 1 tests failed.
> FAILED: org.apache.lucene.codecs.perfield.TestPerFieldPostingsFormat2.testMergeCalledOnTwoFormats
>
> Error Message:
> expected:<1> but was:<2>
>
> Stack Trace:
> java.lang.AssertionError: expected:<1> but was:<2>
> at __randomizedtesting.SeedInfo.seed([9C8B401EAF454DD:34F486948DF8FDF0]:0)
> at org.junit.Assert.fail(Assert.java:93)
> at org.junit.Assert.failNotEquals(Assert.java:647)
> at org.junit.Assert.assertEquals(Assert.java:128)
> at org.junit.Assert.assertEquals(Assert.java:472)
> at org.junit.Assert.assertEquals(Assert.java:456)
> at org.apache.lucene.codecs.perfield.TestPerFieldPostingsFormat2.testMergeCalledOnTwoFormats(TestPerFieldPostingsFormat2.java:387)
> at sun.reflect.NativeMethodAccessorImpl.invoke0(Native Method)
> at sun.reflect.NativeMethodAccessorImpl.invoke(NativeMethodAccessorImpl.java:62)
> at sun.reflect.DelegatingMethodAccessorImpl.invoke(DelegatingMethodAccessorImpl.java:43)
> at java.lang.reflect.Method.invoke(Method.java:498)
> at com.carrotsearch.randomizedtesting.RandomizedRunner.invoke(RandomizedRunner.java:1764)
> at com.carrotsearch.randomizedtesting.RandomizedRunner$8.evaluate(RandomizedRunner.java:871)
> at com.carrotsearch.randomizedtesting.RandomizedRunner$9.evaluate(RandomizedRunner.java:907)
> at com.carrotsearch.randomizedtesting.RandomizedRunner$10.evaluate(RandomizedRunner.java:921)
> at org.apache.lucene.util.TestRuleSetupTeardownChained$1.evaluate(TestRuleSetupTeardownChained.java:49)
> at org.apache.lucene.util.AbstractBeforeAfterRule$1.evaluate(AbstractBeforeAfterRule.java:45)
> at org.apache.lucene.util.TestRuleThreadAndTestName$1.evaluate(TestRuleThreadAndTestName.java:48)
> at org.apache.lucene.util.TestRuleIgnoreAfterMaxFailures$1.evaluate(TestRuleIgnoreAfterMaxFailures.java:64)
> at org.apache.lucene.util.TestRuleMarkFailure$1.evaluate(TestRuleMarkFailure.java:47)
> at com.carrotsearch.randomizedtesting.rules.StatementAdapter.evaluate(StatementAdapter.java:36)
> at com.carrotsearch.randomizedtesting.ThreadLeakControl$StatementRunner.run(ThreadLeakControl.java:367)
> at com.carrotsearch.randomizedtesting.ThreadLeakControl.forkTimeoutingTask(ThreadLeakControl.java:809)
> at com.carrotsearch.randomizedtesting.ThreadLeakControl$3.evaluate(ThreadLeakControl.java:460)
> at com.carrotsearch.randomizedtesting.RandomizedRunner.runSingleTest(RandomizedRunner.java:880)
> at com.carrotsearch.randomizedtesting.RandomizedRunner$5.evaluate(RandomizedRunner.java:781)
> at com.carrotsearch.randomizedtesting.RandomizedRunner$6.evaluate(RandomizedRunner.java:816)
> at com.carrotsearch.randomizedtesting.RandomizedRunner$7.evaluate(RandomizedRunner.java:827)
> at org.apache.lucene.util.AbstractBeforeAfterRule$1.evaluate(AbstractBeforeAfterRule.java:45)
> at com.carrotsearch.randomizedtesting.rules.StatementAdapter.evaluate(StatementAdapter.java:36)
> at org.apache.lucene.util.TestRuleStoreClassName$1.evaluate(TestRuleStoreClassName.java:41)
> at com.carrotsearch.randomizedtesting.rules.NoShadowingOrOverridesOnMethodsRule$1.evaluate(NoShadowingOrOverridesOnMethodsRule.java:40)
> at com.carrotsearch.randomizedtesting.rules.NoShadowingOrOverridesOnMethodsRule$1.evaluate(NoShadowingOrOverridesOnMethodsRule.java:40)
> at com.carrotsearch.randomizedtesting.rules.StatementAdapter.evaluate(StatementAdapter.java:36)
> at com.carrotsearch.randomizedtesting.rules.StatementAdapter.evaluate(StatementAdapter.java:36)
> at com.carrotsearch.randomizedtesting.rules.StatementAdapter.evaluate(StatementAdapter.java:36)
> at org.apache.lucene.util.TestRuleAssertionsRequired$1.evaluate(TestRuleAssertionsRequired.java:53)
> at org.apache.lucene.util.TestRuleMarkFailure$1.evaluate(TestRuleMarkFailure.java:47)
> at org.apache.lucene.util.TestRuleIgnoreAfterMaxFailures$1.evaluate(TestRuleIgnoreAfterMaxFailures.java:64)
> at org.apache.lucene.util.TestRuleIgnoreTestSuites$1.evaluate(TestRuleIgnoreTestSuites.java:54)
> at com.carrotsearch.randomizedtesting.rules.StatementAdapter.evaluate(StatementAdapter.java:36)
> at com.carrotsearch.randomizedtesting.ThreadLeakControl$StatementRunner.run(ThreadLeakControl.java:367)
> at java.lang.Thread.run(Thread.java:745)
>
>
>
>
> Build Log:
> [...truncated 1052 lines...]
> [junit4] Suite: org.apache.lucene.codecs.perfield.TestPerFieldPostingsFormat2
> [junit4] 2> NOTE: reproduce with: ant test -Dtestcase=TestPerFieldPostingsFormat2 -Dtests.method=testMergeCalledOnTwoFormats -Dtests.seed=9C8B401EAF454DD -Dtests.slow=true -Dtests.locale=nn-NO -Dtests.timezone=Kwajalein -Dtests.asserts=true -Dtests.file.encoding=ISO-8859-1
> [junit4] FAILURE 0.01s J0 | TestPerFieldPostingsFormat2.testMergeCalledOnTwoFormats <<<
> [junit4] > Throwable #1: java.lang.AssertionError: expected:<1> but was:<2>
> [junit4] > at __randomizedtesting.SeedInfo.seed([9C8B401EAF454DD:34F486948DF8FDF0]:0)
> [junit4] > at org.apache.lucene.codecs.perfield.TestPerFieldPostingsFormat2.testMergeCalledOnTwoFormats(TestPerFieldPostingsFormat2.java:387)
> [junit4] > at java.lang.Thread.run(Thread.java:745)
> [junit4] 2> NOTE: test params are: codec=HighCompressionCompressingStoredFields(storedFieldsFormat=CompressingStoredFieldsFormat(compressionMode=HIGH_COMPRESSION, chunkSize=9, maxDocsPerChunk=9, blockSize=63), termVectorsFormat=CompressingTermVectorsFormat(compressionMode=HIGH_COMPRESSION, chunkSize=9, blockSize=63)), sim=RandomSimilarity(queryNorm=false,coord=yes): {date=DFR GL3(800.0), 44=DFR I(F)3(800.0), 45=DFR I(F)1, 24=IB SPL-L2, 46=IB LL-D2, 25=DFR I(n)2, 26=DFR I(F)L3(800.0), 27=DFR I(ne)B3(800.0), content=IB LL-L3(800.0), id=ClassicSimilarity, 30=DFI(ChiSquared), 10=DFR I(n)Z(0.3), 32=DFR G3(800.0), 11=LM Jelinek-Mercer(0.700000), 13=DFR I(ne)B1, 36=DFR GL3(800.0), 15=DFR I(n)1, 16=IB LL-L3(800.0), 38=IB SPL-L1, 39=DFR I(ne)B2, 18=DFI(Saturated), 1=LM Jelinek-Mercer(0.700000), 2=DFR I(F)2, 3=DFR I(ne)B1, 9=DFR GB1, 41=DFR I(n)B3(800.0), 20=DFR I(n)B2, 42=DFR GZ(0.3)}, locale=nn-NO, timezone=Kwajalein
> [junit4] 2> NOTE: SunOS 5.11 amd64/Oracle Corporation 1.8.0_102 (64-bit)/cpus=3,threads=1,free=227618264,total=354795520
> [junit4] 2> NOTE: All tests run in this JVM: [TestIndexWriterForceMerge, TestTryDelete, TestUTF32ToUTF8, TestDirectoryReader, TestPolygon2D, TestBM25Similarity, MultiCollectorTest, TestArrayUtil, Test2BBKDPoints, TestTopDocsMerge, TestGeoUtils, TestFilterSpans, TestParallelLeafReader, TestCrash, Test2BPositions, TestCharFilter, TestCrashCausesCorruptIndex, TestDocInverterPerFieldErrorInfo, TestLucene50StoredFieldsFormatHighCompression, TestIndexWriterMerging, TestExitableDirectoryReader, TestDemoParallelLeafReader, TestDocsAndPositions, TestSpanNearQuery, TestLRUQueryCache, TestFlushByRamOrCountsPolicy, TestAllFilesHaveCodecHeader, TestRecyclingIntBlockAllocator, TestMaxPosition, TestIndexWriter, TestIndexWriterOutOfFileDescriptors, TestMinShouldMatch2, TestCheckIndex, TestIntsRef, TestNamedSPILoader, TestSparseFixedBitSet, TestDocCount, TestPhraseQuery, TestBinaryTerms, TestMergedIterator, TestLegacyNumericUtils, TestBytesRefArray, TestSpanCollection, TestTerms, TestLogMergePolicy, TestDocValuesScoring, TestSimpleExplanationsWithFillerDocs, TestBagOfPositions, TestSpanOrQuery, TestTermScorer, TestSimpleFSLockFactory, TestNeedsScores, TestMixedCodecs, TestSortRandom, TestSearchForDuplicates, TestRecyclingByteBlockAllocator, TestStopFilter, TestLucene50FieldInfoFormat, TestParallelReaderEmptyIndex, TestQueryBuilder, Test4GBStoredFields, TestSpanSearchEquivalence, TestWeakIdentityMap, TestBufferedIndexInput, TestPointValues, TestMultiValuedNumericRangeQuery, LimitedFiniteStringsIteratorTest, TestAssertions, TestBinaryDocument, TestSleepingLockWrapper, TestPrefixInBooleanQuery, TestBooleanMinShouldMatch, TestCloseableThreadLocal, TestSmallFloat, TestExternalCodecs, TestGrowableByteArrayDataOutput, TestLSBRadixSorter, TestMinimize, TestDocIdsWriter, TestTwoPhaseCommitTool, TestFilterDirectoryReader, TestRoaringDocIdSet, TestMSBRadixSorter, TestAllFilesCheckIndexHeader, TestRateLimiter, TestMultiPhraseEnum, TestTermsEnum, TestSwappedIndexFiles, TestIndexWriterWithThreads, TestTimeLimitingCollector, TestSetOnce, TestStringMSBRadixSorter, TestAllFilesHaveChecksumFooter, TestBlendedTermQuery, TestHighCompressionMode, TestFieldCacheRewriteMethod, TestRAMDirectory, TestFastDecompressionMode, TestShardSearching, TestThreadedForceMerge, TestPagedBytes, TestNIOFSDirectory, TestSpanExplanationsOfNonMatches, TestDuelingCodecsAtNight, TestIndexCommit, TestSpansEnum, TestTimSorterWorstCase, TestLucene60PointsFormat, TestBytesRef, TestPhrasePrefixQuery, TestBoolean2, TestAtomicUpdate, TestSearchAfter, TestConcurrentMergeScheduler, TestStressIndexing, TestNRTReaderWithThreads, TestConsistentFieldNumbers, TestSimpleExplanations, TestSegmentMerger, TestRegexpRandom2, TestNRTCachingDirectory, TestMultiThreadTermVectors, TestPerFieldPostingsFormat2]
> [junit4] Completed [259/439 (1!)] on J0 in 0.24s, 6 tests, 1 failure <<< FAILURES!
>
> [...truncated 71928 lines...]
>
>
>
> ---------------------------------------------------------------------
> To unsubscribe, e-mail: dev-unsubscribe@lucene.apache.org
> For additional commands, e-mail: dev-help@lucene.apache.org
---------------------------------------------------------------------
To unsubscribe, e-mail: dev-unsubscribe@lucene.apache.org
For additional commands, e-mail: dev-help@lucene.apache.org
[JENKINS] Lucene-Solr-6.x-Solaris (64bit/jdk1.8.0) - Build # 432 -
Unstable!
Posted by Policeman Jenkins Server <je...@thetaphi.de>.
Build: https://jenkins.thetaphi.de/job/Lucene-Solr-6.x-Solaris/432/
Java: 64bit/jdk1.8.0 -XX:-UseCompressedOops -XX:+UseSerialGC
1 tests failed.
FAILED: org.apache.lucene.codecs.perfield.TestPerFieldPostingsFormat2.testMergeCalledOnTwoFormats
Error Message:
expected:<1> but was:<2>
Stack Trace:
java.lang.AssertionError: expected:<1> but was:<2>
at __randomizedtesting.SeedInfo.seed([9C8B401EAF454DD:34F486948DF8FDF0]:0)
at org.junit.Assert.fail(Assert.java:93)
at org.junit.Assert.failNotEquals(Assert.java:647)
at org.junit.Assert.assertEquals(Assert.java:128)
at org.junit.Assert.assertEquals(Assert.java:472)
at org.junit.Assert.assertEquals(Assert.java:456)
at org.apache.lucene.codecs.perfield.TestPerFieldPostingsFormat2.testMergeCalledOnTwoFormats(TestPerFieldPostingsFormat2.java:387)
at sun.reflect.NativeMethodAccessorImpl.invoke0(Native Method)
at sun.reflect.NativeMethodAccessorImpl.invoke(NativeMethodAccessorImpl.java:62)
at sun.reflect.DelegatingMethodAccessorImpl.invoke(DelegatingMethodAccessorImpl.java:43)
at java.lang.reflect.Method.invoke(Method.java:498)
at com.carrotsearch.randomizedtesting.RandomizedRunner.invoke(RandomizedRunner.java:1764)
at com.carrotsearch.randomizedtesting.RandomizedRunner$8.evaluate(RandomizedRunner.java:871)
at com.carrotsearch.randomizedtesting.RandomizedRunner$9.evaluate(RandomizedRunner.java:907)
at com.carrotsearch.randomizedtesting.RandomizedRunner$10.evaluate(RandomizedRunner.java:921)
at org.apache.lucene.util.TestRuleSetupTeardownChained$1.evaluate(TestRuleSetupTeardownChained.java:49)
at org.apache.lucene.util.AbstractBeforeAfterRule$1.evaluate(AbstractBeforeAfterRule.java:45)
at org.apache.lucene.util.TestRuleThreadAndTestName$1.evaluate(TestRuleThreadAndTestName.java:48)
at org.apache.lucene.util.TestRuleIgnoreAfterMaxFailures$1.evaluate(TestRuleIgnoreAfterMaxFailures.java:64)
at org.apache.lucene.util.TestRuleMarkFailure$1.evaluate(TestRuleMarkFailure.java:47)
at com.carrotsearch.randomizedtesting.rules.StatementAdapter.evaluate(StatementAdapter.java:36)
at com.carrotsearch.randomizedtesting.ThreadLeakControl$StatementRunner.run(ThreadLeakControl.java:367)
at com.carrotsearch.randomizedtesting.ThreadLeakControl.forkTimeoutingTask(ThreadLeakControl.java:809)
at com.carrotsearch.randomizedtesting.ThreadLeakControl$3.evaluate(ThreadLeakControl.java:460)
at com.carrotsearch.randomizedtesting.RandomizedRunner.runSingleTest(RandomizedRunner.java:880)
at com.carrotsearch.randomizedtesting.RandomizedRunner$5.evaluate(RandomizedRunner.java:781)
at com.carrotsearch.randomizedtesting.RandomizedRunner$6.evaluate(RandomizedRunner.java:816)
at com.carrotsearch.randomizedtesting.RandomizedRunner$7.evaluate(RandomizedRunner.java:827)
at org.apache.lucene.util.AbstractBeforeAfterRule$1.evaluate(AbstractBeforeAfterRule.java:45)
at com.carrotsearch.randomizedtesting.rules.StatementAdapter.evaluate(StatementAdapter.java:36)
at org.apache.lucene.util.TestRuleStoreClassName$1.evaluate(TestRuleStoreClassName.java:41)
at com.carrotsearch.randomizedtesting.rules.NoShadowingOrOverridesOnMethodsRule$1.evaluate(NoShadowingOrOverridesOnMethodsRule.java:40)
at com.carrotsearch.randomizedtesting.rules.NoShadowingOrOverridesOnMethodsRule$1.evaluate(NoShadowingOrOverridesOnMethodsRule.java:40)
at com.carrotsearch.randomizedtesting.rules.StatementAdapter.evaluate(StatementAdapter.java:36)
at com.carrotsearch.randomizedtesting.rules.StatementAdapter.evaluate(StatementAdapter.java:36)
at com.carrotsearch.randomizedtesting.rules.StatementAdapter.evaluate(StatementAdapter.java:36)
at org.apache.lucene.util.TestRuleAssertionsRequired$1.evaluate(TestRuleAssertionsRequired.java:53)
at org.apache.lucene.util.TestRuleMarkFailure$1.evaluate(TestRuleMarkFailure.java:47)
at org.apache.lucene.util.TestRuleIgnoreAfterMaxFailures$1.evaluate(TestRuleIgnoreAfterMaxFailures.java:64)
at org.apache.lucene.util.TestRuleIgnoreTestSuites$1.evaluate(TestRuleIgnoreTestSuites.java:54)
at com.carrotsearch.randomizedtesting.rules.StatementAdapter.evaluate(StatementAdapter.java:36)
at com.carrotsearch.randomizedtesting.ThreadLeakControl$StatementRunner.run(ThreadLeakControl.java:367)
at java.lang.Thread.run(Thread.java:745)
Build Log:
[...truncated 1052 lines...]
[junit4] Suite: org.apache.lucene.codecs.perfield.TestPerFieldPostingsFormat2
[junit4] 2> NOTE: reproduce with: ant test -Dtestcase=TestPerFieldPostingsFormat2 -Dtests.method=testMergeCalledOnTwoFormats -Dtests.seed=9C8B401EAF454DD -Dtests.slow=true -Dtests.locale=nn-NO -Dtests.timezone=Kwajalein -Dtests.asserts=true -Dtests.file.encoding=ISO-8859-1
[junit4] FAILURE 0.01s J0 | TestPerFieldPostingsFormat2.testMergeCalledOnTwoFormats <<<
[junit4] > Throwable #1: java.lang.AssertionError: expected:<1> but was:<2>
[junit4] > at __randomizedtesting.SeedInfo.seed([9C8B401EAF454DD:34F486948DF8FDF0]:0)
[junit4] > at org.apache.lucene.codecs.perfield.TestPerFieldPostingsFormat2.testMergeCalledOnTwoFormats(TestPerFieldPostingsFormat2.java:387)
[junit4] > at java.lang.Thread.run(Thread.java:745)
[junit4] 2> NOTE: test params are: codec=HighCompressionCompressingStoredFields(storedFieldsFormat=CompressingStoredFieldsFormat(compressionMode=HIGH_COMPRESSION, chunkSize=9, maxDocsPerChunk=9, blockSize=63), termVectorsFormat=CompressingTermVectorsFormat(compressionMode=HIGH_COMPRESSION, chunkSize=9, blockSize=63)), sim=RandomSimilarity(queryNorm=false,coord=yes): {date=DFR GL3(800.0), 44=DFR I(F)3(800.0), 45=DFR I(F)1, 24=IB SPL-L2, 46=IB LL-D2, 25=DFR I(n)2, 26=DFR I(F)L3(800.0), 27=DFR I(ne)B3(800.0), content=IB LL-L3(800.0), id=ClassicSimilarity, 30=DFI(ChiSquared), 10=DFR I(n)Z(0.3), 32=DFR G3(800.0), 11=LM Jelinek-Mercer(0.700000), 13=DFR I(ne)B1, 36=DFR GL3(800.0), 15=DFR I(n)1, 16=IB LL-L3(800.0), 38=IB SPL-L1, 39=DFR I(ne)B2, 18=DFI(Saturated), 1=LM Jelinek-Mercer(0.700000), 2=DFR I(F)2, 3=DFR I(ne)B1, 9=DFR GB1, 41=DFR I(n)B3(800.0), 20=DFR I(n)B2, 42=DFR GZ(0.3)}, locale=nn-NO, timezone=Kwajalein
[junit4] 2> NOTE: SunOS 5.11 amd64/Oracle Corporation 1.8.0_102 (64-bit)/cpus=3,threads=1,free=227618264,total=354795520
[junit4] 2> NOTE: All tests run in this JVM: [TestIndexWriterForceMerge, TestTryDelete, TestUTF32ToUTF8, TestDirectoryReader, TestPolygon2D, TestBM25Similarity, MultiCollectorTest, TestArrayUtil, Test2BBKDPoints, TestTopDocsMerge, TestGeoUtils, TestFilterSpans, TestParallelLeafReader, TestCrash, Test2BPositions, TestCharFilter, TestCrashCausesCorruptIndex, TestDocInverterPerFieldErrorInfo, TestLucene50StoredFieldsFormatHighCompression, TestIndexWriterMerging, TestExitableDirectoryReader, TestDemoParallelLeafReader, TestDocsAndPositions, TestSpanNearQuery, TestLRUQueryCache, TestFlushByRamOrCountsPolicy, TestAllFilesHaveCodecHeader, TestRecyclingIntBlockAllocator, TestMaxPosition, TestIndexWriter, TestIndexWriterOutOfFileDescriptors, TestMinShouldMatch2, TestCheckIndex, TestIntsRef, TestNamedSPILoader, TestSparseFixedBitSet, TestDocCount, TestPhraseQuery, TestBinaryTerms, TestMergedIterator, TestLegacyNumericUtils, TestBytesRefArray, TestSpanCollection, TestTerms, TestLogMergePolicy, TestDocValuesScoring, TestSimpleExplanationsWithFillerDocs, TestBagOfPositions, TestSpanOrQuery, TestTermScorer, TestSimpleFSLockFactory, TestNeedsScores, TestMixedCodecs, TestSortRandom, TestSearchForDuplicates, TestRecyclingByteBlockAllocator, TestStopFilter, TestLucene50FieldInfoFormat, TestParallelReaderEmptyIndex, TestQueryBuilder, Test4GBStoredFields, TestSpanSearchEquivalence, TestWeakIdentityMap, TestBufferedIndexInput, TestPointValues, TestMultiValuedNumericRangeQuery, LimitedFiniteStringsIteratorTest, TestAssertions, TestBinaryDocument, TestSleepingLockWrapper, TestPrefixInBooleanQuery, TestBooleanMinShouldMatch, TestCloseableThreadLocal, TestSmallFloat, TestExternalCodecs, TestGrowableByteArrayDataOutput, TestLSBRadixSorter, TestMinimize, TestDocIdsWriter, TestTwoPhaseCommitTool, TestFilterDirectoryReader, TestRoaringDocIdSet, TestMSBRadixSorter, TestAllFilesCheckIndexHeader, TestRateLimiter, TestMultiPhraseEnum, TestTermsEnum, TestSwappedIndexFiles, TestIndexWriterWithThreads, TestTimeLimitingCollector, TestSetOnce, TestStringMSBRadixSorter, TestAllFilesHaveChecksumFooter, TestBlendedTermQuery, TestHighCompressionMode, TestFieldCacheRewriteMethod, TestRAMDirectory, TestFastDecompressionMode, TestShardSearching, TestThreadedForceMerge, TestPagedBytes, TestNIOFSDirectory, TestSpanExplanationsOfNonMatches, TestDuelingCodecsAtNight, TestIndexCommit, TestSpansEnum, TestTimSorterWorstCase, TestLucene60PointsFormat, TestBytesRef, TestPhrasePrefixQuery, TestBoolean2, TestAtomicUpdate, TestSearchAfter, TestConcurrentMergeScheduler, TestStressIndexing, TestNRTReaderWithThreads, TestConsistentFieldNumbers, TestSimpleExplanations, TestSegmentMerger, TestRegexpRandom2, TestNRTCachingDirectory, TestMultiThreadTermVectors, TestPerFieldPostingsFormat2]
[junit4] Completed [259/439 (1!)] on J0 in 0.24s, 6 tests, 1 failure <<< FAILURES!
[...truncated 71928 lines...]