You are viewing a plain text version of this content. The canonical link for it is here.
Posted to dev@kafka.apache.org by Apache Jenkins Server <je...@builds.apache.org> on 2016/03/10 10:33:33 UTC
Build failed in Jenkins: kafka-trunk-jdk7 #1106
See <https://builds.apache.org/job/kafka-trunk-jdk7/1106/changes>
Changes:
[cshapi] MINOR: KAFKA-3361 follow up
------------------------------------------
[...truncated 1510 lines...]
kafka.api.AdminClientTest > testListGroups PASSED
kafka.api.AdminClientTest > testDescribeConsumerGroupForNonExistentGroup PASSED
kafka.api.ApiUtilsTest > testShortStringNonASCII PASSED
kafka.api.ApiUtilsTest > testShortStringASCII PASSED
kafka.api.PlaintextConsumerTest > testPartitionsForAutoCreate PASSED
kafka.api.PlaintextConsumerTest > testShrinkingTopicSubscriptions PASSED
kafka.api.PlaintextConsumerTest > testMultiConsumerSessionTimeoutOnStopPolling PASSED
kafka.api.PlaintextConsumerTest > testPartitionsForInvalidTopic PASSED
kafka.api.PlaintextConsumerTest > testSeek PASSED
kafka.api.PlaintextConsumerTest > testPositionAndCommit PASSED
kafka.api.PlaintextConsumerTest > testMultiConsumerSessionTimeoutOnClose PASSED
kafka.api.PlaintextConsumerTest > testFetchRecordTooLarge PASSED
kafka.api.PlaintextConsumerTest > testMultiConsumerDefaultAssignment PASSED
kafka.api.PlaintextConsumerTest > testAutoCommitOnClose PASSED
kafka.api.PlaintextConsumerTest > testExpandingTopicSubscriptions PASSED
kafka.api.PlaintextConsumerTest > testInterceptors PASSED
kafka.api.PlaintextConsumerTest > testPatternUnsubscription PASSED
kafka.api.PlaintextConsumerTest > testGroupConsumption PASSED
kafka.api.PlaintextConsumerTest > testPartitionsFor PASSED
kafka.api.PlaintextConsumerTest > testInterceptorsWithWrongKeyValue PASSED
kafka.api.PlaintextConsumerTest > testMultiConsumerRoundRobinAssignment PASSED
kafka.api.PlaintextConsumerTest > testPartitionPauseAndResume PASSED
kafka.api.PlaintextConsumerTest > testConsumeMessagesWithLogAppendTime PASSED
kafka.api.PlaintextConsumerTest > testAutoCommitOnCloseAfterWakeup PASSED
kafka.api.PlaintextConsumerTest > testMaxPollRecords PASSED
kafka.api.PlaintextConsumerTest > testAutoOffsetReset PASSED
kafka.api.PlaintextConsumerTest > testFetchInvalidOffset PASSED
kafka.api.PlaintextConsumerTest > testAutoCommitIntercept PASSED
kafka.api.PlaintextConsumerTest > testCommitMetadata PASSED
kafka.api.PlaintextConsumerTest > testRoundRobinAssignment PASSED
kafka.api.PlaintextConsumerTest > testPatternSubscription PASSED
kafka.api.PlaintextConsumerTest > testPauseStateNotPreservedByRebalance PASSED
kafka.api.PlaintextConsumerTest > testUnsubscribeTopic PASSED
kafka.api.PlaintextConsumerTest > testListTopics PASSED
kafka.api.PlaintextConsumerTest > testAutoCommitOnRebalance FAILED
java.lang.AssertionError: Expected partitions [topic-0, topic-1, topic2-0, topic2-1] but actually got [topic-0, topic-1]
kafka.api.PlaintextConsumerTest > testSimpleConsumption PASSED
kafka.api.PlaintextConsumerTest > testPartitionReassignmentCallback PASSED
kafka.api.PlaintextConsumerTest > testCommitSpecifiedOffsets PASSED
kafka.api.ProducerBounceTest > testBrokerFailure PASSED
kafka.api.ProducerFailureHandlingTest > testCannotSendToInternalTopic PASSED
kafka.api.ProducerFailureHandlingTest > testTooLargeRecordWithAckOne PASSED
kafka.api.ProducerFailureHandlingTest > testWrongBrokerList PASSED
kafka.api.ProducerFailureHandlingTest > testNotEnoughReplicas PASSED
kafka.api.ProducerFailureHandlingTest > testNonExistentTopic PASSED
kafka.api.ProducerFailureHandlingTest > testInvalidPartition PASSED
kafka.api.ProducerFailureHandlingTest > testSendAfterClosed PASSED
kafka.api.ProducerFailureHandlingTest > testTooLargeRecordWithAckZero PASSED
kafka.api.ProducerFailureHandlingTest > testNotEnoughReplicasAfterBrokerShutdown PASSED
kafka.api.SaslPlaintextConsumerTest > testPauseStateNotPreservedByRebalance PASSED
kafka.api.SaslPlaintextConsumerTest > testUnsubscribeTopic PASSED
kafka.api.SaslPlaintextConsumerTest > testListTopics PASSED
kafka.api.SaslPlaintextConsumerTest > testAutoCommitOnRebalance PASSED
kafka.api.SaslPlaintextConsumerTest > testSimpleConsumption PASSED
kafka.api.SaslPlaintextConsumerTest > testPartitionReassignmentCallback PASSED
kafka.api.SaslPlaintextConsumerTest > testCommitSpecifiedOffsets PASSED
kafka.api.SslConsumerTest > testPauseStateNotPreservedByRebalance PASSED
kafka.api.SslConsumerTest > testUnsubscribeTopic PASSED
kafka.api.SslConsumerTest > testListTopics PASSED
kafka.api.SslConsumerTest > testAutoCommitOnRebalance PASSED
kafka.api.SslConsumerTest > testSimpleConsumption PASSED
kafka.api.SslConsumerTest > testPartitionReassignmentCallback PASSED
kafka.api.SslConsumerTest > testCommitSpecifiedOffsets PASSED
kafka.api.ConsumerBounceTest > testSeekAndCommitWithBrokerFailures PASSED
kafka.api.ConsumerBounceTest > testConsumptionWithBrokerFailures PASSED
kafka.api.AuthorizerIntegrationTest > testCommitWithTopicWrite PASSED
kafka.api.AuthorizerIntegrationTest > testConsumeWithNoTopicAccess PASSED
kafka.api.AuthorizerIntegrationTest > testCreatePermissionNeededToReadFromNonExistentTopic PASSED
kafka.api.AuthorizerIntegrationTest > testOffsetFetchWithNoAccess PASSED
kafka.api.AuthorizerIntegrationTest > testListOfsetsWithTopicDescribe PASSED
kafka.api.AuthorizerIntegrationTest > testProduceWithTopicRead PASSED
kafka.api.AuthorizerIntegrationTest > testListOffsetsWithNoTopicAccess PASSED
kafka.api.AuthorizerIntegrationTest > testCreatePermissionNeededForWritingToNonExistentTopic PASSED
kafka.api.AuthorizerIntegrationTest > testConsumeWithNoGroupAccess PASSED
kafka.api.AuthorizerIntegrationTest > testConsumeWithTopicDescribe PASSED
kafka.api.AuthorizerIntegrationTest > testOffsetFetchWithNoTopicAccess PASSED
kafka.api.AuthorizerIntegrationTest > testCommitWithNoTopicAccess PASSED
kafka.api.AuthorizerIntegrationTest > testProduceWithNoTopicAccess PASSED
kafka.api.AuthorizerIntegrationTest > testProduceWithTopicWrite PASSED
kafka.api.AuthorizerIntegrationTest > testAuthorization PASSED
kafka.api.AuthorizerIntegrationTest > testConsumeWithTopicAndGroupRead PASSED
kafka.api.AuthorizerIntegrationTest > testConsumeWithTopicWrite PASSED
kafka.api.AuthorizerIntegrationTest > testOffsetFetchWithNoGroupAccess PASSED
kafka.api.AuthorizerIntegrationTest > testCommitWithNoAccess PASSED
kafka.api.AuthorizerIntegrationTest > testCommitWithNoGroupAccess PASSED
kafka.api.AuthorizerIntegrationTest > testConsumeWithNoAccess PASSED
kafka.api.AuthorizerIntegrationTest > testOffsetFetchWithTopicAndGroupRead PASSED
kafka.api.AuthorizerIntegrationTest > testCommitWithTopicDescribe PASSED
kafka.api.AuthorizerIntegrationTest > testProduceWithTopicDescribe PASSED
kafka.api.AuthorizerIntegrationTest > testOffsetFetchTopicDescribe PASSED
kafka.api.AuthorizerIntegrationTest > testCommitWithTopicAndGroupRead PASSED
kafka.api.RequestResponseSerializationTest > testSerializationAndDeserialization PASSED
kafka.api.RequestResponseSerializationTest > testFetchResponseVersion PASSED
kafka.api.RequestResponseSerializationTest > testProduceResponseVersion PASSED
kafka.api.SaslSslConsumerTest > testPauseStateNotPreservedByRebalance PASSED
kafka.api.SaslSslConsumerTest > testUnsubscribeTopic PASSED
kafka.api.SaslSslConsumerTest > testListTopics PASSED
kafka.api.SaslSslConsumerTest > testAutoCommitOnRebalance PASSED
kafka.api.SaslSslConsumerTest > testSimpleConsumption PASSED
kafka.api.SaslSslConsumerTest > testPartitionReassignmentCallback PASSED
kafka.api.SaslSslConsumerTest > testCommitSpecifiedOffsets PASSED
kafka.api.test.ProducerCompressionTest > testCompression[0] PASSED
kafka.api.test.ProducerCompressionTest > testCompression[1] PASSED
kafka.api.test.ProducerCompressionTest > testCompression[2] PASSED
kafka.api.test.ProducerCompressionTest > testCompression[3] PASSED
kafka.controller.ControllerFailoverTest > testMetadataUpdate PASSED
kafka.tools.ConsoleProducerTest > testParseKeyProp PASSED
kafka.tools.ConsoleProducerTest > testValidConfigsOldProducer PASSED
kafka.tools.ConsoleProducerTest > testInvalidConfigs PASSED
kafka.tools.ConsoleProducerTest > testValidConfigsNewProducer PASSED
kafka.tools.ConsoleConsumerTest > shouldLimitReadsToMaxMessageLimit PASSED
kafka.tools.ConsoleConsumerTest > shouldParseValidNewConsumerValidConfig PASSED
kafka.tools.ConsoleConsumerTest > shouldParseConfigsFromFile PASSED
kafka.tools.ConsoleConsumerTest > shouldParseValidOldConsumerValidConfig PASSED
696 tests completed, 1 failed
:kafka-trunk-jdk7:core:test FAILED
:test_core_2_10 FAILED
FAILURE: Build failed with an exception.
* What went wrong:
Execution failed for task ':core:test'.
> There were failing tests. See the report at: file://<https://builds.apache.org/job/kafka-trunk-jdk7/ws/core/build/reports/tests/index.html>
* Try:
Run with --stacktrace option to get the stack trace. Run with --info or --debug option to get more log output.
BUILD FAILED
Total time: 1 hrs 37 mins 23.231 secs
Build step 'Execute shell' marked build as failure
Recording test results
Setting GRADLE_2_4_RC_2_HOME=/home/jenkins/jenkins-slave/tools/hudson.plugins.gradle.GradleInstallation/Gradle_2.4-rc-2
Setting JDK_1_7U51_HOME=/home/jenkins/jenkins-slave/tools/hudson.model.JDK/jdk-1.7u51
Setting GRADLE_2_4_RC_2_HOME=/home/jenkins/jenkins-slave/tools/hudson.plugins.gradle.GradleInstallation/Gradle_2.4-rc-2
Setting JDK_1_7U51_HOME=/home/jenkins/jenkins-slave/tools/hudson.model.JDK/jdk-1.7u51
Jenkins build is back to normal : kafka-trunk-jdk7 #1108
Posted by Apache Jenkins Server <je...@builds.apache.org>.
See <https://builds.apache.org/job/kafka-trunk-jdk7/1108/changes>
Build failed in Jenkins: kafka-trunk-jdk7 #1107
Posted by Apache Jenkins Server <je...@builds.apache.org>.
See <https://builds.apache.org/job/kafka-trunk-jdk7/1107/changes>
Changes:
[me] KAFKA-3344: Remove previous system test's leftover test-log4j.properties
------------------------------------------
[...truncated 110 lines...]
:kafka-trunk-jdk7:clients:classes UP-TO-DATE
:kafka-trunk-jdk7:clients:determineCommitId UP-TO-DATE
:kafka-trunk-jdk7:clients:createVersionFile
:kafka-trunk-jdk7:clients:jar UP-TO-DATE
:kafka-trunk-jdk7:core:compileJava UP-TO-DATE
:kafka-trunk-jdk7:core:compileScala
Download https://repo1.maven.org/maven2/org/scala-lang/scala-library/2.11.8/scala-library-2.11.8.pom
Download https://repo1.maven.org/maven2/org/scala-lang/scala-library/2.11.8/scala-library-2.11.8.jar
Download https://repo1.maven.org/maven2/org/scala-lang/scala-compiler/2.11.8/scala-compiler-2.11.8.pom
Download https://repo1.maven.org/maven2/org/scala-lang/scala-reflect/2.11.8/scala-reflect-2.11.8.pom
Download https://repo1.maven.org/maven2/org/scala-lang/scala-compiler/2.11.8/scala-compiler-2.11.8.jar
Download https://repo1.maven.org/maven2/org/scala-lang/scala-reflect/2.11.8/scala-reflect-2.11.8.jar
ERROR: Could not install GRADLE_2_4_RC_2_HOME
java.lang.NullPointerException
at hudson.plugins.toolenv.ToolEnvBuildWrapper$1.buildEnvVars(ToolEnvBuildWrapper.java:46)
at hudson.model.AbstractBuild.getEnvironment(AbstractBuild.java:947)
at hudson.plugins.git.GitSCM.getParamExpandedRepos(GitSCM.java:390)
at hudson.plugins.git.GitSCM.compareRemoteRevisionWithImpl(GitSCM.java:577)
at hudson.plugins.git.GitSCM.compareRemoteRevisionWith(GitSCM.java:527)
at hudson.scm.SCM.compareRemoteRevisionWith(SCM.java:381)
at hudson.scm.SCM.poll(SCM.java:398)
at hudson.model.AbstractProject._poll(AbstractProject.java:1453)
at hudson.model.AbstractProject.poll(AbstractProject.java:1356)
at hudson.triggers.SCMTrigger$Runner.runPolling(SCMTrigger.java:526)
at hudson.triggers.SCMTrigger$Runner.run(SCMTrigger.java:555)
at hudson.util.SequentialExecutionQueue$QueueEntry.run(SequentialExecutionQueue.java:119)
at java.util.concurrent.Executors$RunnableAdapter.call(Executors.java:471)
at java.util.concurrent.FutureTask.run(FutureTask.java:262)
at java.util.concurrent.ThreadPoolExecutor.runWorker(ThreadPoolExecutor.java:1145)
at java.util.concurrent.ThreadPoolExecutor$Worker.run(ThreadPoolExecutor.java:615)
at java.lang.Thread.run(Thread.java:745)
ERROR: Could not install JDK_1_7U51_HOME
java.lang.NullPointerException
at hudson.plugins.toolenv.ToolEnvBuildWrapper$1.buildEnvVars(ToolEnvBuildWrapper.java:46)
at hudson.model.AbstractBuild.getEnvironment(AbstractBuild.java:947)
at hudson.plugins.git.GitSCM.getParamExpandedRepos(GitSCM.java:390)
at hudson.plugins.git.GitSCM.compareRemoteRevisionWithImpl(GitSCM.java:577)
at hudson.plugins.git.GitSCM.compareRemoteRevisionWith(GitSCM.java:527)
at hudson.scm.SCM.compareRemoteRevisionWith(SCM.java:381)
at hudson.scm.SCM.poll(SCM.java:398)
at hudson.model.AbstractProject._poll(AbstractProject.java:1453)
at hudson.model.AbstractProject.poll(AbstractProject.java:1356)
at hudson.triggers.SCMTrigger$Runner.runPolling(SCMTrigger.java:526)
at hudson.triggers.SCMTrigger$Runner.run(SCMTrigger.java:555)
at hudson.util.SequentialExecutionQueue$QueueEntry.run(SequentialExecutionQueue.java:119)
at java.util.concurrent.Executors$RunnableAdapter.call(Executors.java:471)
at java.util.concurrent.FutureTask.run(FutureTask.java:262)
at java.util.concurrent.ThreadPoolExecutor.runWorker(ThreadPoolExecutor.java:1145)
at java.util.concurrent.ThreadPoolExecutor$Worker.run(ThreadPoolExecutor.java:615)
at java.lang.Thread.run(Thread.java:745)
<https://builds.apache.org/job/kafka-trunk-jdk7/ws/core/src/main/scala/kafka/api/OffsetCommitRequest.scala>:79: value DEFAULT_TIMESTAMP in object OffsetCommitRequest is deprecated: see corresponding Javadoc for more information.
org.apache.kafka.common.requests.OffsetCommitRequest.DEFAULT_TIMESTAMP
^
<https://builds.apache.org/job/kafka-trunk-jdk7/ws/core/src/main/scala/kafka/common/OffsetMetadataAndError.scala>:36: value DEFAULT_TIMESTAMP in object OffsetCommitRequest is deprecated: see corresponding Javadoc for more information.
commitTimestamp: Long = org.apache.kafka.common.requests.OffsetCommitRequest.DEFAULT_TIMESTAMP,
^
<https://builds.apache.org/job/kafka-trunk-jdk7/ws/core/src/main/scala/kafka/common/OffsetMetadataAndError.scala>:37: value DEFAULT_TIMESTAMP in object OffsetCommitRequest is deprecated: see corresponding Javadoc for more information.
expireTimestamp: Long = org.apache.kafka.common.requests.OffsetCommitRequest.DEFAULT_TIMESTAMP) {
^
<https://builds.apache.org/job/kafka-trunk-jdk7/ws/core/src/main/scala/kafka/coordinator/GroupMetadataManager.scala>:403: value DEFAULT_TIMESTAMP in object OffsetCommitRequest is deprecated: see corresponding Javadoc for more information.
if (value.expireTimestamp == org.apache.kafka.common.requests.OffsetCommitRequest.DEFAULT_TIMESTAMP)
^
<https://builds.apache.org/job/kafka-trunk-jdk7/ws/core/src/main/scala/kafka/server/KafkaApis.scala>:299: value DEFAULT_TIMESTAMP in object OffsetCommitRequest is deprecated: see corresponding Javadoc for more information.
if (partitionData.timestamp == OffsetCommitRequest.DEFAULT_TIMESTAMP)
^
<https://builds.apache.org/job/kafka-trunk-jdk7/ws/core/src/main/scala/kafka/server/KafkaServer.scala>:307: a pure expression does nothing in statement position; you may be omitting necessary parentheses
ControllerStats.uncleanLeaderElectionRate
^
<https://builds.apache.org/job/kafka-trunk-jdk7/ws/core/src/main/scala/kafka/server/KafkaServer.scala>:308: a pure expression does nothing in statement position; you may be omitting necessary parentheses
ControllerStats.leaderElectionTimer
^
<https://builds.apache.org/job/kafka-trunk-jdk7/ws/core/src/main/scala/kafka/admin/AclCommand.scala>:246: method readLine in class DeprecatedConsole is deprecated: Use the method in scala.io.StdIn
Console.readLine().equalsIgnoreCase("y")
^
<https://builds.apache.org/job/kafka-trunk-jdk7/ws/core/src/main/scala/kafka/admin/TopicCommand.scala>:371: method readLine in class DeprecatedConsole is deprecated: Use the method in scala.io.StdIn
if (!Console.readLine().equalsIgnoreCase("y")) {
^
<https://builds.apache.org/job/kafka-trunk-jdk7/ws/core/src/main/scala/kafka/controller/ControllerChannelManager.scala>:391: constructor UpdateMetadataRequest in class UpdateMetadataRequest is deprecated: see corresponding Javadoc for more information.
new UpdateMetadataRequest(controllerId, controllerEpoch, liveBrokers.asJava, partitionStates.asJava)
^
<https://builds.apache.org/job/kafka-trunk-jdk7/ws/core/src/main/scala/kafka/network/BlockingChannel.scala>:129: method readFromReadableChannel in class NetworkReceive is deprecated: see corresponding Javadoc for more information.
response.readFromReadableChannel(channel)
^
<https://builds.apache.org/job/kafka-trunk-jdk7/ws/core/src/main/scala/kafka/server/KafkaApis.scala>:299: value timestamp in class PartitionData is deprecated: see corresponding Javadoc for more information.
if (partitionData.timestamp == OffsetCommitRequest.DEFAULT_TIMESTAMP)
^
<https://builds.apache.org/job/kafka-trunk-jdk7/ws/core/src/main/scala/kafka/server/KafkaApis.scala>:302: value timestamp in class PartitionData is deprecated: see corresponding Javadoc for more information.
offsetRetention + partitionData.timestamp
^
there were 15 feature warnings; re-run with -feature for details
14 warnings found
:kafka-trunk-jdk7:core:processResources UP-TO-DATE
:kafka-trunk-jdk7:core:classes
:kafka-trunk-jdk7:clients:compileTestJava UP-TO-DATE
:kafka-trunk-jdk7:clients:processTestResources UP-TO-DATE
:kafka-trunk-jdk7:clients:testClasses UP-TO-DATE
:kafka-trunk-jdk7:core:copyDependantLibs
:kafka-trunk-jdk7:core:copyDependantTestLibs
:kafka-trunk-jdk7:core:jar
:clients:compileJava UP-TO-DATE
:clients:processResources UP-TO-DATE
:clients:classes UP-TO-DATE
:clients:determineCommitId UP-TO-DATE
:clients:createVersionFile
:clients:jar UP-TO-DATE
:core:compileJava UP-TO-DATE
:core:compileScala
<https://builds.apache.org/job/kafka-trunk-jdk7/ws/core/src/main/scala/kafka/api/OffsetCommitRequest.scala>:79: value DEFAULT_TIMESTAMP in object OffsetCommitRequest is deprecated: see corresponding Javadoc for more information.
org.apache.kafka.common.requests.OffsetCommitRequest.DEFAULT_TIMESTAMP
^
<https://builds.apache.org/job/kafka-trunk-jdk7/ws/core/src/main/scala/kafka/common/OffsetMetadataAndError.scala>:36: value DEFAULT_TIMESTAMP in object OffsetCommitRequest is deprecated: see corresponding Javadoc for more information.
commitTimestamp: Long = org.apache.kafka.common.requests.OffsetCommitRequest.DEFAULT_TIMESTAMP,
^
<https://builds.apache.org/job/kafka-trunk-jdk7/ws/core/src/main/scala/kafka/common/OffsetMetadataAndError.scala>:37: value DEFAULT_TIMESTAMP in object OffsetCommitRequest is deprecated: see corresponding Javadoc for more information.
expireTimestamp: Long = org.apache.kafka.common.requests.OffsetCommitRequest.DEFAULT_TIMESTAMP) {
^
<https://builds.apache.org/job/kafka-trunk-jdk7/ws/core/src/main/scala/kafka/coordinator/GroupMetadataManager.scala>:403: value DEFAULT_TIMESTAMP in object OffsetCommitRequest is deprecated: see corresponding Javadoc for more information.
if (value.expireTimestamp == org.apache.kafka.common.requests.OffsetCommitRequest.DEFAULT_TIMESTAMP)
^
<https://builds.apache.org/job/kafka-trunk-jdk7/ws/core/src/main/scala/kafka/server/KafkaApis.scala>:299: value DEFAULT_TIMESTAMP in object OffsetCommitRequest is deprecated: see corresponding Javadoc for more information.
if (partitionData.timestamp == OffsetCommitRequest.DEFAULT_TIMESTAMP)
^
<https://builds.apache.org/job/kafka-trunk-jdk7/ws/core/src/main/scala/kafka/server/KafkaServer.scala>:307: a pure expression does nothing in statement position; you may be omitting necessary parentheses
ControllerStats.uncleanLeaderElectionRate
^
<https://builds.apache.org/job/kafka-trunk-jdk7/ws/core/src/main/scala/kafka/server/KafkaServer.scala>:308: a pure expression does nothing in statement position; you may be omitting necessary parentheses
ControllerStats.leaderElectionTimer
^
<https://builds.apache.org/job/kafka-trunk-jdk7/ws/core/src/main/scala/kafka/controller/ControllerChannelManager.scala>:391: constructor UpdateMetadataRequest in class UpdateMetadataRequest is deprecated: see corresponding Javadoc for more information.
new UpdateMetadataRequest(controllerId, controllerEpoch, liveBrokers.asJava, partitionStates.asJava)
^
<https://builds.apache.org/job/kafka-trunk-jdk7/ws/core/src/main/scala/kafka/network/BlockingChannel.scala>:129: method readFromReadableChannel in class NetworkReceive is deprecated: see corresponding Javadoc for more information.
response.readFromReadableChannel(channel)
^
<https://builds.apache.org/job/kafka-trunk-jdk7/ws/core/src/main/scala/kafka/server/KafkaApis.scala>:299: value timestamp in class PartitionData is deprecated: see corresponding Javadoc for more information.
if (partitionData.timestamp == OffsetCommitRequest.DEFAULT_TIMESTAMP)
^
<https://builds.apache.org/job/kafka-trunk-jdk7/ws/core/src/main/scala/kafka/server/KafkaApis.scala>:302: value timestamp in class PartitionData is deprecated: see corresponding Javadoc for more information.
offsetRetention + partitionData.timestamp
^
there were 15 feature warning(s); re-run with -feature for details
12 warnings found
:core:processResources UP-TO-DATE
:core:classes
:clients:compileTestJava UP-TO-DATE
:clients:processTestResources UP-TO-DATE
:clients:testClasses UP-TO-DATE
:core:copyDependantLibs UP-TO-DATE
:core:copyDependantTestLibs
:core:jar UP-TO-DATE
:examples:compileJava
:examples:processResources UP-TO-DATE
:examples:classes
:examples:jar
:log4j-appender:compileJava
:log4j-appender:processResources UP-TO-DATE
:log4j-appender:classes
:log4j-appender:jar
:connect:api:compileJavaNote: <https://builds.apache.org/job/kafka-trunk-jdk7/ws/connect/api/src/main/java/org/apache/kafka/connect/data/Struct.java> uses unchecked or unsafe operations.
Note: Recompile with -Xlint:unchecked for details.
:connect:api:processResources UP-TO-DATE
:connect:api:classes
:connect:api:copyDependantLibs
:connect:api:jar
:connect:json:compileJavaNote: <https://builds.apache.org/job/kafka-trunk-jdk7/ws/connect/json/src/main/java/org/apache/kafka/connect/json/JsonConverter.java> uses or overrides a deprecated API.
Note: Recompile with -Xlint:deprecation for details.
:connect:json:processResources UP-TO-DATE
:connect:json:classes
:connect:json:copyDependantLibs
:connect:json:jar
:streams:compileJavaNote: Some input files use unchecked or unsafe operations.
Note: Recompile with -Xlint:unchecked for details.
:streams:processResources UP-TO-DATE
:streams:classes
:streams:copyDependantLibs
:streams:jar
:tools:compileJava
:tools:processResources UP-TO-DATE
:tools:classes
:tools:copyDependantLibs
:tools:jar
:connect:file:compileJava
:connect:file:processResources UP-TO-DATE
:connect:file:classes
:connect:file:copyDependantLibs
:connect:file:jar
:connect:runtime:compileJavaNote: Some input files use unchecked or unsafe operations.
Note: Recompile with -Xlint:unchecked for details.
:connect:runtime:processResources UP-TO-DATE
:connect:runtime:classes
:connect:runtime:copyDependantLibs
:connect:runtime:jar
:streams:examples:compileJava
:streams:examples:processResources UP-TO-DATE
:streams:examples:classes
:streams:examples:copyDependantLibs
:streams:examples:jar
:jarAll
:test_core_2_10
Building project 'core' with Scala version 2.10.6
:kafka-trunk-jdk7:clients:compileJava UP-TO-DATE
:kafka-trunk-jdk7:clients:processResources UP-TO-DATE
:kafka-trunk-jdk7:clients:classes UP-TO-DATE
:kafka-trunk-jdk7:clients:determineCommitId UP-TO-DATE
:kafka-trunk-jdk7:clients:createVersionFile
:kafka-trunk-jdk7:clients:jar UP-TO-DATE
:kafka-trunk-jdk7:clients:compileTestJava UP-TO-DATE
:kafka-trunk-jdk7:clients:processTestResources UP-TO-DATE
:kafka-trunk-jdk7:clients:testClasses UP-TO-DATE
:kafka-trunk-jdk7:core:compileJava UP-TO-DATE
:kafka-trunk-jdk7:core:compileScala UP-TO-DATE
:kafka-trunk-jdk7:core:processResources UP-TO-DATE
:kafka-trunk-jdk7:core:classes UP-TO-DATE
:kafka-trunk-jdk7:core:checkstyleMain
:kafka-trunk-jdk7:core:compileTestJava UP-TO-DATE
:kafka-trunk-jdk7:core:compileTestScala
<https://builds.apache.org/job/kafka-trunk-jdk7/ws/core/src/test/scala/integration/kafka/api/QuotasTest.scala>:74: value BLOCK_ON_BUFFER_FULL_CONFIG in object ProducerConfig is deprecated: see corresponding Javadoc for more information.
producerProps.put(ProducerConfig.BLOCK_ON_BUFFER_FULL_CONFIG, "false")
^
<https://builds.apache.org/job/kafka-trunk-jdk7/ws/core/src/test/scala/kafka/tools/TestLogCleaning.scala>:250: value BLOCK_ON_BUFFER_FULL_CONFIG in object ProducerConfig is deprecated: see corresponding Javadoc for more information.
producerProps.setProperty(ProducerConfig.BLOCK_ON_BUFFER_FULL_CONFIG, "true")
^
there were 4 feature warning(s); re-run with -feature for details
three warnings found
:kafka-trunk-jdk7:core:processTestResources
:test_core_2_10 FAILED
FAILURE: Build failed with an exception.
* What went wrong:
org.gradle.api.internal.changedetection.state.DefaultFileCollectionSnapshotter$FileCollectionSnapshotImpl cannot be cast to org.gradle.api.internal.changedetection.state.OutputFilesCollectionSnapshotter$OutputFilesSnapshot
* Try:
Run with --stacktrace option to get the stack trace. Run with --info or --debug option to get more log output.
BUILD FAILED
Total time: 10 mins 13.55 secs
Build step 'Execute shell' marked build as failure
Recording test results
Setting GRADLE_2_4_RC_2_HOME=/home/jenkins/jenkins-slave/tools/hudson.plugins.gradle.GradleInstallation/Gradle_2.4-rc-2
Setting JDK_1_7U51_HOME=/home/jenkins/jenkins-slave/tools/hudson.model.JDK/jdk-1.7u51
ERROR: Step ?Publish JUnit test result report? failed: No test report files were found. Configuration error?
Setting GRADLE_2_4_RC_2_HOME=/home/jenkins/jenkins-slave/tools/hudson.plugins.gradle.GradleInstallation/Gradle_2.4-rc-2
Setting JDK_1_7U51_HOME=/home/jenkins/jenkins-slave/tools/hudson.model.JDK/jdk-1.7u51