You are viewing a plain text version of this content. The canonical link for it is here.
Posted to builds@beam.apache.org by Apache Jenkins Server <je...@builds.apache.org> on 2022/08/22 22:51:27 UTC
Build failed in Jenkins: beam_PostCommit_XVR_Flink #5796
See <https://ci-beam.apache.org/job/beam_PostCommit_XVR_Flink/5796/display/redirect?page=changes>
Changes:
[Andrew Pilloud] Add Python nexmark to gradle
[Michael Luckey] Align neo4j error messages with API
[noreply] E2E basic state support (#22798)
[noreply] Add state integration test (#22815)
------------------------------------------
[...truncated 1.15 MB...]
INFO apache_beam.utils.subprocess_server:subprocess_server.py:132
INFO apache_beam.utils.subprocess_server:subprocess_server.py:132 Aug 22, 2022 10:49:09 PM org.apache.beam.sdk.extensions.sql.impl.CalciteQueryPlanner convertToBeamRel
INFO apache_beam.utils.subprocess_server:subprocess_server.py:132 INFO: BEAMPlan>
INFO apache_beam.utils.subprocess_server:subprocess_server.py:132 BeamCalcRel(expr#0..1=[{inputs}], expr#2=[*($t0, $t0)], expr#3=[LENGTH($t1)], s=[$t2], c=[$t3])
INFO apache_beam.utils.subprocess_server:subprocess_server.py:132 BeamIOSourceRel(table=[[beam, PCOLLECTION]])
INFO apache_beam.utils.subprocess_server:subprocess_server.py:132
INFO root:environments.py:376 Default Python SDK image for environment is apache/beam_python3.7_sdk:2.42.0.dev
INFO root:environments.py:299 No image given, using default Python SDK image
INFO root:environments.py:376 Default Python SDK image for environment is apache/beam_python3.7_sdk:2.42.0.dev
INFO root:environments.py:304 Python SDK container image set to "apache/beam_python3.7_sdk:2.42.0.dev" for Docker environment
INFO apache_beam.runners.portability.fn_api_runner.translations:translations.py:714 ==================== <function pack_combiners at 0x7f1254f56950> ====================
INFO apache_beam.runners.portability.fn_api_runner.translations:translations.py:714 ==================== <function lift_combiners at 0x7f1254f569e0> ====================
INFO apache_beam.runners.portability.fn_api_runner.translations:translations.py:714 ==================== <function sort_stages at 0x7f1254f57170> ====================
INFO apache_beam.runners.portability.portable_runner:portable_runner.py:583 Job state changed to STOPPED
INFO apache_beam.runners.portability.portable_runner:portable_runner.py:583 Job state changed to STARTING
INFO apache_beam.runners.portability.portable_runner:portable_runner.py:583 Job state changed to RUNNING
INFO apache_beam.runners.portability.portable_runner:portable_runner.py:583 Job state changed to DONE
PASSED [ 66%]
apache_beam/transforms/sql_test.py::SqlTransformTest::test_tagged_join
-------------------------------- live log call ---------------------------------
INFO apache_beam.utils.subprocess_server:subprocess_server.py:254 Using pre-built snapshot at <https://ci-beam.apache.org/job/beam_PostCommit_XVR_Flink/ws/src/sdks/java/extensions/sql/expansion-service/build/libs/beam-sdks-java-extensions-sql-expansion-service-2.42.0-SNAPSHOT.jar>
INFO root:external.py:773 Starting a JAR-based expansion service from JAR <https://ci-beam.apache.org/job/beam_PostCommit_XVR_Flink/ws/src/sdks/java/extensions/sql/expansion-service/build/libs/beam-sdks-java-extensions-sql-expansion-service-2.42.0-SNAPSHOT.jar>
INFO apache_beam.utils.subprocess_server:subprocess_server.py:116 Starting service with ['java' '-jar' '<https://ci-beam.apache.org/job/beam_PostCommit_XVR_Flink/ws/src/sdks/java/extensions/sql/expansion-service/build/libs/beam-sdks-java-extensions-sql-expansion-service-2.42.0-SNAPSHOT.jar'> '43741' '--filesToStage=<https://ci-beam.apache.org/job/beam_PostCommit_XVR_Flink/ws/src/sdks/java/extensions/sql/expansion-service/build/libs/beam-sdks-java-extensions-sql-expansion-service-2.42.0-SNAPSHOT.jar']>
INFO apache_beam.utils.subprocess_server:subprocess_server.py:132 Starting expansion service at localhost:43741
INFO apache_beam.utils.subprocess_server:subprocess_server.py:132 Aug 22, 2022 10:49:35 PM org.apache.beam.sdk.expansion.service.ExpansionService loadRegisteredTransforms
INFO apache_beam.utils.subprocess_server:subprocess_server.py:132 INFO: Registering external transforms: [beam:external:java:sql:v1, beam:transform:org.apache.beam:pubsub_read:v1, beam:transform:org.apache.beam:pubsub_write:v1, beam:transform:org.apache.beam:pubsublite_write:v1, beam:transform:org.apache.beam:pubsublite_read:v1, beam:transform:org.apache.beam:spanner_insert:v1, beam:transform:org.apache.beam:spanner_update:v1, beam:transform:org.apache.beam:spanner_replace:v1, beam:transform:org.apache.beam:spanner_insert_or_update:v1, beam:transform:org.apache.beam:spanner_delete:v1, beam:transform:org.apache.beam:spanner_read:v1, beam:transform:org.apache.beam:kafka_read_with_metadata:v1, beam:transform:org.apache.beam:kafka_read_without_metadata:v1, beam:transform:org.apache.beam:kafka_write:v1, beam:external:java:generate_sequence:v1]
INFO apache_beam.utils.subprocess_server:subprocess_server.py:132 beam:external:java:sql:v1: org.apache.beam.sdk.expansion.service.ExpansionService$ExternalTransformRegistrarLoader$1@47eaca72
INFO apache_beam.utils.subprocess_server:subprocess_server.py:132 beam:transform:org.apache.beam:pubsub_read:v1: org.apache.beam.sdk.expansion.service.ExpansionService$ExternalTransformRegistrarLoader$1@55141def
INFO apache_beam.utils.subprocess_server:subprocess_server.py:132 beam:transform:org.apache.beam:pubsub_write:v1: org.apache.beam.sdk.expansion.service.ExpansionService$ExternalTransformRegistrarLoader$1@55182842
INFO apache_beam.utils.subprocess_server:subprocess_server.py:132 beam:transform:org.apache.beam:pubsublite_write:v1: org.apache.beam.sdk.expansion.service.ExpansionService$ExternalTransformRegistrarLoader$1@3270d194
INFO apache_beam.utils.subprocess_server:subprocess_server.py:132 beam:transform:org.apache.beam:pubsublite_read:v1: org.apache.beam.sdk.expansion.service.ExpansionService$ExternalTransformRegistrarLoader$1@235834f2
INFO apache_beam.utils.subprocess_server:subprocess_server.py:132 beam:transform:org.apache.beam:spanner_insert:v1: org.apache.beam.sdk.expansion.service.ExpansionService$ExternalTransformRegistrarLoader$1@5656be13
INFO apache_beam.utils.subprocess_server:subprocess_server.py:132 beam:transform:org.apache.beam:spanner_update:v1: org.apache.beam.sdk.expansion.service.ExpansionService$ExternalTransformRegistrarLoader$1@4218d6a3
INFO apache_beam.utils.subprocess_server:subprocess_server.py:132 beam:transform:org.apache.beam:spanner_replace:v1: org.apache.beam.sdk.expansion.service.ExpansionService$ExternalTransformRegistrarLoader$1@76505305
INFO apache_beam.utils.subprocess_server:subprocess_server.py:132 beam:transform:org.apache.beam:spanner_insert_or_update:v1: org.apache.beam.sdk.expansion.service.ExpansionService$ExternalTransformRegistrarLoader$1@14cd1699
INFO apache_beam.utils.subprocess_server:subprocess_server.py:132 beam:transform:org.apache.beam:spanner_delete:v1: org.apache.beam.sdk.expansion.service.ExpansionService$ExternalTransformRegistrarLoader$1@77888435
INFO apache_beam.utils.subprocess_server:subprocess_server.py:132 beam:transform:org.apache.beam:spanner_read:v1: org.apache.beam.sdk.expansion.service.ExpansionService$ExternalTransformRegistrarLoader$1@73a1e9a9
INFO apache_beam.utils.subprocess_server:subprocess_server.py:132 beam:transform:org.apache.beam:kafka_read_with_metadata:v1: org.apache.beam.sdk.expansion.service.ExpansionService$ExternalTransformRegistrarLoader$1@71d44a3
INFO apache_beam.utils.subprocess_server:subprocess_server.py:132 beam:transform:org.apache.beam:kafka_read_without_metadata:v1: org.apache.beam.sdk.expansion.service.ExpansionService$ExternalTransformRegistrarLoader$1@7b98f307
INFO apache_beam.utils.subprocess_server:subprocess_server.py:132 beam:transform:org.apache.beam:kafka_write:v1: org.apache.beam.sdk.expansion.service.ExpansionService$ExternalTransformRegistrarLoader$1@4802796d
INFO apache_beam.utils.subprocess_server:subprocess_server.py:132 beam:external:java:generate_sequence:v1: org.apache.beam.sdk.expansion.service.ExpansionService$ExternalTransformRegistrarLoader$1@34123d65
WARNING root:subprocess_server.py:98 Waiting for grpc channel to be ready at localhost:43741.
INFO apache_beam.utils.subprocess_server:subprocess_server.py:132 Aug 22, 2022 10:49:38 PM org.apache.beam.sdk.expansion.service.ExpansionService expand
INFO apache_beam.utils.subprocess_server:subprocess_server.py:132 INFO: Expanding 'SqlTransform(beam:external:java:sql:v1)' with URN 'beam:external:java:sql:v1'
INFO apache_beam.utils.subprocess_server:subprocess_server.py:132 Aug 22, 2022 10:49:38 PM org.apache.beam.sdk.expansion.service.ExpansionService$ExternalTransformRegistrarLoader payloadToConfig
INFO apache_beam.utils.subprocess_server:subprocess_server.py:132 WARNING: Configuration class 'org.apache.beam.sdk.extensions.sql.expansion.ExternalSqlTransformRegistrar$Configuration' has no schema registered. Attempting to construct with setter approach.
INFO apache_beam.utils.subprocess_server:subprocess_server.py:132 Aug 22, 2022 10:49:39 PM org.apache.beam.sdk.expansion.service.ExpansionService$ExternalTransformRegistrarLoader payloadToConfig
INFO apache_beam.utils.subprocess_server:subprocess_server.py:132 WARNING: Configuration class 'org.apache.beam.sdk.extensions.sql.expansion.ExternalSqlTransformRegistrar$Configuration' has no schema registered. Attempting to construct with setter approach.
INFO apache_beam.utils.subprocess_server:subprocess_server.py:132 Aug 22, 2022 10:49:42 PM org.apache.beam.sdk.extensions.sql.impl.CalciteQueryPlanner convertToBeamRel
INFO apache_beam.utils.subprocess_server:subprocess_server.py:132 INFO: SQL:
INFO apache_beam.utils.subprocess_server:subprocess_server.py:132 SELECT `simple`.`id` AS `id`, `enrich`.`metadata` AS `metadata`
INFO apache_beam.utils.subprocess_server:subprocess_server.py:132 FROM `beam`.`simple` AS `simple`
INFO apache_beam.utils.subprocess_server:subprocess_server.py:132 INNER JOIN `beam`.`enrich` AS `enrich` ON `simple`.`id` = `enrich`.`id`
INFO apache_beam.utils.subprocess_server:subprocess_server.py:132 Aug 22, 2022 10:49:42 PM org.apache.beam.sdk.extensions.sql.impl.CalciteQueryPlanner convertToBeamRel
INFO apache_beam.utils.subprocess_server:subprocess_server.py:132 INFO: SQLPlan>
INFO apache_beam.utils.subprocess_server:subprocess_server.py:132 LogicalProject(id=[$0], metadata=[$4])
INFO apache_beam.utils.subprocess_server:subprocess_server.py:132 LogicalJoin(condition=[=($0, $3)], joinType=[inner])
INFO apache_beam.utils.subprocess_server:subprocess_server.py:132 BeamIOSourceRel(table=[[beam, simple]])
INFO apache_beam.utils.subprocess_server:subprocess_server.py:132 BeamIOSourceRel(table=[[beam, enrich]])
INFO apache_beam.utils.subprocess_server:subprocess_server.py:132
INFO apache_beam.utils.subprocess_server:subprocess_server.py:132 Aug 22, 2022 10:49:43 PM org.apache.beam.sdk.extensions.sql.impl.CalciteQueryPlanner convertToBeamRel
INFO apache_beam.utils.subprocess_server:subprocess_server.py:132 INFO: BEAMPlan>
INFO apache_beam.utils.subprocess_server:subprocess_server.py:132 BeamCalcRel(expr#0..4=[{inputs}], id=[$t0], metadata=[$t4])
INFO apache_beam.utils.subprocess_server:subprocess_server.py:132 BeamCoGBKJoinRel(condition=[=($0, $3)], joinType=[inner])
INFO apache_beam.utils.subprocess_server:subprocess_server.py:132 BeamIOSourceRel(table=[[beam, simple]])
INFO apache_beam.utils.subprocess_server:subprocess_server.py:132 BeamIOSourceRel(table=[[beam, enrich]])
INFO apache_beam.utils.subprocess_server:subprocess_server.py:132
INFO root:environments.py:376 Default Python SDK image for environment is apache/beam_python3.7_sdk:2.42.0.dev
INFO root:environments.py:299 No image given, using default Python SDK image
INFO root:environments.py:376 Default Python SDK image for environment is apache/beam_python3.7_sdk:2.42.0.dev
INFO root:environments.py:304 Python SDK container image set to "apache/beam_python3.7_sdk:2.42.0.dev" for Docker environment
INFO apache_beam.runners.portability.fn_api_runner.translations:translations.py:714 ==================== <function pack_combiners at 0x7f1254f56950> ====================
INFO apache_beam.runners.portability.fn_api_runner.translations:translations.py:714 ==================== <function lift_combiners at 0x7f1254f569e0> ====================
INFO apache_beam.runners.portability.fn_api_runner.translations:translations.py:714 ==================== <function sort_stages at 0x7f1254f57170> ====================
INFO apache_beam.runners.portability.portable_runner:portable_runner.py:583 Job state changed to STOPPED
INFO apache_beam.runners.portability.portable_runner:portable_runner.py:583 Job state changed to STARTING
INFO apache_beam.runners.portability.portable_runner:portable_runner.py:583 Job state changed to RUNNING
INFO apache_beam.runners.portability.portable_runner:portable_runner.py:583 Job state changed to DONE
PASSED [ 77%]
apache_beam/transforms/sql_test.py::SqlTransformTest::test_windowing_before_sql
-------------------------------- live log call ---------------------------------
INFO apache_beam.utils.subprocess_server:subprocess_server.py:254 Using pre-built snapshot at <https://ci-beam.apache.org/job/beam_PostCommit_XVR_Flink/ws/src/sdks/java/extensions/sql/expansion-service/build/libs/beam-sdks-java-extensions-sql-expansion-service-2.42.0-SNAPSHOT.jar>
INFO root:external.py:773 Starting a JAR-based expansion service from JAR <https://ci-beam.apache.org/job/beam_PostCommit_XVR_Flink/ws/src/sdks/java/extensions/sql/expansion-service/build/libs/beam-sdks-java-extensions-sql-expansion-service-2.42.0-SNAPSHOT.jar>
INFO apache_beam.utils.subprocess_server:subprocess_server.py:116 Starting service with ['java' '-jar' '<https://ci-beam.apache.org/job/beam_PostCommit_XVR_Flink/ws/src/sdks/java/extensions/sql/expansion-service/build/libs/beam-sdks-java-extensions-sql-expansion-service-2.42.0-SNAPSHOT.jar'> '37675' '--filesToStage=<https://ci-beam.apache.org/job/beam_PostCommit_XVR_Flink/ws/src/sdks/java/extensions/sql/expansion-service/build/libs/beam-sdks-java-extensions-sql-expansion-service-2.42.0-SNAPSHOT.jar']>
INFO apache_beam.utils.subprocess_server:subprocess_server.py:132 Starting expansion service at localhost:37675
INFO apache_beam.utils.subprocess_server:subprocess_server.py:132 Aug 22, 2022 10:50:11 PM org.apache.beam.sdk.expansion.service.ExpansionService loadRegisteredTransforms
INFO apache_beam.utils.subprocess_server:subprocess_server.py:132 INFO: Registering external transforms: [beam:external:java:sql:v1, beam:transform:org.apache.beam:pubsub_read:v1, beam:transform:org.apache.beam:pubsub_write:v1, beam:transform:org.apache.beam:pubsublite_write:v1, beam:transform:org.apache.beam:pubsublite_read:v1, beam:transform:org.apache.beam:spanner_insert:v1, beam:transform:org.apache.beam:spanner_update:v1, beam:transform:org.apache.beam:spanner_replace:v1, beam:transform:org.apache.beam:spanner_insert_or_update:v1, beam:transform:org.apache.beam:spanner_delete:v1, beam:transform:org.apache.beam:spanner_read:v1, beam:transform:org.apache.beam:kafka_read_with_metadata:v1, beam:transform:org.apache.beam:kafka_read_without_metadata:v1, beam:transform:org.apache.beam:kafka_write:v1, beam:external:java:generate_sequence:v1]
INFO apache_beam.utils.subprocess_server:subprocess_server.py:132 beam:external:java:sql:v1: org.apache.beam.sdk.expansion.service.ExpansionService$ExternalTransformRegistrarLoader$1@47eaca72
INFO apache_beam.utils.subprocess_server:subprocess_server.py:132 beam:transform:org.apache.beam:pubsub_read:v1: org.apache.beam.sdk.expansion.service.ExpansionService$ExternalTransformRegistrarLoader$1@55141def
INFO apache_beam.utils.subprocess_server:subprocess_server.py:132 beam:transform:org.apache.beam:pubsub_write:v1: org.apache.beam.sdk.expansion.service.ExpansionService$ExternalTransformRegistrarLoader$1@55182842
INFO apache_beam.utils.subprocess_server:subprocess_server.py:132 beam:transform:org.apache.beam:pubsublite_write:v1: org.apache.beam.sdk.expansion.service.ExpansionService$ExternalTransformRegistrarLoader$1@3270d194
INFO apache_beam.utils.subprocess_server:subprocess_server.py:132 beam:transform:org.apache.beam:pubsublite_read:v1: org.apache.beam.sdk.expansion.service.ExpansionService$ExternalTransformRegistrarLoader$1@235834f2
INFO apache_beam.utils.subprocess_server:subprocess_server.py:132 beam:transform:org.apache.beam:spanner_insert:v1: org.apache.beam.sdk.expansion.service.ExpansionService$ExternalTransformRegistrarLoader$1@5656be13
INFO apache_beam.utils.subprocess_server:subprocess_server.py:132 beam:transform:org.apache.beam:spanner_update:v1: org.apache.beam.sdk.expansion.service.ExpansionService$ExternalTransformRegistrarLoader$1@4218d6a3
INFO apache_beam.utils.subprocess_server:subprocess_server.py:132 beam:transform:org.apache.beam:spanner_replace:v1: org.apache.beam.sdk.expansion.service.ExpansionService$ExternalTransformRegistrarLoader$1@76505305
INFO apache_beam.utils.subprocess_server:subprocess_server.py:132 beam:transform:org.apache.beam:spanner_insert_or_update:v1: org.apache.beam.sdk.expansion.service.ExpansionService$ExternalTransformRegistrarLoader$1@14cd1699
INFO apache_beam.utils.subprocess_server:subprocess_server.py:132 beam:transform:org.apache.beam:spanner_delete:v1: org.apache.beam.sdk.expansion.service.ExpansionService$ExternalTransformRegistrarLoader$1@77888435
INFO apache_beam.utils.subprocess_server:subprocess_server.py:132 beam:transform:org.apache.beam:spanner_read:v1: org.apache.beam.sdk.expansion.service.ExpansionService$ExternalTransformRegistrarLoader$1@73a1e9a9
INFO apache_beam.utils.subprocess_server:subprocess_server.py:132 beam:transform:org.apache.beam:kafka_read_with_metadata:v1: org.apache.beam.sdk.expansion.service.ExpansionService$ExternalTransformRegistrarLoader$1@71d44a3
INFO apache_beam.utils.subprocess_server:subprocess_server.py:132 beam:transform:org.apache.beam:kafka_read_without_metadata:v1: org.apache.beam.sdk.expansion.service.ExpansionService$ExternalTransformRegistrarLoader$1@7b98f307
INFO apache_beam.utils.subprocess_server:subprocess_server.py:132 beam:transform:org.apache.beam:kafka_write:v1: org.apache.beam.sdk.expansion.service.ExpansionService$ExternalTransformRegistrarLoader$1@4802796d
INFO apache_beam.utils.subprocess_server:subprocess_server.py:132 beam:external:java:generate_sequence:v1: org.apache.beam.sdk.expansion.service.ExpansionService$ExternalTransformRegistrarLoader$1@34123d65
WARNING root:subprocess_server.py:98 Waiting for grpc channel to be ready at localhost:37675.
INFO apache_beam.utils.subprocess_server:subprocess_server.py:132 Aug 22, 2022 10:50:14 PM org.apache.beam.sdk.expansion.service.ExpansionService expand
INFO apache_beam.utils.subprocess_server:subprocess_server.py:132 INFO: Expanding 'SqlTransform(beam:external:java:sql:v1)' with URN 'beam:external:java:sql:v1'
INFO apache_beam.utils.subprocess_server:subprocess_server.py:132 Aug 22, 2022 10:50:14 PM org.apache.beam.sdk.expansion.service.ExpansionService$ExternalTransformRegistrarLoader payloadToConfig
INFO apache_beam.utils.subprocess_server:subprocess_server.py:132 WARNING: Configuration class 'org.apache.beam.sdk.extensions.sql.expansion.ExternalSqlTransformRegistrar$Configuration' has no schema registered. Attempting to construct with setter approach.
INFO apache_beam.utils.subprocess_server:subprocess_server.py:132 Aug 22, 2022 10:50:15 PM org.apache.beam.sdk.expansion.service.ExpansionService$ExternalTransformRegistrarLoader payloadToConfig
INFO apache_beam.utils.subprocess_server:subprocess_server.py:132 WARNING: Configuration class 'org.apache.beam.sdk.extensions.sql.expansion.ExternalSqlTransformRegistrar$Configuration' has no schema registered. Attempting to construct with setter approach.
INFO apache_beam.utils.subprocess_server:subprocess_server.py:132 Aug 22, 2022 10:50:18 PM org.apache.beam.sdk.extensions.sql.impl.CalciteQueryPlanner convertToBeamRel
INFO apache_beam.utils.subprocess_server:subprocess_server.py:132 INFO: SQL:
INFO apache_beam.utils.subprocess_server:subprocess_server.py:132 SELECT COUNT(*) AS `count`
INFO apache_beam.utils.subprocess_server:subprocess_server.py:132 FROM `beam`.`PCOLLECTION` AS `PCOLLECTION`
INFO apache_beam.utils.subprocess_server:subprocess_server.py:132 Aug 22, 2022 10:50:18 PM org.apache.beam.sdk.extensions.sql.impl.CalciteQueryPlanner convertToBeamRel
INFO apache_beam.utils.subprocess_server:subprocess_server.py:132 INFO: SQLPlan>
INFO apache_beam.utils.subprocess_server:subprocess_server.py:132 LogicalAggregate(group=[{}], count=[COUNT()])
INFO apache_beam.utils.subprocess_server:subprocess_server.py:132 BeamIOSourceRel(table=[[beam, PCOLLECTION]])
INFO apache_beam.utils.subprocess_server:subprocess_server.py:132
INFO apache_beam.utils.subprocess_server:subprocess_server.py:132 Aug 22, 2022 10:50:19 PM org.apache.beam.sdk.extensions.sql.impl.CalciteQueryPlanner convertToBeamRel
INFO apache_beam.utils.subprocess_server:subprocess_server.py:132 INFO: BEAMPlan>
INFO apache_beam.utils.subprocess_server:subprocess_server.py:132 BeamAggregationRel(group=[{}], count=[COUNT()])
INFO apache_beam.utils.subprocess_server:subprocess_server.py:132 BeamIOSourceRel(table=[[beam, PCOLLECTION]])
INFO apache_beam.utils.subprocess_server:subprocess_server.py:132
INFO root:environments.py:376 Default Python SDK image for environment is apache/beam_python3.7_sdk:2.42.0.dev
INFO root:environments.py:299 No image given, using default Python SDK image
INFO root:environments.py:376 Default Python SDK image for environment is apache/beam_python3.7_sdk:2.42.0.dev
INFO root:environments.py:304 Python SDK container image set to "apache/beam_python3.7_sdk:2.42.0.dev" for Docker environment
INFO apache_beam.runners.portability.fn_api_runner.translations:translations.py:714 ==================== <function pack_combiners at 0x7f1254f56950> ====================
INFO apache_beam.runners.portability.fn_api_runner.translations:translations.py:714 ==================== <function lift_combiners at 0x7f1254f569e0> ====================
INFO apache_beam.runners.portability.fn_api_runner.translations:translations.py:714 ==================== <function sort_stages at 0x7f1254f57170> ====================
INFO apache_beam.runners.portability.portable_runner:portable_runner.py:583 Job state changed to STOPPED
INFO apache_beam.runners.portability.portable_runner:portable_runner.py:583 Job state changed to STARTING
INFO apache_beam.runners.portability.portable_runner:portable_runner.py:583 Job state changed to RUNNING
INFO apache_beam.runners.portability.portable_runner:portable_runner.py:583 Job state changed to DONE
PASSED [ 88%]
apache_beam/transforms/sql_test.py::SqlTransformTest::test_zetasql_generate_data
-------------------------------- live log call ---------------------------------
INFO apache_beam.utils.subprocess_server:subprocess_server.py:254 Using pre-built snapshot at <https://ci-beam.apache.org/job/beam_PostCommit_XVR_Flink/ws/src/sdks/java/extensions/sql/expansion-service/build/libs/beam-sdks-java-extensions-sql-expansion-service-2.42.0-SNAPSHOT.jar>
INFO root:external.py:773 Starting a JAR-based expansion service from JAR <https://ci-beam.apache.org/job/beam_PostCommit_XVR_Flink/ws/src/sdks/java/extensions/sql/expansion-service/build/libs/beam-sdks-java-extensions-sql-expansion-service-2.42.0-SNAPSHOT.jar>
INFO apache_beam.utils.subprocess_server:subprocess_server.py:116 Starting service with ['java' '-jar' '<https://ci-beam.apache.org/job/beam_PostCommit_XVR_Flink/ws/src/sdks/java/extensions/sql/expansion-service/build/libs/beam-sdks-java-extensions-sql-expansion-service-2.42.0-SNAPSHOT.jar'> '38549' '--filesToStage=<https://ci-beam.apache.org/job/beam_PostCommit_XVR_Flink/ws/src/sdks/java/extensions/sql/expansion-service/build/libs/beam-sdks-java-extensions-sql-expansion-service-2.42.0-SNAPSHOT.jar']>
INFO apache_beam.utils.subprocess_server:subprocess_server.py:132 Starting expansion service at localhost:38549
INFO apache_beam.utils.subprocess_server:subprocess_server.py:132 Aug 22, 2022 10:50:44 PM org.apache.beam.sdk.expansion.service.ExpansionService loadRegisteredTransforms
INFO apache_beam.utils.subprocess_server:subprocess_server.py:132 INFO: Registering external transforms: [beam:external:java:sql:v1, beam:transform:org.apache.beam:pubsub_read:v1, beam:transform:org.apache.beam:pubsub_write:v1, beam:transform:org.apache.beam:pubsublite_write:v1, beam:transform:org.apache.beam:pubsublite_read:v1, beam:transform:org.apache.beam:spanner_insert:v1, beam:transform:org.apache.beam:spanner_update:v1, beam:transform:org.apache.beam:spanner_replace:v1, beam:transform:org.apache.beam:spanner_insert_or_update:v1, beam:transform:org.apache.beam:spanner_delete:v1, beam:transform:org.apache.beam:spanner_read:v1, beam:transform:org.apache.beam:kafka_read_with_metadata:v1, beam:transform:org.apache.beam:kafka_read_without_metadata:v1, beam:transform:org.apache.beam:kafka_write:v1, beam:external:java:generate_sequence:v1]
INFO apache_beam.utils.subprocess_server:subprocess_server.py:132 beam:external:java:sql:v1: org.apache.beam.sdk.expansion.service.ExpansionService$ExternalTransformRegistrarLoader$1@47eaca72
INFO apache_beam.utils.subprocess_server:subprocess_server.py:132 beam:transform:org.apache.beam:pubsub_read:v1: org.apache.beam.sdk.expansion.service.ExpansionService$ExternalTransformRegistrarLoader$1@55141def
INFO apache_beam.utils.subprocess_server:subprocess_server.py:132 beam:transform:org.apache.beam:pubsub_write:v1: org.apache.beam.sdk.expansion.service.ExpansionService$ExternalTransformRegistrarLoader$1@55182842
INFO apache_beam.utils.subprocess_server:subprocess_server.py:132 beam:transform:org.apache.beam:pubsublite_write:v1: org.apache.beam.sdk.expansion.service.ExpansionService$ExternalTransformRegistrarLoader$1@3270d194
INFO apache_beam.utils.subprocess_server:subprocess_server.py:132 beam:transform:org.apache.beam:pubsublite_read:v1: org.apache.beam.sdk.expansion.service.ExpansionService$ExternalTransformRegistrarLoader$1@235834f2
INFO apache_beam.utils.subprocess_server:subprocess_server.py:132 beam:transform:org.apache.beam:spanner_insert:v1: org.apache.beam.sdk.expansion.service.ExpansionService$ExternalTransformRegistrarLoader$1@5656be13
INFO apache_beam.utils.subprocess_server:subprocess_server.py:132 beam:transform:org.apache.beam:spanner_update:v1: org.apache.beam.sdk.expansion.service.ExpansionService$ExternalTransformRegistrarLoader$1@4218d6a3
INFO apache_beam.utils.subprocess_server:subprocess_server.py:132 beam:transform:org.apache.beam:spanner_replace:v1: org.apache.beam.sdk.expansion.service.ExpansionService$ExternalTransformRegistrarLoader$1@76505305
INFO apache_beam.utils.subprocess_server:subprocess_server.py:132 beam:transform:org.apache.beam:spanner_insert_or_update:v1: org.apache.beam.sdk.expansion.service.ExpansionService$ExternalTransformRegistrarLoader$1@14cd1699
INFO apache_beam.utils.subprocess_server:subprocess_server.py:132 beam:transform:org.apache.beam:spanner_delete:v1: org.apache.beam.sdk.expansion.service.ExpansionService$ExternalTransformRegistrarLoader$1@77888435
INFO apache_beam.utils.subprocess_server:subprocess_server.py:132 beam:transform:org.apache.beam:spanner_read:v1: org.apache.beam.sdk.expansion.service.ExpansionService$ExternalTransformRegistrarLoader$1@73a1e9a9
INFO apache_beam.utils.subprocess_server:subprocess_server.py:132 beam:transform:org.apache.beam:kafka_read_with_metadata:v1: org.apache.beam.sdk.expansion.service.ExpansionService$ExternalTransformRegistrarLoader$1@71d44a3
INFO apache_beam.utils.subprocess_server:subprocess_server.py:132 beam:transform:org.apache.beam:kafka_read_without_metadata:v1: org.apache.beam.sdk.expansion.service.ExpansionService$ExternalTransformRegistrarLoader$1@7b98f307
INFO apache_beam.utils.subprocess_server:subprocess_server.py:132 beam:transform:org.apache.beam:kafka_write:v1: org.apache.beam.sdk.expansion.service.ExpansionService$ExternalTransformRegistrarLoader$1@4802796d
INFO apache_beam.utils.subprocess_server:subprocess_server.py:132 beam:external:java:generate_sequence:v1: org.apache.beam.sdk.expansion.service.ExpansionService$ExternalTransformRegistrarLoader$1@34123d65
WARNING root:subprocess_server.py:98 Waiting for grpc channel to be ready at localhost:38549.
INFO apache_beam.utils.subprocess_server:subprocess_server.py:132 Aug 22, 2022 10:50:47 PM org.apache.beam.sdk.expansion.service.ExpansionService expand
INFO apache_beam.utils.subprocess_server:subprocess_server.py:132 INFO: Expanding 'SqlTransform(beam:external:java:sql:v1)' with URN 'beam:external:java:sql:v1'
INFO apache_beam.utils.subprocess_server:subprocess_server.py:132 Aug 22, 2022 10:50:47 PM org.apache.beam.sdk.expansion.service.ExpansionService$ExternalTransformRegistrarLoader payloadToConfig
INFO apache_beam.utils.subprocess_server:subprocess_server.py:132 WARNING: Configuration class 'org.apache.beam.sdk.extensions.sql.expansion.ExternalSqlTransformRegistrar$Configuration' has no schema registered. Attempting to construct with setter approach.
INFO apache_beam.utils.subprocess_server:subprocess_server.py:132 Aug 22, 2022 10:50:48 PM org.apache.beam.sdk.expansion.service.ExpansionService$ExternalTransformRegistrarLoader payloadToConfig
INFO apache_beam.utils.subprocess_server:subprocess_server.py:132 WARNING: Configuration class 'org.apache.beam.sdk.extensions.sql.expansion.ExternalSqlTransformRegistrar$Configuration' has no schema registered. Attempting to construct with setter approach.
INFO apache_beam.utils.subprocess_server:subprocess_server.py:132 Aug 22, 2022 10:50:52 PM com.google.zetasql.io.grpc.NameResolverRegistry getDefaultRegistry
INFO apache_beam.utils.subprocess_server:subprocess_server.py:132 WARNING: No NameResolverProviders found via ServiceLoader, including for DNS. This is probably due to a broken build. If using ProGuard, check your configuration
INFO apache_beam.utils.subprocess_server:subprocess_server.py:132 Aug 22, 2022 10:50:54 PM org.apache.beam.sdk.extensions.sql.zetasql.ZetaSQLQueryPlanner convertToBeamRelInternal
INFO apache_beam.utils.subprocess_server:subprocess_server.py:132 INFO: BEAMPlan>
INFO apache_beam.utils.subprocess_server:subprocess_server.py:132 BeamZetaSqlCalcRel(expr#0=[{inputs}], expr#1=[1:BIGINT], expr#2=['foo':VARCHAR], expr#3=[3.1400000000000001243E0:DOUBLE], int=[$t1], str=[$t2], flt=[$t3])
INFO apache_beam.utils.subprocess_server:subprocess_server.py:132 BeamValuesRel(tuples=[[{ 0 }]])
INFO apache_beam.utils.subprocess_server:subprocess_server.py:132
INFO root:environments.py:376 Default Python SDK image for environment is apache/beam_python3.7_sdk:2.42.0.dev
INFO root:environments.py:299 No image given, using default Python SDK image
INFO root:environments.py:376 Default Python SDK image for environment is apache/beam_python3.7_sdk:2.42.0.dev
INFO root:environments.py:304 Python SDK container image set to "apache/beam_python3.7_sdk:2.42.0.dev" for Docker environment
INFO apache_beam.runners.portability.fn_api_runner.translations:translations.py:714 ==================== <function pack_combiners at 0x7f1254f56950> ====================
INFO apache_beam.runners.portability.fn_api_runner.translations:translations.py:714 ==================== <function lift_combiners at 0x7f1254f569e0> ====================
INFO apache_beam.runners.portability.fn_api_runner.translations:translations.py:714 ==================== <function sort_stages at 0x7f1254f57170> ====================
INFO apache_beam.runners.portability.portable_runner:portable_runner.py:583 Job state changed to STOPPED
INFO apache_beam.runners.portability.portable_runner:portable_runner.py:583 Job state changed to STARTING
INFO apache_beam.runners.portability.portable_runner:portable_runner.py:583 Job state changed to RUNNING
INFO apache_beam.runners.portability.portable_runner:portable_runner.py:583 Job state changed to DONE
PASSED [100%]
=============================== warnings summary ===============================
../../build/gradleenv/1922375555/lib/python3.7/site-packages/hdfs/config.py:15
<https://ci-beam.apache.org/job/beam_PostCommit_XVR_Flink/ws/src/build/gradleenv/1922375555/lib/python3.7/site-packages/hdfs/config.py>:15: DeprecationWarning: the imp module is deprecated in favour of importlib; see the module's documentation for alternative uses
from imp import load_source
-- Docs: https://docs.pytest.org/en/stable/how-to/capture-warnings.html
- generated xml file: <https://ci-beam.apache.org/job/beam_PostCommit_XVR_Flink/ws/src/sdks/python/pytest_xlangSqlValidateRunner.xml> -
===== 9 passed, 2 skipped, 6542 deselected, 1 warning in 313.99s (0:05:13) =====
> Task :runners:flink:1.13:job-server:validatesCrossLanguageRunnerCleanup
Skipping invalid pid: 1266418.
Stopping expansion service pid: 1266419.
> Task :runners:flink:1.13:job-server:flinkJobServerCleanup
Stopping job server pid: 1213002.
FAILURE: Build completed with 2 failures.
1: Task failed with an exception.
-----------
* Where:
Build file '<https://ci-beam.apache.org/job/beam_PostCommit_XVR_Flink/ws/src/sdks/go/test/build.gradle'> line: 199
* What went wrong:
Execution failed for task ':runners:flink:1.13:job-server:validatesCrossLanguageRunnerGoUsingJava'.
> Process 'command 'sh'' finished with non-zero exit value 1
* Try:
> Run with --stacktrace option to get the stack trace.
> Run with --info or --debug option to get more log output.
> Run with --scan to get full insights.
==============================================================================
2: Task failed with an exception.
-----------
* What went wrong:
Execution failed for task ':runners:flink:1.13:job-server:validatesCrossLanguageRunnerPythonUsingJava'.
> Process 'command 'sh'' finished with non-zero exit value 1
* Try:
> Run with --stacktrace option to get the stack trace.
> Run with --info or --debug option to get more log output.
> Run with --scan to get full insights.
==============================================================================
* Get more help at https://help.gradle.org
Deprecated Gradle features were used in this build, making it incompatible with Gradle 8.0.
You can use '--warning-mode all' to show the individual deprecation warnings and determine if they come from your own scripts or plugins.
See https://docs.gradle.org/7.4/userguide/command_line_interface.html#sec:command_line_warnings
Execution optimizations have been disabled for 1 invalid unit(s) of work during this build to ensure correctness.
Please consult deprecation warnings for more details.
BUILD FAILED in 32m 58s
270 actionable tasks: 188 executed, 70 from cache, 12 up-to-date
Publishing build scan...
https://gradle.com/s/5zh3yslqr7hhm
Build step 'Invoke Gradle script' changed build result to FAILURE
Build step 'Invoke Gradle script' marked build as failure
---------------------------------------------------------------------
To unsubscribe, e-mail: builds-unsubscribe@beam.apache.org
For additional commands, e-mail: builds-help@beam.apache.org
Jenkins build is back to normal : beam_PostCommit_XVR_Flink #5797
Posted by Apache Jenkins Server <je...@builds.apache.org>.
See <https://ci-beam.apache.org/job/beam_PostCommit_XVR_Flink/5797/display/redirect?page=changes>
---------------------------------------------------------------------
To unsubscribe, e-mail: builds-unsubscribe@beam.apache.org
For additional commands, e-mail: builds-help@beam.apache.org