You are viewing a plain text version of this content. The canonical link for it is here.
Posted to issues@trafficserver.apache.org by je...@ci.trafficserver.apache.org on 2018/05/17 18:59:22 UTC

Build failed in Jenkins: macOS-master » clang,macOS,debug #2059

See <https://ci.trafficserver.apache.org/job/macOS-master/compiler=clang,label=macOS,type=debug/2059/display/redirect?page=changes>

Changes:

[Bryan Call] Removed internal C++14 and C++17 features in ink_std_compat.h

[Alan M. Carroll] Allow better logging by using TSHttpConnectWithPluginId

------------------------------------------
[...truncated 28.03 KB...]
checking sys/disk.h presence... yes
checking for sys/disk.h... yes
checking sys/disklabel.h usability... no
checking sys/disklabel.h presence... no
checking for sys/disklabel.h... no
checking linux/hdreg.h usability... no
checking linux/hdreg.h presence... no
checking for linux/hdreg.h... no
checking linux/fs.h usability... no
checking linux/fs.h presence... no
checking for linux/fs.h... no
checking linux/major.h usability... no
checking linux/major.h presence... no
checking for linux/major.h... no
checking for sys/sysctl.h... yes
checking for sys/cpuset.h... no
checking for sys/mount.h... yes
checking for arpa/inet.h... yes
checking for netinet/ip.h... yes
checking for netinet/ip_icmp.h... yes
checking for 1-parameter version of pthread_setname_np()... yes
checking for 2-parameter version of pthread_setname_np()... no
checking for 2-parameter version of pthread_set_name_np()... no
checking for struct sockaddr.sa_len... yes
checking for struct sockaddr_in.sin_len... yes
checking for struct sockaddr_in6.sin6_len... yes
checking for struct stat.st_mtimespec.tv_nsec... yes
checking for struct stat.st_mtim.tv_nsec... no
checking whether to enable transparent proxy... no
checking for SO_PEERCRED socket option... no
checking for SO_MARK socket option... no
checking for IP_TOS socket option... yes
checking for loopback network interface... lo0
checking IN6_IS_ADDR_UNSPECIFIED macro works... no
checking for struct tcp_info... no
checking search.h usability... yes
checking search.h presence... yes
checking for search.h... yes
checking for struct hsearch_data... no
checking for hcreate_r... no
checking for hsearch_r... no
checking that generated files are newer than configure... done
configure: creating ./config.status
config.status: creating Makefile
config.status: creating cmd/Makefile
config.status: creating cmd/traffic_cache_tool/Makefile
config.status: creating cmd/traffic_crashlog/Makefile
config.status: creating cmd/traffic_ctl/Makefile
config.status: creating cmd/traffic_layout/Makefile
config.status: creating cmd/traffic_manager/Makefile
config.status: creating cmd/traffic_top/Makefile
config.status: creating cmd/traffic_via/Makefile
config.status: creating cmd/traffic_wccp/Makefile
config.status: creating doc/Makefile
config.status: creating doc/ext/local-config.py
config.status: creating doc/uml/Makefile
config.status: creating example/Makefile
config.status: creating iocore/Makefile
config.status: creating iocore/aio/Makefile
config.status: creating iocore/cache/Makefile
config.status: creating iocore/dns/Makefile
config.status: creating iocore/eventsystem/Makefile
config.status: creating iocore/hostdb/Makefile
config.status: creating iocore/net/Makefile
config.status: creating iocore/utils/Makefile
config.status: creating lib/Makefile
config.status: creating lib/cppapi/Makefile
config.status: creating lib/bindings/Makefile
config.status: creating lib/perl/Makefile
config.status: creating lib/perl/lib/Apache/TS.pm
config.status: creating lib/records/Makefile
config.status: creating lib/ts/Makefile
config.status: creating lib/ts/apidefs.h
config.status: creating lib/ts/ink_config.h
config.status: creating lib/tsconfig/Makefile
config.status: creating lib/wccp/Makefile
config.status: creating mgmt/Makefile
config.status: creating mgmt/api/Makefile
config.status: creating mgmt/api/include/Makefile
config.status: creating mgmt/utils/Makefile
config.status: creating plugins/Makefile
config.status: creating proxy/Makefile
config.status: creating proxy/api/ts/Makefile
config.status: creating proxy/config/Makefile
config.status: creating proxy/config/body_factory/Makefile
config.status: creating proxy/config/body_factory/default/Makefile
config.status: creating proxy/config/records.config.default
config.status: creating proxy/config/storage.config.default
config.status: creating proxy/hdrs/Makefile
config.status: creating proxy/http/Makefile
config.status: creating proxy/http/remap/Makefile
config.status: creating proxy/http2/Makefile
config.status: creating proxy/logging/Makefile
config.status: creating proxy/shared/Makefile
config.status: creating rc/Makefile
config.status: creating rc/trafficserver
config.status: creating rc/trafficserver.conf
config.status: creating rc/trafficserver.service
config.status: creating rc/trafficserver.xml
config.status: creating tools/Makefile
config.status: creating tools/trafficserver.pc
config.status: creating tools/tsxs
config.status: creating tests/unit_tests/Makefile
config.status: creating lib/ink_autoconf.h
config.status: executing depfiles commands
config.status: executing libtool commands
configure: Build option summary:
    CC:                 clang
    CXX:                clang++
    CPP:                clang -E
    CFLAGS:             
    CXXFLAGS:           -Qunused-arguments -std=c++11
    CPPFLAGS:           -D_GNU_SOURCE -I/usr/local/opt/openssl/include -DOPENSSL_NO_SSL_INTERN -I/usr/local/Cellar/pcre/8.40/include
    LDFLAGS:            -L/usr/local/opt/openssl/lib -L/usr/local/Cellar/pcre/8.40/lib
    AM_CFLAGS:          -std=gnu99 -g -pipe -Wall -Wno-deprecated-declarations -Qunused-arguments -Wextra -Wno-ignored-qualifiers -Wno-unused-parameter -Werror -mcx16
    AM_CXXFLAGS:        -std=c++17 -g -pipe -Wall -Wno-deprecated-declarations -Qunused-arguments -Wextra -Wno-ignored-qualifiers -Wno-unused-parameter -Werror -Wno-invalid-offsetof -mcx16
    AM_CPPFLAGS:        -Ddarwin -DDEBUG -D_DEBUG -D_LARGEFILE64_SOURCE=1 -D_COMPILE64BIT_SOURCE=1 -D_REENTRANT -D__STDC_LIMIT_MACROS=1 -D__STDC_FORMAT_MACROS=1
    AM_LDFLAGS:         -R/usr/local/opt/openssl/lib -R/usr/local/Cellar/pcre/8.40/lib
    TS_INCLUDES:        -I/System/Library/Frameworks/Tcl.framework/Versions/8.5/Headers
    OPENSSL_LDFLAGS:    -L/usr/local/opt/openssl/lib
    OPENSSL_INCLUDES:   -I/usr/local/opt/openssl/include
    LUAJIT_CFLAGS:       -Wno-parentheses-equality -Wno-tautological-compare -Wno-varargs
    LUAJIT_CPPFLAGS:    -I$(abs_top_srcdir)/lib/luajit/src
    LUAJIT_LDFLAGS:     -Wl,-pagezero_size,10000 -Wl,-image_base,100000000

+ make -j6
Making all in proxy/api/ts
make[1]: Nothing to be done for `all'.
Making all in lib
/Applications/Xcode.app/Contents/Developer/usr/bin/make  all-recursive
Making all in ts
  CXX      Arena.lo
  CXX      BaseLogFile.lo
  CXX      Bitops.lo
  CXX      BufferWriterFormat.lo
  CXX      ConsistentHash.lo
  CXX      ContFlags.lo
  CXX      CryptoHash.lo
  CXX      Diags.lo
In file included from ../../../lib/ts/BufferWriterFormat.cc:24:
<https://ci.trafficserver.apache.org/job/macOS-master/compiler=clang,label=macOS,type=debug/ws/src/BUILDS/../lib/ts/BufferWriter.h>:525:3: error: variable templates are a C++14 extension [-Werror,-Wc++14-extensions]
  Get_Arg_Formatter_Array(std::index_sequence<N...>)
  ^
<https://ci.trafficserver.apache.org/job/macOS-master/compiler=clang,label=macOS,type=debug/ws/src/BUILDS/../lib/ts/BufferWriter.h>:525:32: error: no member named 'index_sequence' in namespace 'std'
  Get_Arg_Formatter_Array(std::index_sequence<N...>)
                          ~~~~~^
<https://ci.trafficserver.apache.org/job/macOS-master/compiler=clang,label=macOS,type=debug/ws/src/BUILDS/../lib/ts/BufferWriter.h>:525:53: error: expected ';' at end of declaration
  Get_Arg_Formatter_Array(std::index_sequence<N...>)
                                                    ^
                                                    ;
<https://ci.trafficserver.apache.org/job/macOS-master/compiler=clang,label=macOS,type=debug/ws/src/BUILDS/../lib/ts/BufferWriter.h>:526:3: error: expected unqualified-id
  {
  ^
<https://ci.trafficserver.apache.org/job/macOS-master/compiler=clang,label=macOS,type=debug/ws/src/BUILDS/../lib/ts/BufferWriter.h>:614:81: error: no member named 'index_sequence_for' in namespace 'std'
  static const auto fa   = bw_fmt::Get_Arg_Formatter_Array<decltype(args)>(std::index_sequence_for<Args...>{});
                                                                           ~~~~~^
<https://ci.trafficserver.apache.org/job/macOS-master/compiler=clang,label=macOS,type=debug/ws/src/BUILDS/../lib/ts/BufferWriter.h>:614:100: error: 'Args' does not refer to a value
  static const auto fa   = bw_fmt::Get_Arg_Formatter_Array<decltype(args)>(std::index_sequence_for<Args...>{});
                                                                                                   ^
<https://ci.trafficserver.apache.org/job/macOS-master/compiler=clang,label=macOS,type=debug/ws/src/BUILDS/../lib/ts/BufferWriter.h>:609:23: note: declared here
template <typename... Args>
                      ^
<https://ci.trafficserver.apache.org/job/macOS-master/compiler=clang,label=macOS,type=debug/ws/src/BUILDS/../lib/ts/BufferWriter.h>:674:81: error: no member named 'index_sequence_for' in namespace 'std'
  static const auto fa   = bw_fmt::Get_Arg_Formatter_Array<decltype(args)>(std::index_sequence_for<Args...>{});
                                                                           ~~~~~^
<https://ci.trafficserver.apache.org/job/macOS-master/compiler=clang,label=macOS,type=debug/ws/src/BUILDS/../lib/ts/BufferWriter.h>:674:100: error: 'Args' does not refer to a value
  static const auto fa   = bw_fmt::Get_Arg_Formatter_Array<decltype(args)>(std::index_sequence_for<Args...>{});
                                                                                                   ^
<https://ci.trafficserver.apache.org/job/macOS-master/compiler=clang,label=macOS,type=debug/ws/src/BUILDS/../lib/ts/BufferWriter.h>:669:23: note: declared here
template <typename... Args>
                      ^
  CXX      EventNotify.lo
  CC       fastlz.lo
8 errors generated.
make[3]: *** [BufferWriterFormat.lo] Error 1
make[3]: *** Waiting for unfinished jobs....
In file included from ../../../lib/ts/CryptoHash.cc:30:
In file included from <https://ci.trafficserver.apache.org/job/macOS-master/compiler=clang,label=macOS,type=debug/ws/src/BUILDS/../lib/ts/CryptoHash.h>:25:
<https://ci.trafficserver.apache.org/job/macOS-master/compiler=clang,label=macOS,type=debug/ws/src/BUILDS/../lib/ts/BufferWriter.h>:525:3: error: variable templates are a C++14 extension [-Werror,-Wc++14-extensions]
  Get_Arg_Formatter_Array(std::index_sequence<N...>)
  ^
<https://ci.trafficserver.apache.org/job/macOS-master/compiler=clang,label=macOS,type=debug/ws/src/BUILDS/../lib/ts/BufferWriter.h>:525:32: error: no member named 'index_sequence' in namespace 'std'
  Get_Arg_Formatter_Array(std::index_sequence<N...>)
                          ~~~~~^
<https://ci.trafficserver.apache.org/job/macOS-master/compiler=clang,label=macOS,type=debug/ws/src/BUILDS/../lib/ts/BufferWriter.h>:525:53: error: expected ';' at end of declaration
  Get_Arg_Formatter_Array(std::index_sequence<N...>)
                                                    ^
                                                    ;
<https://ci.trafficserver.apache.org/job/macOS-master/compiler=clang,label=macOS,type=debug/ws/src/BUILDS/../lib/ts/BufferWriter.h>:526:3: error: expected unqualified-id
  {
  ^
<https://ci.trafficserver.apache.org/job/macOS-master/compiler=clang,label=macOS,type=debug/ws/src/BUILDS/../lib/ts/BufferWriter.h>:614:81: error: no member named 'index_sequence_for' in namespace 'std'
  static const auto fa   = bw_fmt::Get_Arg_Formatter_Array<decltype(args)>(std::index_sequence_for<Args...>{});
                                                                           ~~~~~^
<https://ci.trafficserver.apache.org/job/macOS-master/compiler=clang,label=macOS,type=debug/ws/src/BUILDS/../lib/ts/BufferWriter.h>:614:100: error: 'Args' does not refer to a value
  static const auto fa   = bw_fmt::Get_Arg_Formatter_Array<decltype(args)>(std::index_sequence_for<Args...>{});
                                                                                                   ^
<https://ci.trafficserver.apache.org/job/macOS-master/compiler=clang,label=macOS,type=debug/ws/src/BUILDS/../lib/ts/BufferWriter.h>:609:23: note: declared here
template <typename... Args>
                      ^
<https://ci.trafficserver.apache.org/job/macOS-master/compiler=clang,label=macOS,type=debug/ws/src/BUILDS/../lib/ts/BufferWriter.h>:674:81: error: no member named 'index_sequence_for' in namespace 'std'
  static const auto fa   = bw_fmt::Get_Arg_Formatter_Array<decltype(args)>(std::index_sequence_for<Args...>{});
                                                                           ~~~~~^
<https://ci.trafficserver.apache.org/job/macOS-master/compiler=clang,label=macOS,type=debug/ws/src/BUILDS/../lib/ts/BufferWriter.h>:674:100: error: 'Args' does not refer to a value
  static const auto fa   = bw_fmt::Get_Arg_Formatter_Array<decltype(args)>(std::index_sequence_for<Args...>{});
                                                                                                   ^
<https://ci.trafficserver.apache.org/job/macOS-master/compiler=clang,label=macOS,type=debug/ws/src/BUILDS/../lib/ts/BufferWriter.h>:669:23: note: declared here
template <typename... Args>
                      ^
8 errors generated.
make[3]: *** [CryptoHash.lo] Error 1
In file included from ../../../lib/ts/Diags.cc:45:
<https://ci.trafficserver.apache.org/job/macOS-master/compiler=clang,label=macOS,type=debug/ws/src/BUILDS/../lib/ts/BufferWriter.h>:525:3: error: variable templates are a C++14 extension [-Werror,-Wc++14-extensions]
  Get_Arg_Formatter_Array(std::index_sequence<N...>)
  ^
<https://ci.trafficserver.apache.org/job/macOS-master/compiler=clang,label=macOS,type=debug/ws/src/BUILDS/../lib/ts/BufferWriter.h>:525:32: error: no member named 'index_sequence' in namespace 'std'
  Get_Arg_Formatter_Array(std::index_sequence<N...>)
                          ~~~~~^
<https://ci.trafficserver.apache.org/job/macOS-master/compiler=clang,label=macOS,type=debug/ws/src/BUILDS/../lib/ts/BufferWriter.h>:525:53: error: expected ';' at end of declaration
  Get_Arg_Formatter_Array(std::index_sequence<N...>)
                                                    ^
                                                    ;
<https://ci.trafficserver.apache.org/job/macOS-master/compiler=clang,label=macOS,type=debug/ws/src/BUILDS/../lib/ts/BufferWriter.h>:526:3: error: expected unqualified-id
  {
  ^
<https://ci.trafficserver.apache.org/job/macOS-master/compiler=clang,label=macOS,type=debug/ws/src/BUILDS/../lib/ts/BufferWriter.h>:614:81: error: no member named 'index_sequence_for' in namespace 'std'
  static const auto fa   = bw_fmt::Get_Arg_Formatter_Array<decltype(args)>(std::index_sequence_for<Args...>{});
                                                                           ~~~~~^
<https://ci.trafficserver.apache.org/job/macOS-master/compiler=clang,label=macOS,type=debug/ws/src/BUILDS/../lib/ts/BufferWriter.h>:614:100: error: 'Args' does not refer to a value
  static const auto fa   = bw_fmt::Get_Arg_Formatter_Array<decltype(args)>(std::index_sequence_for<Args...>{});
                                                                                                   ^
<https://ci.trafficserver.apache.org/job/macOS-master/compiler=clang,label=macOS,type=debug/ws/src/BUILDS/../lib/ts/BufferWriter.h>:609:23: note: declared here
template <typename... Args>
                      ^
<https://ci.trafficserver.apache.org/job/macOS-master/compiler=clang,label=macOS,type=debug/ws/src/BUILDS/../lib/ts/BufferWriter.h>:674:81: error: no member named 'index_sequence_for' in namespace 'std'
  static const auto fa   = bw_fmt::Get_Arg_Formatter_Array<decltype(args)>(std::index_sequence_for<Args...>{});
                                                                           ~~~~~^
<https://ci.trafficserver.apache.org/job/macOS-master/compiler=clang,label=macOS,type=debug/ws/src/BUILDS/../lib/ts/BufferWriter.h>:674:100: error: 'Args' does not refer to a value
  static const auto fa   = bw_fmt::Get_Arg_Formatter_Array<decltype(args)>(std::index_sequence_for<Args...>{});
                                                                                                   ^
<https://ci.trafficserver.apache.org/job/macOS-master/compiler=clang,label=macOS,type=debug/ws/src/BUILDS/../lib/ts/BufferWriter.h>:669:23: note: declared here
template <typename... Args>
                      ^
8 errors generated.
make[3]: *** [Diags.lo] Error 1
make[2]: *** [all-recursive] Error 1
make[1]: *** [all] Error 2
make: *** [all-recursive] Error 1
Build step 'Execute shell' marked build as failure

Jenkins build is back to normal : macOS-master » clang,macOS,debug #2060

Posted by je...@ci.trafficserver.apache.org.
See <https://ci.trafficserver.apache.org/job/macOS-master/compiler=clang,label=macOS,type=debug/2060/display/redirect?page=changes>