You are viewing a plain text version of this content. The canonical link for it is here.
Posted to commits@karaf.apache.org by Apache Jenkins Server <je...@builds.apache.org> on 2017/07/12 09:09:14 UTC

Build failed in Jenkins: karaf-decanter-master #178

See <https://builds.apache.org/job/karaf-decanter-master/178/display/redirect>

------------------------------------------
[...truncated 237.78 KB...]
[INFO] --- maven-compiler-plugin:3.1:compile (default-compile) @ org.apache.karaf.decanter.appender.elasticsearch-native-2.x ---
[INFO] Changes detected - recompiling the module!
[INFO] Compiling 2 source files to <https://builds.apache.org/job/karaf-decanter-master/ws/appender/elasticsearch-native-2.x/target/classes>
[INFO] 
[INFO] --- maven-resources-plugin:2.6:testResources (default-testResources) @ org.apache.karaf.decanter.appender.elasticsearch-native-2.x ---
[INFO] Using 'UTF-8' encoding to copy filtered resources.
[INFO] skip non existing resourceDirectory <https://builds.apache.org/job/karaf-decanter-master/ws/appender/elasticsearch-native-2.x/src/test/resources>
[INFO] Copying 3 resources
[INFO] 
[INFO] --- maven-compiler-plugin:3.1:testCompile (default-testCompile) @ org.apache.karaf.decanter.appender.elasticsearch-native-2.x ---
[INFO] Changes detected - recompiling the module!
[INFO] Compiling 1 source file to <https://builds.apache.org/job/karaf-decanter-master/ws/appender/elasticsearch-native-2.x/target/test-classes>
[INFO] 
[INFO] --- maven-surefire-plugin:2.17:test (default-test) @ org.apache.karaf.decanter.appender.elasticsearch-native-2.x ---
[INFO] Surefire report directory: <https://builds.apache.org/job/karaf-decanter-master/ws/appender/elasticsearch-native-2.x/target/surefire-reports>

-------------------------------------------------------
 T E S T S
-------------------------------------------------------
[CodeBlob (0x00007f0d89058f10)]
Framesize: 0
BufferBlob (0x00007f0d89058f10) used for native signature handlers
#
# A fatal error has been detected by the Java Runtime Environment:
#
#  Internal Error (sharedRuntime.cpp:834), pid=30695, tid=0x00007f0da0f78700
#  fatal error: exception happened outside interpreter, nmethods and vtable stubs at pc 0x00007f0d8905939b
#
# JRE version: Java(TM) SE Runtime Environment (8.0_131-b11) (build 1.8.0_131-b11)
# Java VM: Java HotSpot(TM) 64-Bit Server VM (25.131-b11 mixed mode linux-amd64 compressed oops)
# Failed to write core dump. Core dumps have been disabled. To enable core dumping, try "ulimit -c unlimited" before starting Java again
#
# An error report file with more information is saved as:
# <https://builds.apache.org/job/karaf-decanter-master/ws/appender/elasticsearch-native-2.x/hs_err_pid30695.log>
#
# If you would like to submit a bug report, please visit:
#   http://bugreport.java.com/bugreport/crash.jsp
#
Aborted

Results :

Tests run: 0, Failures: 0, Errors: 0, Skipped: 0

[JENKINS] Recording test results
[INFO] ------------------------------------------------------------------------
[INFO] Reactor Summary:
[INFO] 
[INFO] Apache Karaf :: Decanter ........................... SUCCESS [ 13.120 s]
[INFO] Apache Karaf :: Decanter :: API .................... SUCCESS [ 15.108 s]
[INFO] Apache Karaf :: Decanter :: Collector .............. SUCCESS [  5.476 s]
[INFO] Apache Karaf :: Decanter :: Collector :: JMX ....... SUCCESS [01:15 min]
[INFO] Apache Karaf :: Decanter :: Collector :: Log ....... SUCCESS [ 10.927 s]
[INFO] Apache Karaf :: Decanter :: Collector :: File ...... SUCCESS [  8.255 s]
[INFO] Apache Karaf :: Decanter :: Collector :: Camel Tracer SUCCESS [ 11.499 s]
[INFO] Apache Karaf :: Decanter :: Collector :: System .... SUCCESS [ 11.620 s]
[INFO] Apache Karaf :: Decanter :: Collector :: Log Socket  SUCCESS [ 17.713 s]
[INFO] Apache Karaf :: Decanter :: Collector :: REST ...... SUCCESS [ 10.292 s]
[INFO] Apache Karaf :: Decanter :: Collector :: REST :: Servlet SUCCESS [ 11.917 s]
[INFO] Apache Karaf :: Decanter :: Collector :: EventAdmin  SUCCESS [ 13.110 s]
[INFO] Apache Karaf :: Decanter :: Collector :: Kafka ..... SUCCESS [ 10.233 s]
[INFO] Apache Karaf :: Decanter :: Marshaller ............. SUCCESS [  5.580 s]
[INFO] Apache Karaf :: Decanter :: Marshaller :: Json ..... SUCCESS [  9.313 s]
[INFO] Apache Karaf :: Decanter :: Collector :: JMS ....... SUCCESS [ 15.780 s]
[INFO] Apache Karaf :: Decanter :: Collector :: Process ... SUCCESS [  9.865 s]
[INFO] Apache Karaf :: Decanter :: Collector :: Socket .... SUCCESS [ 10.041 s]
[INFO] Apache Karaf :: Decanter :: Collector :: MQTT ...... SUCCESS [ 13.231 s]
[INFO] Apache Karaf :: Decanter :: Appender ............... SUCCESS [  6.494 s]
[INFO] Apache Karaf :: Decanter :: Appender :: Log ........ SUCCESS [  8.018 s]
[INFO] Apache Karaf :: Decanter :: Appender :: Elasticsearch Native 1.x SUCCESS [ 23.471 s]
[INFO] Apache Karaf :: Decanter :: Appender :: Elasticsearch Native 2.x FAILURE [  6.086 s]
[INFO] Apache Karaf :: Decanter :: Appender :: Elasticsearch REST SKIPPED
[INFO] Apache Karaf :: Decanter :: Appender :: JDBC ....... SKIPPED
[INFO] Apache Karaf :: Decanter :: Appender :: JMS ........ SKIPPED
[INFO] Apache Karaf :: Decanter :: Appender :: Camel ...... SKIPPED
[INFO] Apache Karaf :: Decanter :: Appender :: Kafka ...... SKIPPED
[INFO] Apache Karaf :: Decanter :: Appender :: MQTT ....... SKIPPED
[INFO] Apache Karaf :: Decanter :: Appender :: Cassandra .. SKIPPED
[INFO] Apache Karaf :: Decanter :: Appender :: Redis ...... SKIPPED
[INFO] Apache Karaf :: Decanter :: Appender :: REST ....... SKIPPED
[INFO] Apache Karaf :: Decanter :: Appender :: MongoDB .... SKIPPED
[INFO] Apache Karaf :: Decanter :: Appender :: Socket ..... SKIPPED
[INFO] Apache Karaf :: Decanter :: SLA .................... SKIPPED
[INFO] Apache Karaf :: Decanter :: SLA :: Checker ......... SKIPPED
[INFO] Apache Karaf :: Decanter :: SLA :: Log ............. SKIPPED
[INFO] Apache Karaf :: Decanter :: SLA :: e-mail .......... SKIPPED
[INFO] Apache Karaf :: Decanter :: SLA :: Camel ........... SKIPPED
[INFO] Apache Karaf :: Decanter :: Elasticsearch 1.x ...... SKIPPED
[INFO] Apache Karaf :: Decanter :: Elasticsearch 2.x ...... SKIPPED
[INFO] Apache Karaf :: Decanter :: Elasticsearch Head 1.x . SKIPPED
[INFO] Apache Karaf :: Decanter :: Elasticsearch Head 2.x . SKIPPED
[INFO] Apache Karaf :: Decanter :: Kibana ................. SKIPPED
[INFO] Apache Karaf :: Decanter :: Kibana 4.x ............. SKIPPED
[INFO] Apache Karaf :: Decanter :: Spring Boot Starter .... SKIPPED
[INFO] Apache Karaf :: Decanter :: Assembly ............... SKIPPED
[INFO] Apache Karaf :: Decanter :: Tools Jar Wrapper ...... SKIPPED
[INFO] ------------------------------------------------------------------------
[INFO] BUILD FAILURE
[INFO] ------------------------------------------------------------------------
[INFO] Total time: 07:03 min
[INFO] Finished at: 2017-07-12T09:08:18+00:00
[INFO] Final Memory: 75M/817M
[INFO] ------------------------------------------------------------------------
[ERROR] Failed to execute goal org.apache.maven.plugins:maven-surefire-plugin:2.17:test (default-test) on project org.apache.karaf.decanter.appender.elasticsearch-native-2.x: Execution default-test of goal org.apache.maven.plugins:maven-surefire-plugin:2.17:test failed: The forked VM terminated without properly saying goodbye. VM crash or System.exit called?
[ERROR] Command was /bin/sh -c cd <https://builds.apache.org/job/karaf-decanter-master/ws/appender/elasticsearch-native-2.x> && /usr/local/asfpackages/java/jdk1.8.0_131/jre/bin/java -jar <https://builds.apache.org/job/karaf-decanter-master/ws/appender/elasticsearch-native-2.x/target/surefire/surefirebooter4890432182941690067.jar> <https://builds.apache.org/job/karaf-decanter-master/ws/appender/elasticsearch-native-2.x/target/surefire/surefire712771780600809793tmp> <https://builds.apache.org/job/karaf-decanter-master/ws/appender/elasticsearch-native-2.x/target/surefire/surefire_77445919305423294022tmp>
[ERROR] -> [Help 1]
org.apache.maven.lifecycle.LifecycleExecutionException: Failed to execute goal org.apache.maven.plugins:maven-surefire-plugin:2.17:test (default-test) on project org.apache.karaf.decanter.appender.elasticsearch-native-2.x: Execution default-test of goal org.apache.maven.plugins:maven-surefire-plugin:2.17:test failed: The forked VM terminated without properly saying goodbye. VM crash or System.exit called?
Command was /bin/sh -c cd <https://builds.apache.org/job/karaf-decanter-master/ws/appender/elasticsearch-native-2.x> && /usr/local/asfpackages/java/jdk1.8.0_131/jre/bin/java -jar <https://builds.apache.org/job/karaf-decanter-master/ws/appender/elasticsearch-native-2.x/target/surefire/surefirebooter4890432182941690067.jar> <https://builds.apache.org/job/karaf-decanter-master/ws/appender/elasticsearch-native-2.x/target/surefire/surefire712771780600809793tmp> <https://builds.apache.org/job/karaf-decanter-master/ws/appender/elasticsearch-native-2.x/target/surefire/surefire_77445919305423294022tmp>
	at org.apache.maven.lifecycle.internal.MojoExecutor.execute(MojoExecutor.java:224)
	at org.apache.maven.lifecycle.internal.MojoExecutor.execute(MojoExecutor.java:153)
	at org.apache.maven.lifecycle.internal.MojoExecutor.execute(MojoExecutor.java:145)
	at org.apache.maven.lifecycle.internal.LifecycleModuleBuilder.buildProject(LifecycleModuleBuilder.java:116)
	at org.apache.maven.lifecycle.internal.LifecycleModuleBuilder.buildProject(LifecycleModuleBuilder.java:80)
	at org.apache.maven.lifecycle.internal.builder.singlethreaded.SingleThreadedBuilder.build(SingleThreadedBuilder.java:51)
	at org.apache.maven.lifecycle.internal.LifecycleStarter.execute(LifecycleStarter.java:128)
	at org.apache.maven.DefaultMaven.doExecute(DefaultMaven.java:307)
	at org.apache.maven.DefaultMaven.doExecute(DefaultMaven.java:193)
	at org.apache.maven.DefaultMaven.execute(DefaultMaven.java:106)
	at org.jvnet.hudson.maven3.launcher.Maven33Launcher.main(Maven33Launcher.java:129)
	at sun.reflect.NativeMethodAccessorImpl.invoke0(Native Method)
	at sun.reflect.NativeMethodAccessorImpl.invoke(NativeMethodAccessorImpl.java:62)
	at sun.reflect.DelegatingMethodAccessorImpl.invoke(DelegatingMethodAccessorImpl.java:43)
	at java.lang.reflect.Method.invoke(Method.java:498)
	at org.codehaus.plexus.classworlds.launcher.Launcher.launchStandard(Launcher.java:330)
	at org.codehaus.plexus.classworlds.launcher.Launcher.launch(Launcher.java:238)
	at jenkins.maven3.agent.Maven33Main.launch(Maven33Main.java:176)
	at sun.reflect.NativeMethodAccessorImpl.invoke0(Native Method)
	at sun.reflect.NativeMethodAccessorImpl.invoke(NativeMethodAccessorImpl.java:62)
	at sun.reflect.DelegatingMethodAccessorImpl.invoke(DelegatingMethodAccessorImpl.java:43)
	at java.lang.reflect.Method.invoke(Method.java:498)
	at hudson.maven.Maven3Builder.call(Maven3Builder.java:139)
	at hudson.maven.Maven3Builder.call(Maven3Builder.java:70)
	at hudson.remoting.UserRequest.perform(UserRequest.java:153)
	at hudson.remoting.UserRequest.perform(UserRequest.java:50)
	at hudson.remoting.Request$2.run(Request.java:336)
	at hudson.remoting.InterceptingExecutorService$1.call(InterceptingExecutorService.java:68)
	at java.util.concurrent.FutureTask.run(FutureTask.java:266)
	at java.util.concurrent.ThreadPoolExecutor.runWorker(ThreadPoolExecutor.java:1142)
	at java.util.concurrent.ThreadPoolExecutor$Worker.run(ThreadPoolExecutor.java:617)
	at java.lang.Thread.run(Thread.java:748)
Caused by: org.apache.maven.plugin.PluginExecutionException: Execution default-test of goal org.apache.maven.plugins:maven-surefire-plugin:2.17:test failed: The forked VM terminated without properly saying goodbye. VM crash or System.exit called?
Command was /bin/sh -c cd <https://builds.apache.org/job/karaf-decanter-master/ws/appender/elasticsearch-native-2.x> && /usr/local/asfpackages/java/jdk1.8.0_131/jre/bin/java -jar <https://builds.apache.org/job/karaf-decanter-master/ws/appender/elasticsearch-native-2.x/target/surefire/surefirebooter4890432182941690067.jar> <https://builds.apache.org/job/karaf-decanter-master/ws/appender/elasticsearch-native-2.x/target/surefire/surefire712771780600809793tmp> <https://builds.apache.org/job/karaf-decanter-master/ws/appender/elasticsearch-native-2.x/target/surefire/surefire_77445919305423294022tmp>
	at org.apache.maven.plugin.DefaultBuildPluginManager.executeMojo(DefaultBuildPluginManager.java:145)
	at org.apache.maven.lifecycle.internal.MojoExecutor.execute(MojoExecutor.java:208)
	... 31 more
Caused by: java.lang.RuntimeException: The forked VM terminated without properly saying goodbye. VM crash or System.exit called?
Command was /bin/sh -c cd <https://builds.apache.org/job/karaf-decanter-master/ws/appender/elasticsearch-native-2.x> && /usr/local/asfpackages/java/jdk1.8.0_131/jre/bin/java -jar <https://builds.apache.org/job/karaf-decanter-master/ws/appender/elasticsearch-native-2.x/target/surefire/surefirebooter4890432182941690067.jar> <https://builds.apache.org/job/karaf-decanter-master/ws/appender/elasticsearch-native-2.x/target/surefire/surefire712771780600809793tmp> <https://builds.apache.org/job/karaf-decanter-master/ws/appender/elasticsearch-native-2.x/target/surefire/surefire_77445919305423294022tmp>
	at org.apache.maven.plugin.surefire.booterclient.ForkStarter.fork(ForkStarter.java:485)
	at org.apache.maven.plugin.surefire.booterclient.ForkStarter.fork(ForkStarter.java:352)
	at org.apache.maven.plugin.surefire.booterclient.ForkStarter.run(ForkStarter.java:158)
	at org.apache.maven.plugin.surefire.AbstractSurefireMojo.executeProvider(AbstractSurefireMojo.java:967)
	at org.apache.maven.plugin.surefire.AbstractSurefireMojo.executeAfterPreconditionsChecked(AbstractSurefireMojo.java:831)
	at org.apache.maven.plugin.surefire.AbstractSurefireMojo.execute(AbstractSurefireMojo.java:729)
	at org.apache.maven.plugin.DefaultBuildPluginManager.executeMojo(DefaultBuildPluginManager.java:134)
	... 32 more
[ERROR] 
[ERROR] Re-run Maven using the -X switch to enable full debug logging.
[ERROR] 
[ERROR] For more information about the errors and possible solutions, please read the following articles:
[ERROR] [Help 1] http://cwiki.apache.org/confluence/display/MAVEN/PluginExecutionException
[ERROR] 
[ERROR] After correcting the problems, you can resume the build with the command
[ERROR]   mvn <goals> -rf :org.apache.karaf.decanter.appender.elasticsearch-native-2.x
[JENKINS] Archiving <https://builds.apache.org/job/karaf-decanter-master/ws/appender/mqtt/pom.xml> to org.apache.karaf.decanter.appender/org.apache.karaf.decanter.appender.mqtt/1.4.0-SNAPSHOT/org.apache.karaf.decanter.appender.mqtt-1.4.0-SNAPSHOT.pom
[JENKINS] Archiving <https://builds.apache.org/job/karaf-decanter-master/ws/elasticsearch-2.x/pom.xml> to org.apache.karaf.decanter/org.apache.karaf.decanter.elasticsearch-2.x/1.4.0-SNAPSHOT/org.apache.karaf.decanter.elasticsearch-2.x-1.4.0-SNAPSHOT.pom
[JENKINS] Archiving <https://builds.apache.org/job/karaf-decanter-master/ws/appender/log/pom.xml> to org.apache.karaf.decanter.appender/org.apache.karaf.decanter.appender.log/1.4.0-SNAPSHOT/org.apache.karaf.decanter.appender.log-1.4.0-SNAPSHOT.pom
[JENKINS] Archiving <https://builds.apache.org/job/karaf-decanter-master/ws/appender/log/target/org.apache.karaf.decanter.appender.log-1.4.0-SNAPSHOT.jar> to org.apache.karaf.decanter.appender/org.apache.karaf.decanter.appender.log/1.4.0-20170712.090650-15/org.apache.karaf.decanter.appender.log-1.4.0-20170712.090650-15.jar
[JENKINS] Archiving <https://builds.apache.org/job/karaf-decanter-master/ws/sla/email/pom.xml> to org.apache.karaf.decanter.sla/org.apache.karaf.decanter.sla.email/1.4.0-SNAPSHOT/org.apache.karaf.decanter.sla.email-1.4.0-SNAPSHOT.pom
[JENKINS] Archiving <https://builds.apache.org/job/karaf-decanter-master/ws/appender/cassandra/pom.xml> to org.apache.karaf.decanter.appender/org.apache.karaf.decanter.appender.cassandra/1.4.0-SNAPSHOT/org.apache.karaf.decanter.appender.cassandra-1.4.0-SNAPSHOT.pom
[JENKINS] Archiving <https://builds.apache.org/job/karaf-decanter-master/ws/appender/mongodb/pom.xml> to org.apache.karaf.decanter.appender/org.apache.karaf.decanter.appender.mongodb/1.4.0-SNAPSHOT/org.apache.karaf.decanter.appender.mongodb-1.4.0-SNAPSHOT.pom
[JENKINS] Archiving <https://builds.apache.org/job/karaf-decanter-master/ws/elasticsearch-1.x/pom.xml> to org.apache.karaf.decanter/org.apache.karaf.decanter.elasticsearch-1.x/1.4.0-SNAPSHOT/org.apache.karaf.decanter.elasticsearch-1.x-1.4.0-SNAPSHOT.pom
[JENKINS] Archiving <https://builds.apache.org/job/karaf-decanter-master/ws/collector/eventadmin/pom.xml> to org.apache.karaf.decanter.collector/org.apache.karaf.decanter.collector.eventadmin/1.4.0-SNAPSHOT/org.apache.karaf.decanter.collector.eventadmin-1.4.0-SNAPSHOT.pom
[JENKINS] Archiving <https://builds.apache.org/job/karaf-decanter-master/ws/collector/eventadmin/target/org.apache.karaf.decanter.collector.eventadmin-1.4.0-SNAPSHOT.jar> to org.apache.karaf.decanter.collector/org.apache.karaf.decanter.collector.eventadmin/1.4.0-20170712.090459-15/org.apache.karaf.decanter.collector.eventadmin-1.4.0-20170712.090459-15.jar
[JENKINS] Archiving <https://builds.apache.org/job/karaf-decanter-master/ws/collector/eventadmin/src/main/cfg/org.apache.karaf.decanter.collector.eventadmin-framework.cfg> to org.apache.karaf.decanter.collector/org.apache.karaf.decanter.collector.eventadmin/1.4.0-20170712.090459-15/org.apache.karaf.decanter.collector.eventadmin-1.4.0-20170712.090459-15-framework.cfg
[JENKINS] Archiving <https://builds.apache.org/job/karaf-decanter-master/ws/collector/eventadmin/src/main/cfg/org.apache.karaf.decanter.collector.eventadmin-karaf.cfg> to org.apache.karaf.decanter.collector/org.apache.karaf.decanter.collector.eventadmin/1.4.0-20170712.090459-15/org.apache.karaf.decanter.collector.eventadmin-1.4.0-20170712.090459-15-karaf.cfg
[JENKINS] Archiving <https://builds.apache.org/job/karaf-decanter-master/ws/appender/redis/pom.xml> to org.apache.karaf.decanter.appender/org.apache.karaf.decanter.appender.redis/1.4.0-SNAPSHOT/org.apache.karaf.decanter.appender.redis-1.4.0-SNAPSHOT.pom
[JENKINS] Archiving <https://builds.apache.org/job/karaf-decanter-master/ws/marshaller/json/pom.xml> to org.apache.karaf.decanter.marshaller/org.apache.karaf.decanter.marshaller.json/1.4.0-SNAPSHOT/org.apache.karaf.decanter.marshaller.json-1.4.0-SNAPSHOT.pom
[JENKINS] Archiving <https://builds.apache.org/job/karaf-decanter-master/ws/marshaller/json/target/org.apache.karaf.decanter.marshaller.json-1.4.0-SNAPSHOT.jar> to org.apache.karaf.decanter.marshaller/org.apache.karaf.decanter.marshaller.json/1.4.0-20170712.090534-15/org.apache.karaf.decanter.marshaller.json-1.4.0-20170712.090534-15.jar
[JENKINS] Archiving <https://builds.apache.org/job/karaf-decanter-master/ws/sla/camel/pom.xml> to org.apache.karaf.decanter.sla/org.apache.karaf.decanter.sla.camel/1.4.0-SNAPSHOT/org.apache.karaf.decanter.sla.camel-1.4.0-SNAPSHOT.pom
[JENKINS] Archiving <https://builds.apache.org/job/karaf-decanter-master/ws/collector/log4j-socket/pom.xml> to org.apache.karaf.decanter.collector/org.apache.karaf.decanter.collector.log.socket/1.4.0-SNAPSHOT/org.apache.karaf.decanter.collector.log.socket-1.4.0-SNAPSHOT.pom
[JENKINS] Archiving <https://builds.apache.org/job/karaf-decanter-master/ws/collector/log4j-socket/target/org.apache.karaf.decanter.collector.log.socket-1.4.0-SNAPSHOT.jar> to org.apache.karaf.decanter.collector/org.apache.karaf.decanter.collector.log.socket/1.4.0-20170712.090417-15/org.apache.karaf.decanter.collector.log.socket-1.4.0-20170712.090417-15.jar
[JENKINS] Archiving <https://builds.apache.org/job/karaf-decanter-master/ws/collector/log4j-socket/src/main/cfg/org.apache.karaf.decanter.collector.log.socket.cfg> to org.apache.karaf.decanter.collector/org.apache.karaf.decanter.collector.log.socket/1.4.0-20170712.090417-15/org.apache.karaf.decanter.collector.log.socket-1.4.0-20170712.090417-15.cfg
Compressed 130.42 KB of artifacts by 24.5% relative to #177
[JENKINS] Archiving <https://builds.apache.org/job/karaf-decanter-master/ws/collector/rest-servlet/pom.xml> to org.apache.karaf.decanter.collector/org.apache.karaf.decanter.collector.rest.servlet/1.4.0-SNAPSHOT/org.apache.karaf.decanter.collector.rest.servlet-1.4.0-SNAPSHOT.pom
[JENKINS] Archiving <https://builds.apache.org/job/karaf-decanter-master/ws/collector/rest-servlet/target/org.apache.karaf.decanter.collector.rest.servlet-1.4.0-SNAPSHOT.jar> to org.apache.karaf.decanter.collector/org.apache.karaf.decanter.collector.rest.servlet/1.4.0-20170712.090445-15/org.apache.karaf.decanter.collector.rest.servlet-1.4.0-20170712.090445-15.jar
[JENKINS] Archiving <https://builds.apache.org/job/karaf-decanter-master/ws/collector/rest-servlet/src/main/cfg/org.apache.karaf.decanter.collector.rest.servlet.cfg> to org.apache.karaf.decanter.collector/org.apache.karaf.decanter.collector.rest.servlet/1.4.0-20170712.090445-15/org.apache.karaf.decanter.collector.rest.servlet-1.4.0-20170712.090445-15.cfg
[JENKINS] Archiving <https://builds.apache.org/job/karaf-decanter-master/ws/api/pom.xml> to org.apache.karaf.decanter/org.apache.karaf.decanter.api/1.4.0-SNAPSHOT/org.apache.karaf.decanter.api-1.4.0-SNAPSHOT.pom
[JENKINS] Archiving <https://builds.apache.org/job/karaf-decanter-master/ws/api/target/org.apache.karaf.decanter.api-1.4.0-SNAPSHOT.jar> to org.apache.karaf.decanter/org.apache.karaf.decanter.api/1.4.0-20170712.090145-15/org.apache.karaf.decanter.api-1.4.0-20170712.090145-15.jar
[JENKINS] Archiving <https://builds.apache.org/job/karaf-decanter-master/ws/collector/kafka/pom.xml> to org.apache.karaf.decanter.collector/org.apache.karaf.decanter.collector.kafka/1.4.0-SNAPSHOT/org.apache.karaf.decanter.collector.kafka-1.4.0-SNAPSHOT.pom
[JENKINS] Archiving <https://builds.apache.org/job/karaf-decanter-master/ws/collector/kafka/target/org.apache.karaf.decanter.collector.kafka-1.4.0-SNAPSHOT.jar> to org.apache.karaf.decanter.collector/org.apache.karaf.decanter.collector.kafka/1.4.0-20170712.090514-15/org.apache.karaf.decanter.collector.kafka-1.4.0-20170712.090514-15.jar
[JENKINS] Archiving <https://builds.apache.org/job/karaf-decanter-master/ws/collector/kafka/src/main/cfg/org.apache.karaf.decanter.collector.kafka.cfg> to org.apache.karaf.decanter.collector/org.apache.karaf.decanter.collector.kafka/1.4.0-20170712.090514-15/org.apache.karaf.decanter.collector.kafka-1.4.0-20170712.090514-15.cfg
[JENKINS] Archiving <https://builds.apache.org/job/karaf-decanter-master/ws/collector/pom.xml> to org.apache.karaf.decanter/collector/1.4.0-SNAPSHOT/collector-1.4.0-SNAPSHOT.pom
[JENKINS] Archiving <https://builds.apache.org/job/karaf-decanter-master/ws/spring-boot-starter-decanter/pom.xml> to org.apache.karaf.decanter/spring-boot-starter-decanter/1.4.0-SNAPSHOT/spring-boot-starter-decanter-1.4.0-SNAPSHOT.pom
[JENKINS] Archiving <https://builds.apache.org/job/karaf-decanter-master/ws/assembly/pom.xml> to org.apache.karaf.decanter/apache-karaf-decanter/1.4.0-SNAPSHOT/apache-karaf-decanter-1.4.0-SNAPSHOT.pom
[JENKINS] Archiving <https://builds.apache.org/job/karaf-decanter-master/ws/pom.xml> to org.apache.karaf/decanter/1.4.0-SNAPSHOT/decanter-1.4.0-SNAPSHOT.pom
[JENKINS] Archiving <https://builds.apache.org/job/karaf-decanter-master/ws/appender/rest/pom.xml> to org.apache.karaf.decanter.appender/org.apache.karaf.decanter.appender.rest/1.4.0-SNAPSHOT/org.apache.karaf.decanter.appender.rest-1.4.0-SNAPSHOT.pom
[JENKINS] Archiving <https://builds.apache.org/job/karaf-decanter-master/ws/appender/elasticsearch-native-1.x/pom.xml> to org.apache.karaf.decanter.appender/org.apache.karaf.decanter.appender.elasticsearch-native-1.x/1.4.0-SNAPSHOT/org.apache.karaf.decanter.appender.elasticsearch-native-1.x-1.4.0-SNAPSHOT.pom
[JENKINS] Archiving <https://builds.apache.org/job/karaf-decanter-master/ws/appender/elasticsearch-native-1.x/target/org.apache.karaf.decanter.appender.elasticsearch-native-1.x-1.4.0-SNAPSHOT.jar> to org.apache.karaf.decanter.appender/org.apache.karaf.decanter.appender.elasticsearch-native-1.x/1.4.0-20170712.090714-15/org.apache.karaf.decanter.appender.elasticsearch-native-1.x-1.4.0-20170712.090714-15.jar
[JENKINS] Archiving <https://builds.apache.org/job/karaf-decanter-master/ws/appender/elasticsearch-native-1.x/src/main/cfg/org.apache.karaf.decanter.appender.elasticsearch.cfg> to org.apache.karaf.decanter.appender/org.apache.karaf.decanter.appender.elasticsearch-native-1.x/1.4.0-20170712.090714-15/org.apache.karaf.decanter.appender.elasticsearch-native-1.x-1.4.0-20170712.090714-15.cfg
[JENKINS] Archiving <https://builds.apache.org/job/karaf-decanter-master/ws/collector/jmx/pom.xml> to org.apache.karaf.decanter.collector/org.apache.karaf.decanter.collector.jmx/1.4.0-SNAPSHOT/org.apache.karaf.decanter.collector.jmx-1.4.0-SNAPSHOT.pom
[JENKINS] Archiving <https://builds.apache.org/job/karaf-decanter-master/ws/collector/jmx/target/org.apache.karaf.decanter.collector.jmx-1.4.0-SNAPSHOT.jar> to org.apache.karaf.decanter.collector/org.apache.karaf.decanter.collector.jmx/1.4.0-20170712.090304-15/org.apache.karaf.decanter.collector.jmx-1.4.0-20170712.090304-15.jar
[JENKINS] Archiving <https://builds.apache.org/job/karaf-decanter-master/ws/collector/jmx/src/main/cfg/org.apache.karaf.decanter.collector.jmx-local.cfg> to org.apache.karaf.decanter.collector/org.apache.karaf.decanter.collector.jmx/1.4.0-20170712.090304-15/org.apache.karaf.decanter.collector.jmx-1.4.0-20170712.090304-15-local.cfg
[JENKINS] Archiving <https://builds.apache.org/job/karaf-decanter-master/ws/collector/jmx/src/main/cfg/org.apache.karaf.decanter.collector.jmx-camel.cfg> to org.apache.karaf.decanter.collector/org.apache.karaf.decanter.collector.jmx/1.4.0-20170712.090304-15/org.apache.karaf.decanter.collector.jmx-1.4.0-20170712.090304-15-camel.cfg
[JENKINS] Archiving <https://builds.apache.org/job/karaf-decanter-master/ws/collector/jmx/src/main/cfg/org.apache.karaf.decanter.collector.jmx-activemq.cfg> to org.apache.karaf.decanter.collector/org.apache.karaf.decanter.collector.jmx/1.4.0-20170712.090304-15/org.apache.karaf.decanter.collector.jmx-1.4.0-20170712.090304-15-activemq.cfg
[JENKINS] Archiving <https://builds.apache.org/job/karaf-decanter-master/ws/appender/kafka/pom.xml> to org.apache.karaf.decanter.appender/org.apache.karaf.decanter.appender.kafka/1.4.0-SNAPSHOT/org.apache.karaf.decanter.appender.kafka-1.4.0-SNAPSHOT.pom
[JENKINS] Archiving <https://builds.apache.org/job/karaf-decanter-master/ws/collector/file/pom.xml> to org.apache.karaf.decanter.collector/org.apache.karaf.decanter.collector.file/1.4.0-SNAPSHOT/org.apache.karaf.decanter.collector.file-1.4.0-SNAPSHOT.pom
[JENKINS] Archiving <https://builds.apache.org/job/karaf-decanter-master/ws/collector/file/target/org.apache.karaf.decanter.collector.file-1.4.0-SNAPSHOT.jar> to org.apache.karaf.decanter.collector/org.apache.karaf.decanter.collector.file/1.4.0-20170712.090333-15/org.apache.karaf.decanter.collector.file-1.4.0-20170712.090333-15.jar
[JENKINS] Archiving <https://builds.apache.org/job/karaf-decanter-master/ws/collector/jms/pom.xml> to org.apache.karaf.decanter.collector/org.apache.karaf.decanter.collector.jms/1.4.0-SNAPSHOT/org.apache.karaf.decanter.collector.jms-1.4.0-SNAPSHOT.pom
[JENKINS] Archiving <https://builds.apache.org/job/karaf-decanter-master/ws/collector/jms/target/org.apache.karaf.decanter.collector.jms-1.4.0-SNAPSHOT.jar> to org.apache.karaf.decanter.collector/org.apache.karaf.decanter.collector.jms/1.4.0-20170712.090550-15/org.apache.karaf.decanter.collector.jms-1.4.0-20170712.090550-15.jar
[JENKINS] Archiving <https://builds.apache.org/job/karaf-decanter-master/ws/collector/jms/src/main/cfg/org.apache.karaf.decanter.collector.jms.cfg> to org.apache.karaf.decanter.collector/org.apache.karaf.decanter.collector.jms/1.4.0-20170712.090550-15/org.apache.karaf.decanter.collector.jms-1.4.0-20170712.090550-15.cfg
[JENKINS] Archiving <https://builds.apache.org/job/karaf-decanter-master/ws/appender/elasticsearch-native-2.x/pom.xml> to org.apache.karaf.decanter.appender/org.apache.karaf.decanter.appender.elasticsearch-native-2.x/1.4.0-SNAPSHOT/org.apache.karaf.decanter.appender.elasticsearch-native-2.x-1.4.0-SNAPSHOT.pom
[JENKINS] Archiving <https://builds.apache.org/job/karaf-decanter-master/ws/collector/system/pom.xml> to org.apache.karaf.decanter.collector/org.apache.karaf.decanter.collector.system/1.4.0-SNAPSHOT/org.apache.karaf.decanter.collector.system-1.4.0-SNAPSHOT.pom
[JENKINS] Archiving <https://builds.apache.org/job/karaf-decanter-master/ws/collector/system/target/org.apache.karaf.decanter.collector.system-1.4.0-SNAPSHOT.jar> to org.apache.karaf.decanter.collector/org.apache.karaf.decanter.collector.system/1.4.0-20170712.090358-15/org.apache.karaf.decanter.collector.system-1.4.0-20170712.090358-15.jar
[JENKINS] Archiving <https://builds.apache.org/job/karaf-decanter-master/ws/collector/system/src/main/cfg/org.apache.karaf.decanter.collector.system.cfg> to org.apache.karaf.decanter.collector/org.apache.karaf.decanter.collector.system/1.4.0-20170712.090358-15/org.apache.karaf.decanter.collector.system-1.4.0-20170712.090358-15.cfg
[JENKINS] Archiving <https://builds.apache.org/job/karaf-decanter-master/ws/sla/pom.xml> to org.apache.karaf.decanter/sla/1.4.0-SNAPSHOT/sla-1.4.0-SNAPSHOT.pom
[JENKINS] Archiving <https://builds.apache.org/job/karaf-decanter-master/ws/sla/log/pom.xml> to org.apache.karaf.decanter.sla/org.apache.karaf.decanter.sla.log/1.4.0-SNAPSHOT/org.apache.karaf.decanter.sla.log-1.4.0-SNAPSHOT.pom
[JENKINS] Archiving <https://builds.apache.org/job/karaf-decanter-master/ws/appender/elasticsearch-rest/pom.xml> to org.apache.karaf.decanter.appender/org.apache.karaf.decanter.appender.elasticsearch.rest/1.4.0-SNAPSHOT/org.apache.karaf.decanter.appender.elasticsearch.rest-1.4.0-SNAPSHOT.pom
[JENKINS] Archiving <https://builds.apache.org/job/karaf-decanter-master/ws/collector/process/pom.xml> to org.apache.karaf.decanter.collector/org.apache.karaf.decanter.collector.process/1.4.0-SNAPSHOT/org.apache.karaf.decanter.collector.process-1.4.0-SNAPSHOT.pom
[JENKINS] Archiving <https://builds.apache.org/job/karaf-decanter-master/ws/collector/process/target/org.apache.karaf.decanter.collector.process-1.4.0-SNAPSHOT.jar> to org.apache.karaf.decanter.collector/org.apache.karaf.decanter.collector.process/1.4.0-20170712.090602-15/org.apache.karaf.decanter.collector.process-1.4.0-20170712.090602-15.jar
[JENKINS] Archiving <https://builds.apache.org/job/karaf-decanter-master/ws/collector/process/src/main/cfg/org.apache.karaf.decanter.collector.process-jmx.cfg> to org.apache.karaf.decanter.collector/org.apache.karaf.decanter.collector.process/1.4.0-20170712.090602-15/org.apache.karaf.decanter.collector.process-1.4.0-20170712.090602-15-process.cfg
[JENKINS] Archiving <https://builds.apache.org/job/karaf-decanter-master/ws/collector/log/pom.xml> to org.apache.karaf.decanter.collector/org.apache.karaf.decanter.collector.log/1.4.0-SNAPSHOT/org.apache.karaf.decanter.collector.log-1.4.0-SNAPSHOT.pom
[JENKINS] Archiving <https://builds.apache.org/job/karaf-decanter-master/ws/collector/log/target/org.apache.karaf.decanter.collector.log-1.4.0-SNAPSHOT.jar> to org.apache.karaf.decanter.collector/org.apache.karaf.decanter.collector.log/1.4.0-20170712.090321-15/org.apache.karaf.decanter.collector.log-1.4.0-20170712.090321-15.jar
[JENKINS] Archiving <https://builds.apache.org/job/karaf-decanter-master/ws/collector/log/src/main/cfg/org.apache.karaf.decanter.collector.log.cfg> to org.apache.karaf.decanter.collector/org.apache.karaf.decanter.collector.log/1.4.0-20170712.090321-15/org.apache.karaf.decanter.collector.log-1.4.0-20170712.090321-15.cfg
[JENKINS] Archiving <https://builds.apache.org/job/karaf-decanter-master/ws/appender/pom.xml> to org.apache.karaf.decanter/appender/1.4.0-SNAPSHOT/appender-1.4.0-SNAPSHOT.pom
[JENKINS] Archiving <https://builds.apache.org/job/karaf-decanter-master/ws/collector/camel-tracer/pom.xml> to org.apache.karaf.decanter.collector/org.apache.karaf.decanter.collector.camel-tracer/1.4.0-SNAPSHOT/org.apache.karaf.decanter.collector.camel-tracer-1.4.0-SNAPSHOT.pom
[JENKINS] Archiving <https://builds.apache.org/job/karaf-decanter-master/ws/collector/camel-tracer/target/org.apache.karaf.decanter.collector.camel-tracer-1.4.0-SNAPSHOT.jar> to org.apache.karaf.decanter.collector/org.apache.karaf.decanter.collector.camel-tracer/1.4.0-20170712.090347-15/org.apache.karaf.decanter.collector.camel-tracer-1.4.0-20170712.090347-15.jar
[JENKINS] Archiving <https://builds.apache.org/job/karaf-decanter-master/ws/kibana-3.x/pom.xml> to org.apache.karaf.decanter/org.apache.karaf.decanter.kibana-3.x/1.4.0-SNAPSHOT/org.apache.karaf.decanter.kibana-3.x-1.4.0-SNAPSHOT.pom
[JENKINS] Archiving <https://builds.apache.org/job/karaf-decanter-master/ws/kibana-4.x/pom.xml> to org.apache.karaf.decanter/org.apache.karaf.decanter.kibana-4.x/1.4.0-SNAPSHOT/org.apache.karaf.decanter.kibana-4.x-1.4.0-SNAPSHOT.pom
[JENKINS] Archiving <https://builds.apache.org/job/karaf-decanter-master/ws/collector/mqtt/pom.xml> to org.apache.karaf.decanter.collector/org.apache.karaf.decanter.collector.mqtt/1.4.0-SNAPSHOT/org.apache.karaf.decanter.collector.mqtt-1.4.0-SNAPSHOT.pom
[JENKINS] Archiving <https://builds.apache.org/job/karaf-decanter-master/ws/collector/mqtt/target/org.apache.karaf.decanter.collector.mqtt-1.4.0-SNAPSHOT.jar> to org.apache.karaf.decanter.collector/org.apache.karaf.decanter.collector.mqtt/1.4.0-20170712.090630-15/org.apache.karaf.decanter.collector.mqtt-1.4.0-20170712.090630-15.jar
[JENKINS] Archiving <https://builds.apache.org/job/karaf-decanter-master/ws/collector/mqtt/src/main/cfg/org.apache.karaf.decanter.collector.mqtt.cfg> to org.apache.karaf.decanter.collector/org.apache.karaf.decanter.collector.mqtt/1.4.0-20170712.090630-15/org.apache.karaf.decanter.collector.mqtt-1.4.0-20170712.090630-15.cfg
[JENKINS] Archiving <https://builds.apache.org/job/karaf-decanter-master/ws/appender/jms/pom.xml> to org.apache.karaf.decanter.appender/org.apache.karaf.decanter.appender.jms/1.4.0-SNAPSHOT/org.apache.karaf.decanter.appender.jms-1.4.0-SNAPSHOT.pom
[JENKINS] Archiving <https://builds.apache.org/job/karaf-decanter-master/ws/appender/jdbc/pom.xml> to org.apache.karaf.decanter.appender/org.apache.karaf.decanter.appender.jdbc/1.4.0-SNAPSHOT/org.apache.karaf.decanter.appender.jdbc-1.4.0-SNAPSHOT.pom
[JENKINS] Archiving <https://builds.apache.org/job/karaf-decanter-master/ws/sla/checker/pom.xml> to org.apache.karaf.decanter.sla/org.apache.karaf.decanter.sla.checker/1.4.0-SNAPSHOT/org.apache.karaf.decanter.sla.checker-1.4.0-SNAPSHOT.pom
[JENKINS] Archiving <https://builds.apache.org/job/karaf-decanter-master/ws/collector/socket/pom.xml> to org.apache.karaf.decanter.collector/org.apache.karaf.decanter.collector.socket/1.4.0-SNAPSHOT/org.apache.karaf.decanter.collector.socket-1.4.0-SNAPSHOT.pom
[JENKINS] Archiving <https://builds.apache.org/job/karaf-decanter-master/ws/collector/socket/target/org.apache.karaf.decanter.collector.socket-1.4.0-SNAPSHOT.jar> to org.apache.karaf.decanter.collector/org.apache.karaf.decanter.collector.socket/1.4.0-20170712.090615-15/org.apache.karaf.decanter.collector.socket-1.4.0-20170712.090615-15.jar
[JENKINS] Archiving <https://builds.apache.org/job/karaf-decanter-master/ws/collector/socket/src/main/cfg/org.apache.karaf.decanter.collector.socket.cfg> to org.apache.karaf.decanter.collector/org.apache.karaf.decanter.collector.socket/1.4.0-20170712.090615-15/org.apache.karaf.decanter.collector.socket-1.4.0-20170712.090615-15.cfg
[JENKINS] Archiving <https://builds.apache.org/job/karaf-decanter-master/ws/collector/rest/pom.xml> to org.apache.karaf.decanter.collector/org.apache.karaf.decanter.collector.rest/1.4.0-SNAPSHOT/org.apache.karaf.decanter.collector.rest-1.4.0-SNAPSHOT.pom
[JENKINS] Archiving <https://builds.apache.org/job/karaf-decanter-master/ws/collector/rest/target/org.apache.karaf.decanter.collector.rest-1.4.0-SNAPSHOT.jar> to org.apache.karaf.decanter.collector/org.apache.karaf.decanter.collector.rest/1.4.0-20170712.090430-15/org.apache.karaf.decanter.collector.rest-1.4.0-20170712.090430-15.jar
[JENKINS] Archiving <https://builds.apache.org/job/karaf-decanter-master/ws/collector/rest/src/main/cfg/org.apache.karaf.decanter.collector.rest.cfg> to org.apache.karaf.decanter.collector/org.apache.karaf.decanter.collector.rest/1.4.0-20170712.090430-15/org.apache.karaf.decanter.collector.rest-1.4.0-20170712.090430-15.cfg
[JENKINS] Archiving <https://builds.apache.org/job/karaf-decanter-master/ws/appender/camel/pom.xml> to org.apache.karaf.decanter.appender/org.apache.karaf.decanter.appender.camel/1.4.0-SNAPSHOT/org.apache.karaf.decanter.appender.camel-1.4.0-SNAPSHOT.pom
[JENKINS] Archiving <https://builds.apache.org/job/karaf-decanter-master/ws/appender/socket/pom.xml> to org.apache.karaf.decanter.appender/org.apache.karaf.decanter.appender.socket/1.4.0-SNAPSHOT/org.apache.karaf.decanter.appender.socket-1.4.0-SNAPSHOT.pom
[JENKINS] Archiving <https://builds.apache.org/job/karaf-decanter-master/ws/marshaller/pom.xml> to org.apache.karaf.decanter/marshaller/1.4.0-SNAPSHOT/marshaller-1.4.0-SNAPSHOT.pom
[JENKINS] Archiving <https://builds.apache.org/job/karaf-decanter-master/ws/elasticsearch-head-1.x/pom.xml> to org.apache.karaf.decanter/org.apache.karaf.decanter.elasticsearch-head-1.x/1.4.0-SNAPSHOT/org.apache.karaf.decanter.elasticsearch-head-1.x-1.4.0-SNAPSHOT.pom
[JENKINS] Archiving <https://builds.apache.org/job/karaf-decanter-master/ws/tools-jar-wraper/pom.xml> to org.apache.karaf.decanter/tools-jar-wraper/1.4.0-SNAPSHOT/tools-jar-wraper-1.4.0-SNAPSHOT.pom
[JENKINS] Archiving <https://builds.apache.org/job/karaf-decanter-master/ws/elasticsearch-head-2.x/pom.xml> to org.apache.karaf.decanter/org.apache.karaf.decanter.elasticsearch-head-2.x/1.4.0-SNAPSHOT/org.apache.karaf.decanter.elasticsearch-head-2.x-1.4.0-SNAPSHOT.pom
Sending e-mails to: commits@karaf.apache.org
Sending e-mails to: commits@karaf.apache.org
channel stopped

Jenkins build is back to normal : karaf-decanter-master #179

Posted by Apache Jenkins Server <je...@builds.apache.org>.
See <https://builds.apache.org/job/karaf-decanter-master/179/display/redirect?page=changes>