You are viewing a plain text version of this content. The canonical link for it is here.
Posted to builds@cassandra.apache.org by Apache Jenkins Server <je...@builds.apache.org> on 2021/08/06 21:44:40 UTC
Build complete: Cassandra-4.0 #164 [UNSTABLE]
762df84f6c078a879b3bab2ccc195c95f333edc3
-------------------------------------------------------------------------------
Build Cassandra-4.0 #164 Still Unstable
URL: https://ci-cassandra.apache.org/job/Cassandra-4.0/164/
-------------------------------------------------------------------------------
Changes:
[a.penya.garcia] Use JMX to validate nodetool --jobs parameter
-------------------------------------------------------------------------------
Failed Tests:
11 tests failed.
FAILED: dtest-upgrade.upgrade_tests.compatibility_flag_test.TestCompatibilityFlag.test__compatibility_flag_on_3014
FAILED: org.apache.cassandra.distributed.test.IncrementalRepairCoordinatorTimeoutTest.prepareRPCTimeout[DATACENTER_AWARE/true]
FAILED: org.apache.cassandra.metrics.TableMetricsTest.testUnloggedPartitionsPerBatchMultiTable-compression
FAILED: org.apache.cassandra.tools.SSTableExportTest.testPKArgOutOfOrder
FAILED: org.apache.cassandra.tools.SSTableExportTest.testExcludePKArgOutOfOrder
FAILED: org.apache.cassandra.distributed.upgrade.MixedModeReadTest.mixedModeReadColumnSubsetDigestCheck
FAILED: org.apache.cassandra.distributed.upgrade.MixedModeReadTest.mixedModeReadColumnSubsetDigestCheck
FAILED: org.apache.cassandra.tools.SSTableExportTest.testPKArgOutOfOrder-cdc
FAILED: org.apache.cassandra.tools.SSTableExportTest.testExcludePKArgOutOfOrder-cdc
FAILED: org.apache.cassandra.tools.SSTableExportTest.testPKArgOutOfOrder-cdc
FAILED: org.apache.cassandra.tools.SSTableExportTest.testExcludePKArgOutOfOrder-cdc
-------------------------------------------------------------------------------
For complete test report and logs see https://nightlies.apache.org/cassandra/Cassandra-4.0/164/