You are viewing a plain text version of this content. The canonical link for it is here.
Posted to dev@lucene.apache.org by Policeman Jenkins Server <je...@thetaphi.de> on 2016/05/27 00:50:09 UTC

[JENKINS] Lucene-Solr-6.x-Linux (64bit/jdk1.8.0_92) - Build # 746 - Failure!

Build: http://jenkins.thetaphi.de/job/Lucene-Solr-6.x-Linux/746/
Java: 64bit/jdk1.8.0_92 -XX:-UseCompressedOops -XX:+UseConcMarkSweepGC

1 tests failed.
FAILED:  junit.framework.TestSuite.org.apache.solr.handler.TestReplicationHandler

Error Message:
ObjectTracker found 1 object(s) that were not released!!! [NRTCachingDirectory]

Stack Trace:
java.lang.AssertionError: ObjectTracker found 1 object(s) that were not released!!! [NRTCachingDirectory]
	at __randomizedtesting.SeedInfo.seed([18324C37DAD052B8]:0)
	at org.junit.Assert.fail(Assert.java:93)
	at org.junit.Assert.assertTrue(Assert.java:43)
	at org.junit.Assert.assertNull(Assert.java:551)
	at org.apache.solr.SolrTestCaseJ4.afterClass(SolrTestCaseJ4.java:256)
	at sun.reflect.GeneratedMethodAccessor20.invoke(Unknown Source)
	at sun.reflect.DelegatingMethodAccessorImpl.invoke(DelegatingMethodAccessorImpl.java:43)
	at java.lang.reflect.Method.invoke(Method.java:498)
	at com.carrotsearch.randomizedtesting.RandomizedRunner.invoke(RandomizedRunner.java:1764)
	at com.carrotsearch.randomizedtesting.RandomizedRunner$7.evaluate(RandomizedRunner.java:834)
	at com.carrotsearch.randomizedtesting.rules.StatementAdapter.evaluate(StatementAdapter.java:36)
	at com.carrotsearch.randomizedtesting.rules.SystemPropertiesRestoreRule$1.evaluate(SystemPropertiesRestoreRule.java:57)
	at org.apache.lucene.util.AbstractBeforeAfterRule$1.evaluate(AbstractBeforeAfterRule.java:45)
	at com.carrotsearch.randomizedtesting.rules.StatementAdapter.evaluate(StatementAdapter.java:36)
	at org.apache.lucene.util.TestRuleStoreClassName$1.evaluate(TestRuleStoreClassName.java:41)
	at com.carrotsearch.randomizedtesting.rules.NoShadowingOrOverridesOnMethodsRule$1.evaluate(NoShadowingOrOverridesOnMethodsRule.java:40)
	at com.carrotsearch.randomizedtesting.rules.NoShadowingOrOverridesOnMethodsRule$1.evaluate(NoShadowingOrOverridesOnMethodsRule.java:40)
	at com.carrotsearch.randomizedtesting.rules.StatementAdapter.evaluate(StatementAdapter.java:36)
	at com.carrotsearch.randomizedtesting.rules.StatementAdapter.evaluate(StatementAdapter.java:36)
	at com.carrotsearch.randomizedtesting.rules.StatementAdapter.evaluate(StatementAdapter.java:36)
	at org.apache.lucene.util.TestRuleAssertionsRequired$1.evaluate(TestRuleAssertionsRequired.java:53)
	at org.apache.lucene.util.TestRuleMarkFailure$1.evaluate(TestRuleMarkFailure.java:47)
	at org.apache.lucene.util.TestRuleIgnoreAfterMaxFailures$1.evaluate(TestRuleIgnoreAfterMaxFailures.java:64)
	at org.apache.lucene.util.TestRuleIgnoreTestSuites$1.evaluate(TestRuleIgnoreTestSuites.java:54)
	at com.carrotsearch.randomizedtesting.rules.StatementAdapter.evaluate(StatementAdapter.java:36)
	at com.carrotsearch.randomizedtesting.ThreadLeakControl$StatementRunner.run(ThreadLeakControl.java:367)
	at java.lang.Thread.run(Thread.java:745)




Build Log:
[...truncated 11329 lines...]
   [junit4] Suite: org.apache.solr.handler.TestReplicationHandler
   [junit4]   2> Creating dataDir: /home/jenkins/workspace/Lucene-Solr-6.x-Linux/solr/build/solr-core/test/J0/temp/solr.handler.TestReplicationHandler_18324C37DAD052B8-001/init-core-data-001
   [junit4]   2> 875038 INFO  (TEST-TestReplicationHandler.doTestRepeater-seed#[18324C37DAD052B8]) [    ] o.a.s.SolrTestCaseJ4 ###Starting doTestRepeater
   [junit4]   2> 875039 INFO  (TEST-TestReplicationHandler.doTestRepeater-seed#[18324C37DAD052B8]) [    ] o.a.s.SolrTestCaseJ4 Writing core.properties file to /home/jenkins/workspace/Lucene-Solr-6.x-Linux/solr/build/solr-core/test/J0/temp/solr.handler.TestReplicationHandler_18324C37DAD052B8-001/solr-instance-001/collection1
   [junit4]   2> 875044 INFO  (TEST-TestReplicationHandler.doTestRepeater-seed#[18324C37DAD052B8]) [    ] o.e.j.s.Server jetty-9.3.8.v20160314
   [junit4]   2> 875045 INFO  (TEST-TestReplicationHandler.doTestRepeater-seed#[18324C37DAD052B8]) [    ] o.e.j.s.h.ContextHandler Started o.e.j.s.ServletContextHandler@77a30324{/solr,null,AVAILABLE}
   [junit4]   2> 875045 INFO  (TEST-TestReplicationHandler.doTestRepeater-seed#[18324C37DAD052B8]) [    ] o.e.j.s.ServerConnector Started ServerConnector@365acf94{HTTP/1.1,[http/1.1]}{127.0.0.1:43927}
   [junit4]   2> 875045 INFO  (TEST-TestReplicationHandler.doTestRepeater-seed#[18324C37DAD052B8]) [    ] o.e.j.s.Server Started @876715ms
   [junit4]   2> 875045 INFO  (TEST-TestReplicationHandler.doTestRepeater-seed#[18324C37DAD052B8]) [    ] o.a.s.c.s.e.JettySolrRunner Jetty properties: {solr.data.dir=/home/jenkins/workspace/Lucene-Solr-6.x-Linux/solr/build/solr-core/test/J0/temp/solr.handler.TestReplicationHandler_18324C37DAD052B8-001/solr-instance-001/collection1/data, hostContext=/solr, hostPort=43927}
   [junit4]   2> 875046 INFO  (TEST-TestReplicationHandler.doTestRepeater-seed#[18324C37DAD052B8]) [    ] o.a.s.s.SolrDispatchFilter SolrDispatchFilter.init(): sun.misc.Launcher$AppClassLoader@73d16e93
   [junit4]   2> 875046 INFO  (TEST-TestReplicationHandler.doTestRepeater-seed#[18324C37DAD052B8]) [    ] o.a.s.c.SolrResourceLoader new SolrResourceLoader for directory: '/home/jenkins/workspace/Lucene-Solr-6.x-Linux/solr/build/solr-core/test/J0/temp/solr.handler.TestReplicationHandler_18324C37DAD052B8-001/solr-instance-001'
   [junit4]   2> 875046 INFO  (TEST-TestReplicationHandler.doTestRepeater-seed#[18324C37DAD052B8]) [    ] o.a.s.c.SolrResourceLoader JNDI not configured for solr (NoInitialContextEx)
   [junit4]   2> 875047 INFO  (TEST-TestReplicationHandler.doTestRepeater-seed#[18324C37DAD052B8]) [    ] o.a.s.c.SolrResourceLoader solr home defaulted to 'solr/' (could not find system property or JNDI)
   [junit4]   2> 875047 INFO  (TEST-TestReplicationHandler.doTestRepeater-seed#[18324C37DAD052B8]) [    ] o.a.s.c.SolrXmlConfig Loading container configuration from /home/jenkins/workspace/Lucene-Solr-6.x-Linux/solr/build/solr-core/test/J0/temp/solr.handler.TestReplicationHandler_18324C37DAD052B8-001/solr-instance-001/solr.xml
   [junit4]   2> 875052 INFO  (TEST-TestReplicationHandler.doTestRepeater-seed#[18324C37DAD052B8]) [    ] o.a.s.c.CorePropertiesLocator Config-defined core root directory: /home/jenkins/workspace/Lucene-Solr-6.x-Linux/solr/build/solr-core/test/J0/temp/solr.handler.TestReplicationHandler_18324C37DAD052B8-001/solr-instance-001/.
   [junit4]   2> 875053 INFO  (TEST-TestReplicationHandler.doTestRepeater-seed#[18324C37DAD052B8]) [    ] o.a.s.c.CoreContainer New CoreContainer 1523770644
   [junit4]   2> 875053 INFO  (TEST-TestReplicationHandler.doTestRepeater-seed#[18324C37DAD052B8]) [    ] o.a.s.c.CoreContainer Loading cores into CoreContainer [instanceDir=/home/jenkins/workspace/Lucene-Solr-6.x-Linux/solr/build/solr-core/test/J0/temp/solr.handler.TestReplicationHandler_18324C37DAD052B8-001/solr-instance-001]
   [junit4]   2> 875053 WARN  (TEST-TestReplicationHandler.doTestRepeater-seed#[18324C37DAD052B8]) [    ] o.a.s.c.CoreContainer Couldn't add files from /home/jenkins/workspace/Lucene-Solr-6.x-Linux/solr/build/solr-core/test/J0/temp/solr.handler.TestReplicationHandler_18324C37DAD052B8-001/solr-instance-001/lib to classpath: /home/jenkins/workspace/Lucene-Solr-6.x-Linux/solr/build/solr-core/test/J0/temp/solr.handler.TestReplicationHandler_18324C37DAD052B8-001/solr-instance-001/lib
   [junit4]   2> 875053 INFO  (TEST-TestReplicationHandler.doTestRepeater-seed#[18324C37DAD052B8]) [    ] o.a.s.h.c.HttpShardHandlerFactory created with socketTimeout : 90000,urlScheme : ,connTimeout : 15000,maxConnectionsPerHost : 20,maxConnections : 10000,corePoolSize : 0,maximumPoolSize : 2147483647,maxThreadIdleTime : 5,sizeOfQueue : -1,fairnessPolicy : false,useRetries : false,
   [junit4]   2> 875054 INFO  (TEST-TestReplicationHandler.doTestRepeater-seed#[18324C37DAD052B8]) [    ] o.a.s.u.UpdateShardHandler Creating UpdateShardHandler HTTP client with params: socketTimeout=340000&connTimeout=45000&retry=true
   [junit4]   2> 875054 INFO  (TEST-TestReplicationHandler.doTestRepeater-seed#[18324C37DAD052B8]) [    ] o.a.s.l.LogWatcher SLF4J impl is org.slf4j.impl.Log4jLoggerFactory
   [junit4]   2> 875054 INFO  (TEST-TestReplicationHandler.doTestRepeater-seed#[18324C37DAD052B8]) [    ] o.a.s.l.LogWatcher Registering Log Listener [Log4j (org.slf4j.impl.Log4jLoggerFactory)]
   [junit4]   2> 875054 INFO  (TEST-TestReplicationHandler.doTestRepeater-seed#[18324C37DAD052B8]) [    ] o.a.s.c.CoreContainer Security conf doesn't exist. Skipping setup for authorization module.
   [junit4]   2> 875054 INFO  (TEST-TestReplicationHandler.doTestRepeater-seed#[18324C37DAD052B8]) [    ] o.a.s.c.CoreContainer No authentication plugin used.
   [junit4]   2> 875054 INFO  (TEST-TestReplicationHandler.doTestRepeater-seed#[18324C37DAD052B8]) [    ] o.a.s.c.CorePropertiesLocator Looking for core definitions underneath /home/jenkins/workspace/Lucene-Solr-6.x-Linux/solr/build/solr-core/test/J0/temp/solr.handler.TestReplicationHandler_18324C37DAD052B8-001/solr-instance-001/.
   [junit4]   2> 875055 INFO  (TEST-TestReplicationHandler.doTestRepeater-seed#[18324C37DAD052B8]) [    ] o.a.s.c.CoreDescriptor Created CoreDescriptor: {name=collection1, config=solrconfig.xml, loadOnStartup=true, schema=schema.xml, configSetProperties=configsetprops.json, transient=false, dataDir=data/}
   [junit4]   2> 875055 INFO  (TEST-TestReplicationHandler.doTestRepeater-seed#[18324C37DAD052B8]) [    ] o.a.s.c.CorePropertiesLocator Found core collection1 in /home/jenkins/workspace/Lucene-Solr-6.x-Linux/solr/build/solr-core/test/J0/temp/solr.handler.TestReplicationHandler_18324C37DAD052B8-001/solr-instance-001/./collection1
   [junit4]   2> 875055 INFO  (TEST-TestReplicationHandler.doTestRepeater-seed#[18324C37DAD052B8]) [    ] o.a.s.c.CorePropertiesLocator Found 1 core definitions
   [junit4]   2> 875055 INFO  (coreLoadExecutor-2920-thread-1) [    ] o.a.s.c.SolrResourceLoader new SolrResourceLoader for directory: '/home/jenkins/workspace/Lucene-Solr-6.x-Linux/solr/build/solr-core/test/J0/temp/solr.handler.TestReplicationHandler_18324C37DAD052B8-001/solr-instance-001/collection1'
   [junit4]   2> 875056 INFO  (TEST-TestReplicationHandler.doTestRepeater-seed#[18324C37DAD052B8]) [    ] o.a.s.s.SolrDispatchFilter user.dir=/home/jenkins/workspace/Lucene-Solr-6.x-Linux/solr/build/solr-core/test/J0
   [junit4]   2> 875056 INFO  (TEST-TestReplicationHandler.doTestRepeater-seed#[18324C37DAD052B8]) [    ] o.a.s.s.SolrDispatchFilter SolrDispatchFilter.init() done
   [junit4]   2> 875056 INFO  (coreLoadExecutor-2920-thread-1) [    ] o.a.s.c.SolrResourceLoader JNDI not configured for solr (NoInitialContextEx)
   [junit4]   2> 875056 INFO  (coreLoadExecutor-2920-thread-1) [    ] o.a.s.c.SolrResourceLoader solr home defaulted to 'solr/' (could not find system property or JNDI)
   [junit4]   2> 875064 INFO  (coreLoadExecutor-2920-thread-1) [    ] o.a.s.c.SolrConfig current version of requestparams : -1
   [junit4]   2> 875076 INFO  (coreLoadExecutor-2920-thread-1) [    ] o.a.s.c.SolrConfig Using Lucene MatchVersion: 6.1.0
   [junit4]   2> 875083 INFO  (coreLoadExecutor-2920-thread-1) [    ] o.a.s.c.SolrConfig Loaded SolrConfig: solrconfig.xml
   [junit4]   2> 875085 INFO  (coreLoadExecutor-2920-thread-1) [    ] o.a.s.s.IndexSchema [collection1] Schema name=test
   [junit4]   2> 875088 INFO  (coreLoadExecutor-2920-thread-1) [    ] o.a.s.s.IndexSchema unique key field: id
   [junit4]   2> 875090 INFO  (coreLoadExecutor-2920-thread-1) [    ] o.a.s.c.ConfigSetProperties Did not find ConfigSet properties, assuming default properties: Can't find resource 'configsetprops.json' in classpath or '/home/jenkins/workspace/Lucene-Solr-6.x-Linux/solr/build/solr-core/test/J0/temp/solr.handler.TestReplicationHandler_18324C37DAD052B8-001/solr-instance-001/collection1'
   [junit4]   2> 875090 INFO  (coreLoadExecutor-2920-thread-1) [    ] o.a.s.c.CoreContainer Creating SolrCore 'collection1' using configuration from instancedir /home/jenkins/workspace/Lucene-Solr-6.x-Linux/solr/build/solr-core/test/J0/temp/solr.handler.TestReplicationHandler_18324C37DAD052B8-001/solr-instance-001/./collection1
   [junit4]   2> 875091 INFO  (coreLoadExecutor-2920-thread-1) [    x:collection1] o.a.s.c.SolrCore org.apache.solr.core.MockDirectoryFactory
   [junit4]   2> 875091 INFO  (coreLoadExecutor-2920-thread-1) [    x:collection1] o.a.s.c.SolrCore [[collection1] ] Opening new SolrCore at [/home/jenkins/workspace/Lucene-Solr-6.x-Linux/solr/build/solr-core/test/J0/temp/solr.handler.TestReplicationHandler_18324C37DAD052B8-001/solr-instance-001/collection1], dataDir=[/home/jenkins/workspace/Lucene-Solr-6.x-Linux/solr/build/solr-core/test/J0/temp/solr.handler.TestReplicationHandler_18324C37DAD052B8-001/solr-instance-001/./collection1/data/]
   [junit4]   2> 875091 INFO  (coreLoadExecutor-2920-thread-1) [    x:collection1] o.a.s.c.SolrCore JMX monitoring not detected for core: collection1
   [junit4]   2> 875091 INFO  (coreLoadExecutor-2920-thread-1) [    x:collection1] o.a.s.c.CachingDirectoryFactory return new directory for /home/jenkins/workspace/Lucene-Solr-6.x-Linux/solr/build/solr-core/test/J0/temp/solr.handler.TestReplicationHandler_18324C37DAD052B8-001/solr-instance-001/./collection1/data
   [junit4]   2> 875091 INFO  (coreLoadExecutor-2920-thread-1) [    x:collection1] o.a.s.c.SolrCore New index directory detected: old=null new=/home/jenkins/workspace/Lucene-Solr-6.x-Linux/solr/build/solr-core/test/J0/temp/solr.handler.TestReplicationHandler_18324C37DAD052B8-001/solr-instance-001/./collection1/data/index/
   [junit4]   2> 875091 WARN  (coreLoadExecutor-2920-thread-1) [    x:collection1] o.a.s.c.SolrCore [collection1] Solr index directory '/home/jenkins/workspace/Lucene-Solr-6.x-Linux/solr/build/solr-core/test/J0/temp/solr.handler.TestReplicationHandler_18324C37DAD052B8-001/solr-instance-001/./collection1/data/index' doesn't exist. Creating new index...
   [junit4]   2> 875092 INFO  (coreLoadExecutor-2920-thread-1) [    x:collection1] o.a.s.c.CachingDirectoryFactory return new directory for /home/jenkins/workspace/Lucene-Solr-6.x-Linux/solr/build/solr-core/test/J0/temp/solr.handler.TestReplicationHandler_18324C37DAD052B8-001/solr-instance-001/./collection1/data/index
   [junit4]   2> 875092 INFO  (coreLoadExecutor-2920-thread-1) [    x:collection1] o.a.s.u.RandomMergePolicy RandomMergePolicy wrapping class org.apache.lucene.index.TieredMergePolicy: [TieredMergePolicy: maxMergeAtOnce=24, maxMergeAtOnceExplicit=24, maxMergedSegmentMB=49.423828125, floorSegmentMB=1.7294921875, forceMergeDeletesPctAllowed=17.21229244549716, segmentsPerTier=41.0, maxCFSSegmentSizeMB=8.796093022207999E12, noCFSRatio=0.5322415730235422
   [junit4]   2> 875092 INFO  (coreLoadExecutor-2920-thread-1) [    x:collection1] o.a.s.c.SolrDeletionPolicy SolrDeletionPolicy.onCommit: commits: num=1
   [junit4]   2> 	commit{dir=MockDirectoryWrapper(RAMDirectory@7af860cc lockFactory=org.apache.lucene.store.SingleInstanceLockFactory@5fb33bfc),segFN=segments_1,generation=1}
   [junit4]   2> 875092 INFO  (coreLoadExecutor-2920-thread-1) [    x:collection1] o.a.s.c.SolrDeletionPolicy newest commit generation = 1
   [junit4]   2> 875092 INFO  (OldIndexDirectoryCleanupThreadForCore-collection1) [    x:collection1] o.a.s.c.SolrCore Looking for old index directories to cleanup for core collection1 in /home/jenkins/workspace/Lucene-Solr-6.x-Linux/solr/build/solr-core/test/J0/temp/solr.handler.TestReplicationHandler_18324C37DAD052B8-001/solr-instance-001/./collection1/data/
   [junit4]   2> 875094 INFO  (coreLoadExecutor-2920-thread-1) [    x:collection1] o.a.s.c.SolrCore no updateRequestProcessorChain defined as default, creating implicit default
   [junit4]   2> 875096 INFO  (coreLoadExecutor-2920-thread-1) [    x:collection1] o.a.s.h.l.XMLLoader xsltCacheLifetimeSeconds=60
   [junit4]   2> 875097 INFO  (coreLoadExecutor-2920-thread-1) [    x:collection1] o.a.s.h.l.XMLLoader xsltCacheLifetimeSeconds=60
   [junit4]   2> 875097 INFO  (coreLoadExecutor-2920-thread-1) [    x:collection1] o.a.s.h.l.XMLLoader xsltCacheLifetimeSeconds=60
   [junit4]   2> 875098 INFO  (coreLoadExecutor-2920-thread-1) [    x:collection1] o.a.s.h.l.XMLLoader xsltCacheLifetimeSeconds=60
   [junit4]   2> 875105 INFO  (coreLoadExecutor-2920-thread-1) [    x:collection1] o.a.s.c.PluginBag requestHandler : 'lazy' created with startup=lazy 
   [junit4]   2> 875105 INFO  (coreLoadExecutor-2920-thread-1) [    x:collection1] o.a.s.c.RequestHandlers Registered paths: /admin/mbeans,standard,lazy,/update/json/docs,/admin/luke,/export,/get,/admin/properties,/update/json,/admin/threads,/update/csv,/sql,/graph,/admin/segments,/admin/system,/replication,defaults,/config,/stream,/schema,/admin/plugins,/admin/logging,/admin/ping,/update,/admin/file
   [junit4]   2> 875105 INFO  (coreLoadExecutor-2920-thread-1) [    x:collection1] o.a.s.c.SolrCore Using default statsCache cache: org.apache.solr.search.stats.LocalStatsCache
   [junit4]   2> 875106 INFO  (coreLoadExecutor-2920-thread-1) [    x:collection1] o.a.s.u.CommitTracker Hard AutoCommit: disabled
   [junit4]   2> 875106 INFO  (coreLoadExecutor-2920-thread-1) [    x:collection1] o.a.s.u.CommitTracker Soft AutoCommit: disabled
   [junit4]   2> 875106 INFO  (coreLoadExecutor-2920-thread-1) [    x:collection1] o.a.s.u.RandomMergePolicy RandomMergePolicy wrapping class org.apache.lucene.index.LogByteSizeMergePolicy: [LogByteSizeMergePolicy: minMergeSize=1677721, mergeFactor=16, maxMergeSize=2147483648, maxMergeSizeForForcedMerge=9223372036854775807, calibrateSizeByDeletes=false, maxMergeDocs=2147483647, maxCFSSegmentSizeMB=8.796093022207999E12, noCFSRatio=0.3687505357253279]
   [junit4]   2> 875106 INFO  (coreLoadExecutor-2920-thread-1) [    x:collection1] o.a.s.c.SolrDeletionPolicy SolrDeletionPolicy.onInit: commits: num=1
   [junit4]   2> 	commit{dir=MockDirectoryWrapper(RAMDirectory@7af860cc lockFactory=org.apache.lucene.store.SingleInstanceLockFactory@5fb33bfc),segFN=segments_1,generation=1}
   [junit4]   2> 875106 INFO  (coreLoadExecutor-2920-thread-1) [    x:collection1] o.a.s.c.SolrDeletionPolicy newest commit generation = 1
   [junit4]   2> 875107 INFO  (coreLoadExecutor-2920-thread-1) [    x:collection1] o.a.s.s.SolrIndexSearcher Opening [Searcher@5901e9ff[collection1] main]
   [junit4]   2> 875107 INFO  (coreLoadExecutor-2920-thread-1) [    x:collection1] o.a.s.r.ManagedResourceStorage File-based storage initialized to use dir: /home/jenkins/workspace/Lucene-Solr-6.x-Linux/solr/build/solr-core/test/J0/temp/solr.handler.TestReplicationHandler_18324C37DAD052B8-001/solr-instance-001/collection1/conf
   [junit4]   2> 875107 INFO  (coreLoadExecutor-2920-thread-1) [    x:collection1] o.a.s.r.RestManager Initializing RestManager with initArgs: {storageDir=/home/jenkins/workspace/Lucene-Solr-6.x-Linux/solr/build/solr-core/test/J0/temp/solr.handler.TestReplicationHandler_18324C37DAD052B8-001/solr-instance-001/collection1/conf}
   [junit4]   2> 875107 INFO  (coreLoadExecutor-2920-thread-1) [    x:collection1] o.a.s.r.ManagedResourceStorage Reading _rest_managed.json using file:dir=/home/jenkins/workspace/Lucene-Solr-6.x-Linux/solr/build/solr-core/test/J0/temp/solr.handler.TestReplicationHandler_18324C37DAD052B8-001/solr-instance-001/collection1/conf
   [junit4]   2> 875107 INFO  (coreLoadExecutor-2920-thread-1) [    x:collection1] o.a.s.r.RestManager Initializing 0 registered ManagedResources
   [junit4]   2> 875107 INFO  (coreLoadExecutor-2920-thread-1) [    x:collection1] o.a.s.h.ReplicationHandler Replication enabled for following config files: schema.xml,xslt/dummy.xsl
   [junit4]   2> 875107 INFO  (coreLoadExecutor-2920-thread-1) [    x:collection1] o.a.s.h.ReplicationHandler Commits will be reserved for  10000
   [junit4]   2> 875108 INFO  (searcherExecutor-2921-thread-1-processing-x:collection1) [    x:collection1] o.a.s.c.SolrCore [collection1] Registered new searcher Searcher@5901e9ff[collection1] main{ExitableDirectoryReader(UninvertingDirectoryReader())}
   [junit4]   2> 875108 INFO  (coreLoadExecutor-2920-thread-1) [    x:collection1] o.a.s.c.CoreContainer registering core: collection1
   [junit4]   2> 875557 INFO  (TEST-TestReplicationHandler.doTestRepeater-seed#[18324C37DAD052B8]) [    ] o.a.s.SolrTestCaseJ4 Writing core.properties file to /home/jenkins/workspace/Lucene-Solr-6.x-Linux/solr/build/solr-core/test/J0/temp/solr.handler.TestReplicationHandler_18324C37DAD052B8-001/solr-instance-002/collection1
   [junit4]   2> 875559 INFO  (TEST-TestReplicationHandler.doTestRepeater-seed#[18324C37DAD052B8]) [    ] o.e.j.s.Server jetty-9.3.8.v20160314
   [junit4]   2> 875560 INFO  (TEST-TestReplicationHandler.doTestRepeater-seed#[18324C37DAD052B8]) [    ] o.e.j.s.h.ContextHandler Started o.e.j.s.ServletContextHandler@52180351{/solr,null,AVAILABLE}
   [junit4]   2> 875560 INFO  (TEST-TestReplicationHandler.doTestRepeater-seed#[18324C37DAD052B8]) [    ] o.e.j.s.ServerConnector Started ServerConnector@69d2bf88{HTTP/1.1,[http/1.1]}{127.0.0.1:41923}
   [junit4]   2> 875561 INFO  (TEST-TestReplicationHandler.doTestRepeater-seed#[18324C37DAD052B8]) [    ] o.e.j.s.Server Started @877230ms
   [junit4]   2> 875561 INFO  (TEST-TestReplicationHandler.doTestRepeater-seed#[18324C37DAD052B8]) [    ] o.a.s.c.s.e.JettySolrRunner Jetty properties: {solr.data.dir=/home/jenkins/workspace/Lucene-Solr-6.x-Linux/solr/build/solr-core/test/J0/temp/solr.handler.TestReplicationHandler_18324C37DAD052B8-001/solr-instance-002/collection1/data, hostContext=/solr, hostPort=41923}
   [junit4]   2> 875561 INFO  (TEST-TestReplicationHandler.doTestRepeater-seed#[18324C37DAD052B8]) [    ] o.a.s.s.SolrDispatchFilter SolrDispatchFilter.init(): sun.misc.Launcher$AppClassLoader@73d16e93
   [junit4]   2> 875561 INFO  (TEST-TestReplicationHandler.doTestRepeater-seed#[18324C37DAD052B8]) [    ] o.a.s.c.SolrResourceLoader new SolrResourceLoader for directory: '/home/jenkins/workspace/Lucene-Solr-6.x-Linux/solr/build/solr-core/test/J0/temp/solr.handler.TestReplicationHandler_18324C37DAD052B8-001/solr-instance-002'
   [junit4]   2> 875561 INFO  (TEST-TestReplicationHandler.doTestRepeater-seed#[18324C37DAD052B8]) [    ] o.a.s.c.SolrResourceLoader JNDI not configured for solr (NoInitialContextEx)
   [junit4]   2> 875561 INFO  (TEST-TestReplicationHandler.doTestRepeater-seed#[18324C37DAD052B8]) [    ] o.a.s.c.SolrResourceLoader solr home defaulted to 'solr/' (could not find system property or JNDI)
   [junit4]   2> 875561 INFO  (TEST-TestReplicationHandler.doTestRepeater-seed#[18324C37DAD052B8]) [    ] o.a.s.c.SolrXmlConfig Loading container configuration from /home/jenkins/workspace/Lucene-Solr-6.x-Linux/solr/build/solr-core/test/J0/temp/solr.handler.TestReplicationHandler_18324C37DAD052B8-001/solr-instance-002/solr.xml
   [junit4]   2> 875564 INFO  (TEST-TestReplicationHandler.doTestRepeater-seed#[18324C37DAD052B8]) [    ] o.a.s.c.CorePropertiesLocator Config-defined core root directory: /home/jenkins/workspace/Lucene-Solr-6.x-Linux/solr/build/solr-core/test/J0/temp/solr.handler.TestReplicationHandler_18324C37DAD052B8-001/solr-instance-002/.
   [junit4]   2> 875564 INFO  (TEST-TestReplicationHandler.doTestRepeater-seed#[18324C37DAD052B8]) [    ] o.a.s.c.CoreContainer New CoreContainer 482746491
   [junit4]   2> 875564 INFO  (TEST-TestReplicationHandler.doTestRepeater-seed#[18324C37DAD052B8]) [    ] o.a.s.c.CoreContainer Loading cores into CoreContainer [instanceDir=/home/jenkins/workspace/Lucene-Solr-6.x-Linux/solr/build/solr-core/test/J0/temp/solr.handler.TestReplicationHandler_18324C37DAD052B8-001/solr-instance-002]
   [junit4]   2> 875564 WARN  (TEST-TestReplicationHandler.doTestRepeater-seed#[18324C37DAD052B8]) [    ] o.a.s.c.CoreContainer Couldn't add files from /home/jenkins/workspace/Lucene-Solr-6.x-Linux/solr/build/solr-core/test/J0/temp/solr.handler.TestReplicationHandler_18324C37DAD052B8-001/solr-instance-002/lib to classpath: /home/jenkins/workspace/Lucene-Solr-6.x-Linux/solr/build/solr-core/test/J0/temp/solr.handler.TestReplicationHandler_18324C37DAD052B8-001/solr-instance-002/lib
   [junit4]   2> 875565 INFO  (TEST-TestReplicationHandler.doTestRepeater-seed#[18324C37DAD052B8]) [    ] o.a.s.h.c.HttpShardHandlerFactory created with socketTimeout : 90000,urlScheme : ,connTimeout : 15000,maxConnectionsPerHost : 20,maxConnections : 10000,corePoolSize : 0,maximumPoolSize : 2147483647,maxThreadIdleTime : 5,sizeOfQueue : -1,fairnessPolicy : false,useRetries : false,
   [junit4]   2> 875565 INFO  (TEST-TestReplicationHandler.doTestRepeater-seed#[18324C37DAD052B8]) [    ] o.a.s.u.UpdateShardHandler Creating UpdateShardHandler HTTP client with params: socketTimeout=340000&connTimeout=45000&retry=true
   [junit4]   2> 875565 INFO  (TEST-TestReplicationHandler.doTestRepeater-seed#[18324C37DAD052B8]) [    ] o.a.s.l.LogWatcher SLF4J impl is org.slf4j.impl.Log4jLoggerFactory
   [junit4]   2> 875565 INFO  (TEST-TestReplicationHandler.doTestRepeater-seed#[18324C37DAD052B8]) [    ] o.a.s.l.LogWatcher Registering Log Listener [Log4j (org.slf4j.impl.Log4jLoggerFactory)]
   [junit4]   2> 875565 INFO  (TEST-TestReplicationHandler.doTestRepeater-seed#[18324C37DAD052B8]) [    ] o.a.s.c.CoreContainer Security conf doesn't exist. Skipping setup for authorization module.
   [junit4]   2> 875565 INFO  (TEST-TestReplicationHandler.doTestRepeater-seed#[18324C37DAD052B8]) [    ] o.a.s.c.CoreContainer No authentication plugin used.
   [junit4]   2> 875566 INFO  (TEST-TestReplicationHandler.doTestRepeater-seed#[18324C37DAD052B8]) [    ] o.a.s.c.CorePropertiesLocator Looking for core definitions underneath /home/jenkins/workspace/Lucene-Solr-6.x-Linux/solr/build/solr-core/test/J0/temp/solr.handler.TestReplicationHandler_18324C37DAD052B8-001/solr-instance-002/.
   [junit4]   2> 875567 INFO  (TEST-TestReplicationHandler.doTestRepeater-seed#[18324C37DAD052B8]) [    ] o.a.s.c.CoreDescriptor Created CoreDescriptor: {name=collection1, config=solrconfig.xml, loadOnStartup=true, schema=schema.xml, configSetProperties=configsetprops.json, transient=false, dataDir=data/}
   [junit4]   2> 875567 INFO  (TEST-TestReplicationHandler.doTestRepeater-seed#[18324C37DAD052B8]) [    ] o.a.s.c.CorePropertiesLocator Found core collection1 in /home/jenkins/workspace/Lucene-Solr-6.x-Linux/solr/build/solr-core/test/J0/temp/solr.handler.TestReplicationHandler_18324C37DAD052B8-001/solr-instance-002/./collection1
   [junit4]   2> 875567 INFO  (TEST-TestReplicationHandler.doTestRepeater-seed#[18324C37DAD052B8]) [    ] o.a.s.c.CorePropertiesLocator Found 1 core definitions
   [junit4]   2> 875567 INFO  (coreLoadExecutor-2930-thread-1) [    ] o.a.s.c.SolrResourceLoader new SolrResourceLoader for directory: '/home/jenkins/workspace/Lucene-Solr-6.x-Linux/solr/build/solr-core/test/J0/temp/solr.handler.TestReplicationHandler_18324C37DAD052B8-001/solr-instance-002/collection1'
   [junit4]   2> 875568 INFO  (TEST-TestReplicationHandler.doTestRepeater-seed#[18324C37DAD052B8]) [    ] o.a.s.s.SolrDispatchFilter user.dir=/home/jenkins/workspace/Lucene-Solr-6.x-Linux/solr/build/solr-core/test/J0
   [junit4]   2> 875568 INFO  (TEST-TestReplicationHandler.doTestRepeater-seed#[18324C37DAD052B8]) [    ] o.a.s.s.SolrDispatchFilter SolrDispatchFilter.init() done
   [junit4]   2> 875568 INFO  (coreLoadExecutor-2930-thread-1) [    ] o.a.s.c.SolrResourceLoader JNDI not configured for solr (NoInitialContextEx)
   [junit4]   2> 875568 INFO  (coreLoadExecutor-2930-thread-1) [    ] o.a.s.c.SolrResourceLoader solr home defaulted to 'solr/' (could not find system property or JNDI)
   [junit4]   2> 875572 INFO  (coreLoadExecutor-2930-thread-1) [    ] o.a.s.c.SolrConfig current version of requestparams : -1
   [junit4]   2> 875574 INFO  (coreLoadExecutor-2930-thread-1) [    ] o.a.s.c.SolrConfig Using Lucene MatchVersion: 6.1.0
   [junit4]   2> 875579 INFO  (coreLoadExecutor-2930-thread-1) [    ] o.a.s.c.SolrConfig Loaded SolrConfig: solrconfig.xml
   [junit4]   2> 875581 INFO  (coreLoadExecutor-2930-thread-1) [    ] o.a.s.s.IndexSchema [collection1] Schema name=test
   [junit4]   2> 875582 INFO  (coreLoadExecutor-2930-thread-1) [    ] o.a.s.s.IndexSchema unique key field: id
   [junit4]   2> 875583 INFO  (coreLoadExecutor-2930-thread-1) [    ] o.a.s.c.ConfigSetProperties Did not find ConfigSet properties, assuming default properties: Can't find resource 'configsetprops.json' in classpath or '/home/jenkins/workspace/Lucene-Solr-6.x-Linux/solr/build/solr-core/test/J0/temp/solr.handler.TestReplicationHandler_18324C37DAD052B8-001/solr-instance-002/collection1'
   [junit4]   2> 875583 INFO  (coreLoadExecutor-2930-thread-1) [    ] o.a.s.c.CoreContainer Creating SolrCore 'collection1' using configuration from instancedir /home/jenkins/workspace/Lucene-Solr-6.x-Linux/solr/build/solr-core/test/J0/temp/solr.handler.TestReplicationHandler_18324C37DAD052B8-001/solr-instance-002/./collection1
   [junit4]   2> 875583 INFO  (coreLoadExecutor-2930-thread-1) [    x:collection1] o.a.s.c.SolrCore org.apache.solr.core.MockDirectoryFactory
   [junit4]   2> 875583 INFO  (coreLoadExecutor-2930-thread-1) [    x:collection1] o.a.s.c.SolrCore [[collection1] ] Opening new SolrCore at [/home/jenkins/workspace/Lucene-Solr-6.x-Linux/solr/build/solr-core/test/J0/temp/solr.handler.TestReplicationHandler_18324C37DAD052B8-001/solr-instance-002/collection1], dataDir=[/home/jenkins/workspace/Lucene-Solr-6.x-Linux/solr/build/solr-core/test/J0/temp/solr.handler.TestReplicationHandler_18324C37DAD052B8-001/solr-instance-002/./collection1/data/]
   [junit4]   2> 875583 INFO  (coreLoadExecutor-2930-thread-1) [    x:collection1] o.a.s.c.SolrCore JMX monitoring not detected for core: collection1
   [junit4]   2> 875584 INFO  (coreLoadExecutor-2930-thread-1) [    x:collection1] o.a.s.c.CachingDirectoryFactory return new directory for /home/jenkins/workspace/Lucene-Solr-6.x-Linux/solr/build/solr-core/test/J0/temp/solr.handler.TestReplicationHandler_18324C37DAD052B8-001/solr-instance-002/./collection1/data
   [junit4]   2> 875584 INFO  (coreLoadExecutor-2930-thread-1) [    x:collection1] o.a.s.c.SolrCore New index directory detected: old=null new=/home/jenkins/workspace/Lucene-Solr-6.x-Linux/solr/build/solr-core/test/J0/temp/solr.handler.TestReplicationHandler_18324C37DAD052B8-001/solr-instance-002/./collection1/data/index/
   [junit4]   2> 875584 WARN  (coreLoadExecutor-2930-thread-1) [    x:collection1] o.a.s.c.SolrCore [collection1] Solr index directory '/home/jenkins/workspace/Lucene-Solr-6.x-Linux/solr/build/solr-core/test/J0/temp/solr.handler.TestReplicationHandler_18324C37DAD052B8-001/solr-instance-002/./collection1/data/index' doesn't exist. Creating new index...
   [junit4]   2> 875584 INFO  (coreLoadExecutor-2930-thread-1) [    x:collection1] o.a.s.c.CachingDirectoryFactory return new directory for /home/jenkins/workspace/Lucene-Solr-6.x-Linux/solr/build/solr-core/test/J0/temp/solr.handler.TestReplicationHandler_18324C37DAD052B8-001/solr-instance-002/./collection1/data/index
   [junit4]   2> 875584 INFO  (coreLoadExecutor-2930-thread-1) [    x:collection1] o.a.s.u.RandomMergePolicy RandomMergePolicy wrapping class org.apache.lucene.index.TieredMergePolicy: [TieredMergePolicy: maxMergeAtOnce=24, maxMergeAtOnceExplicit=24, maxMergedSegmentMB=49.423828125, floorSegmentMB=1.7294921875, forceMergeDeletesPctAllowed=17.21229244549716, segmentsPerTier=41.0, maxCFSSegmentSizeMB=8.796093022207999E12, noCFSRatio=0.5322415730235422
   [junit4]   2> 875584 INFO  (coreLoadExecutor-2930-thread-1) [    x:collection1] o.a.s.c.SolrDeletionPolicy SolrDeletionPolicy.onCommit: commits: num=1
   [junit4]   2> 	commit{dir=MockDirectoryWrapper(RAMDirectory@5da048fd lockFactory=org.apache.lucene.store.SingleInstanceLockFactory@15369ff0),segFN=segments_1,generation=1}
   [junit4]   2> 875584 INFO  (coreLoadExecutor-2930-thread-1) [    x:collection1] o.a.s.c.SolrDeletionPolicy newest commit generation = 1
   [junit4]   2> 875584 INFO  (OldIndexDirectoryCleanupThreadForCore-collection1) [    x:collection1] o.a.s.c.SolrCore Looking for old index directories to cleanup for core collection1 in /home/jenkins/workspace/Lucene-Solr-6.x-Linux/solr/build/solr-core/test/J0/temp/solr.handler.TestReplicationHandler_18324C37DAD052B8-001/solr-instance-002/./collection1/data/
   [junit4]   2> 875585 INFO  (coreLoadExecutor-2930-thread-1) [    x:collection1] o.a.s.c.SolrCore no updateRequestProcessorChain defined as default, creating implicit default
   [junit4]   2> 875586 INFO  (coreLoadExecutor-2930-thread-1) [    x:collection1] o.a.s.h.l.XMLLoader xsltCacheLifetimeSeconds=60
   [junit4]   2> 875586 INFO  (coreLoadExecutor-2930-thread-1) [    x:collection1] o.a.s.h.l.XMLLoader xsltCacheLifetimeSeconds=60
   [junit4]   2> 875587 INFO  (coreLoadExecutor-2930-thread-1) [    x:collection1] o.a.s.h.l.XMLLoader xsltCacheLifetimeSeconds=60
   [junit4]   2> 875587 INFO  (coreLoadExecutor-2930-thread-1) [    x:collection1] o.a.s.h.l.XMLLoader xsltCacheLifetimeSeconds=60
   [junit4]   2> 875588 INFO  (coreLoadExecutor-2930-thread-1) [    x:collection1] o.a.s.c.PluginBag requestHandler : 'lazy' created with startup=lazy 
   [junit4]   2> 875588 INFO  (coreLoadExecutor-2930-thread-1) [    x:collection1] o.a.s.c.RequestHandlers Registered paths: /admin/mbeans,standard,lazy,/update/json/docs,/admin/luke,/export,/get,/admin/properties,/update/json,/admin/threads,/update/csv,/sql,/graph,/admin/segments,/admin/system,/replication,defaults,/config,/stream,/schema,/admin/plugins,/admin/logging,/admin/ping,/update,/admin/file
   [junit4]   2> 875588 INFO  (coreLoadExecutor-2930-thread-1) [    x:collection1] o.a.s.c.SolrCore Using default statsCache cache: org.apache.solr.search.stats.LocalStatsCache
   [junit4]   2> 875589 INFO  (coreLoadExecutor-2930-thread-1) [    x:collection1] o.a.s.u.CommitTracker Hard AutoCommit: disabled
   [junit4]   2> 875589 INFO  (coreLoadExecutor-2930-thread-1) [    x:collection1] o.a.s.u.CommitTracker Soft AutoCommit: disabled
   [junit4]   2> 875589 INFO  (coreLoadExecutor-2930-thread-1) [    x:collection1] o.a.s.u.RandomMergePolicy RandomMergePolicy wrapping class org.apache.lucene.index.LogByteSizeMergePolicy: [LogByteSizeMergePolicy: minMergeSize=1677721, mergeFactor=16, maxMergeSize=2147483648, maxMergeSizeForForcedMerge=9223372036854775807, calibrateSizeByDeletes=false, maxMergeDocs=2147483647, maxCFSSegmentSizeMB=8.796093022207999E12, noCFSRatio=0.3687505357253279]
   [junit4]   2> 875589 INFO  (coreLoadExecutor-2930-thread-1) [    x:collection1] o.a.s.c.SolrDeletionPolicy SolrDeletionPolicy.onInit: commits: num=1
   [junit4]   2> 	commit{dir=MockDirectoryWrapper(RAMDirectory@5da048fd lockFactory=org.apache.lucene.store.SingleInstanceLockFactory@15369ff0),segFN=segments_1,generation=1}
   [junit4]   2> 875589 INFO  (coreLoadExecutor-2930-thread-1) [    x:collection1] o.a.s.c.SolrDeletionPolicy newest commit generation = 1
   [junit4]   2> 875589 INFO  (coreLoadExecutor-2930-thread-1) [    x:collection1] o.a.s.s.SolrIndexSearcher Opening [Searcher@4e74056[collection1] main]
   [junit4]   2> 875589 INFO  (coreLoadExecutor-2930-thread-1) [    x:collection1] o.a.s.r.ManagedResourceStorage File-based storage initialized to use dir: /home/jenkins/workspace/Lucene-Solr-6.x-Linux/solr/build/solr-core/test/J0/temp/solr.handler.TestReplicationHandler_18324C37DAD052B8-001/solr-instance-002/collection1/conf
   [junit4]   2> 875589 INFO  (coreLoadExecutor-2930-thread-1) [    x:collection1] o.a.s.r.RestManager Initializing RestManager with initArgs: {storageDir=/home/jenkins/workspace/Lucene-Solr-6.x-Linux/solr/build/solr-core/test/J0/temp/solr.handler.TestReplicationHandler_18324C37DAD052B8-001/solr-instance-002/collection1/conf}
   [junit4]   2> 875589 INFO  (coreLoadExecutor-2930-thread-1) [    x:collection1] o.a.s.r.ManagedResourceStorage Reading _rest_managed.json using file:dir=/home/jenkins/workspace/Lucene-Solr-6.x-Linux/solr/build/solr-core/test/J0/temp/solr.handler.TestReplicationHandler_18324C37DAD052B8-001/solr-instance-002/collection1/conf
   [junit4]   2> 875589 INFO  (coreLoadExecutor-2930-thread-1) [    x:collection1] o.a.s.r.RestManager Initializing 0 registered ManagedResources
   [junit4]   2> 875592 INFO  (coreLoadExecutor-2930-thread-1) [    x:collection1] o.a.s.h.ReplicationHandler Poll scheduled at an interval of 1000ms
   [junit4]   2> 875592 INFO  (searcherExecutor-2931-thread-1-processing-x:collection1) [    x:collection1] o.a.s.c.SolrCore [collection1] Registered new searcher Searcher@4e74056[collection1] main{ExitableDirectoryReader(UninvertingDirectoryReader())}
   [junit4]   2> 875592 INFO  (coreLoadExecutor-2930-thread-1) [    x:collection1] o.a.s.c.CoreContainer registering core: collection1
   [junit4]   2> 875594 INFO  (qtp1819271663-5780) [    x:collection1] o.a.s.c.S.Request [collection1]  webapp=/solr path=/replication params={qt=/replication&wt=javabin&version=2&command=indexversion} status=0 QTime=0
   [junit4]   2> 876073 INFO  (TEST-TestReplicationHandler.doTestRepeater-seed#[18324C37DAD052B8]) [    ] o.e.j.s.ServerConnector Stopped ServerConnector@69d2bf88{HTTP/1.1,[http/1.1]}{127.0.0.1:0}
   [junit4]   2> 876073 INFO  (TEST-TestReplicationHandler.doTestRepeater-seed#[18324C37DAD052B8]) [    ] o.a.s.c.CoreContainer Shutting down CoreContainer instance=482746491
   [junit4]   2> 876073 INFO  (coreCloseExecutor-2936-thread-1) [    x:collection1] o.a.s.c.SolrCore [collection1]  CLOSING SolrCore org.apache.solr.core.SolrCore@2229888c
   [junit4]   2> 876074 INFO  (coreCloseExecutor-2936-thread-1) [    x:collection1] o.a.s.u.DirectUpdateHandler2 closing DirectUpdateHandler2{commits=0,autocommits=0,soft autocommits=0,optimizes=0,rollbacks=0,expungeDeletes=0,docsPending=0,adds=0,deletesById=0,deletesByQuery=0,errors=0,cumulative_adds=0,cumulative_deletesById=0,cumulative_deletesByQuery=0,cumulative_errors=0}
   [junit4]   2> 876074 INFO  (coreCloseExecutor-2936-thread-1) [    x:collection1] o.a.s.u.SolrCoreState Closing SolrCoreState
   [junit4]   2> 876074 INFO  (coreCloseExecutor-2936-thread-1) [    x:collection1] o.a.s.u.DefaultSolrCoreState SolrCoreState ref count has reached 0 - closing IndexWriter
   [junit4]   2> 876074 INFO  (coreCloseExecutor-2936-thread-1) [    x:collection1] o.a.s.u.DefaultSolrCoreState closing IndexWriter with IndexWriterCloser
   [junit4]   2> 876074 INFO  (coreCloseExecutor-2936-thread-1) [    x:collection1] o.a.s.c.SolrCore [collection1] Closing main searcher on request.
   [junit4]   2> 876074 INFO  (coreCloseExecutor-2936-thread-1) [    x:collection1] o.a.s.c.CachingDirectoryFactory Closing MockDirectoryFactory - 2 directories currently being tracked
   [junit4]   2> 876074 INFO  (coreCloseExecutor-2936-thread-1) [    x:collection1] o.a.s.c.CachingDirectoryFactory looking to close /home/jenkins/workspace/Lucene-Solr-6.x-Linux/solr/build/solr-core/test/J0/temp/solr.handler.TestReplicationHandler_18324C37DAD052B8-001/solr-instance-002/./collection1/data/index [CachedDir<<refCount=0;path=/home/jenkins/workspace/Lucene-Solr-6.x-Linux/solr/build/solr-core/test/J0/temp/solr.handler.TestReplicationHandler_18324C37DAD052B8-001/solr-instance-002/./collection1/data/index;done=false>>]
   [junit4]   2> 876074 INFO  (coreCloseExecutor-2936-thread-1) [    x:collection1] o.a.s.c.CachingDirectoryFactory Closing directory, CoreContainer#isShutdown=true
   [junit4]   2> 876074 INFO  (coreCloseExecutor-2936-thread-1) [    x:collection1] o.a.s.c.CachingDirectoryFactory Closing directory: /home/jenkins/workspace/Lucene-Solr-6.x-Linux/solr/build/solr-core/test/J0/temp/solr.handler.TestReplicationHandler_18324C37DAD052B8-001/solr-instance-002/./collection1/data/index
   [junit4]   2> 876075 INFO  (coreCloseExecutor-2936-thread-1) [    x:collection1] o.a.s.c.CachingDirectoryFactory looking to close /home/jenkins/workspace/Lucene-Solr-6.x-Linux/solr/build/solr-core/test/J0/temp/solr.handler.TestReplicationHandler_18324C37DAD052B8-001/solr-instance-002/./collection1/data [CachedDir<<refCount=0;path=/home/jenkins/workspace/Lucene-Solr-6.x-Linux/solr/build/solr-core/test/J0/temp/solr.handler.TestReplicationHandler_18324C37DAD052B8-001/solr-instance-002/./collection1/data;done=false>>]
   [junit4]   2> 876075 INFO  (coreCloseExecutor-2936-thread-1) [    x:collection1] o.a.s.c.CachingDirectoryFactory Closing directory, CoreContainer#isShutdown=true
   [junit4]   2> 876075 INFO  (coreCloseExecutor-2936-thread-1) [    x:collection1] o.a.s.c.CachingDirectoryFactory Closing directory: /home/jenkins/workspace/Lucene-Solr-6.x-Linux/solr/build/solr-core/test/J0/temp/solr.handler.TestReplicationHandler_18324C37DAD052B8-001/solr-instance-002/./collection1/data
   [junit4]   2> 876075 INFO  (TEST-TestReplicationHandler.doTestRepeater-seed#[18324C37DAD052B8]) [    ] o.e.j.s.h.ContextHandler Stopped o.e.j.s.ServletContextHandler@52180351{/solr,null,UNAVAILABLE}
   [junit4]   2> 876076 INFO  (TEST-TestReplicationHandler.doTestRepeater-seed#[18324C37DAD052B8]) [    ] o.e.j.s.Server jetty-9.3.8.v20160314
   [junit4]   2> 876077 INFO  (TEST-TestReplicationHandler.doTestRepeater-seed#[18324C37DAD052B8]) [    ] o.e.j.s.h.ContextHandler Started o.e.j.s.ServletContextHandler@1609b329{/solr,null,AVAILABLE}
   [junit4]   2> 876077 INFO  (TEST-TestReplicationHandler.doTestRepeater-seed#[18324C37DAD052B8]) [    ] o.e.j.s.ServerConnector Started ServerConnector@22770b18{HTTP/1.1,[http/1.1]}{127.0.0.1:35223}
   [junit4]   2> 876077 INFO  (TEST-TestReplicationHandler.doTestRepeater-seed#[18324C37DAD052B8]) [    ] o.e.j.s.Server Started @877747ms
   [junit4]   2> 876077 INFO  (TEST-TestReplicationHandler.doTestRepeater-seed#[18324C37DAD052B8]) [    ] o.a.s.c.s.e.JettySolrRunner Jetty properties: {solr.data.dir=/home/jenkins/workspace/Lucene-Solr-6.x-Linux/solr/build/solr-core/test/J0/temp/solr.handler.TestReplicationHandler_18324C37DAD052B8-001/solr-instance-002/collection1/data, hostContext=/solr, hostPort=35223}
   [junit4]   2> 876078 INFO  (TEST-TestReplicationHandler.doTestRepeater-seed#[18324C37DAD052B8]) [    ] o.a.s.s.SolrDispatchFilter SolrDispatchFilter.init(): sun.misc.Launcher$AppClassLoader@73d16e93
   [junit4]   2> 876078 INFO  (TEST-TestReplicationHandler.doTestRepeater-seed#[18324C37DAD052B8]) [    ] o.a.s.c.SolrResourceLoader new SolrResourceLoader for directory: '/home/jenkins/workspace/Lucene-Solr-6.x-Linux/solr/build/solr-core/test/J0/temp/solr.handler.TestReplicationHandler_18324C37DAD052B8-001/solr-instance-002'
   [junit4]   2> 876078 INFO  (TEST-TestReplicationHandler.doTestRepeater-seed#[18324C37DAD052B8]) [    ] o.a.s.c.SolrResourceLoader JNDI not configured for solr (NoInitialContextEx)
   [junit4]   2> 876078 INFO  (TEST-TestReplicationHandler.doTestRepeater-seed#[18324C37DAD052B8]) [    ] o.a.s.c.SolrResourceLoader solr home defaulted to 'solr/' (could not find system property or JNDI)
   [junit4]   2> 876078 INFO  (TEST-TestReplicationHandler.doTestRepeater-seed#[18324C37DAD052B8]) [    ] o.a.s.c.SolrXmlConfig Loading container configuration from /home/jenkins/workspace/Lucene-Solr-6.x-Linux/solr/build/solr-core/test/J0/temp/solr.handler.TestReplicationHandler_18324C37DAD052B8-001/solr-instance-002/solr.xml
   [junit4]   2> 876081 INFO  (TEST-TestReplicationHandler.doTestRepeater-seed#[18324C37DAD052B8]) [    ] o.a.s.c.CorePropertiesLocator Config-defined core root directory: /home/jenkins/workspace/Lucene-Solr-6.x-Linux/solr/build/solr-core/test/J0/temp/solr.handler.TestReplicationHandler_18324C37DAD052B8-001/solr-instance-002/.
   [junit4]   2> 876081 INFO  (TEST-TestReplicationHandler.doTestRepeater-seed#[18324C37DAD052B8]) [    ] o.a.s.c.CoreContainer New CoreContainer 1714635164
   [junit4]   2> 876081 INFO  (TEST-TestReplicationHandler.doTestRepeater-seed#[18324C37DAD052B8]) [    ] o.a.s.c.CoreContainer Loading cores into CoreContainer [instanceDir=/home/jenkins/workspace/Lucene-Solr-6.x-Linux/solr/build/solr-core/test/J0/temp/solr.handler.TestReplicationHandler_18324C37DAD052B8-001/solr-instance-002]
   [junit4]   2> 876081 WARN  (TEST-TestReplicationHandler.doTestRepeater-seed#[18324C37DAD052B8]) [    ] o.a.s.c.CoreContainer Couldn't add files from /home/jenkins/workspace/Lucene-Solr-6.x-Linux/solr/build/solr-core/test/J0/temp/solr.handler.TestReplicationHandler_18324C37DAD052B8-001/solr-instance-002/lib to classpath: /home/jenkins/workspace/Lucene-Solr-6.x-Linux/solr/build/solr-core/test/J0/temp/solr.handler.TestReplicationHandler_18324C37DAD052B8-001/solr-instance-002/lib
   [junit4]   2> 876082 INFO  (TEST-TestReplicationHandler.doTestRepeater-seed#[18324C37DAD052B8]) [    ] o.a.s.h.c.HttpShardHandlerFactory created with socketTimeout : 90000,urlScheme : ,connTimeout : 15000,maxConnectionsPerHost : 20,maxConnections : 10000,corePoolSize : 0,maximumPoolSize : 2147483647,maxThreadIdleTime : 5,sizeOfQueue : -1,fairnessPolicy : false,useRetries : false,
   [junit4]   2> 876083 INFO  (TEST-TestReplicationHandler.doTestRepeater-seed#[18324C37DAD052B8]) [    ] o.a.s.u.UpdateShardHandler Creating UpdateShardHandler HTTP client with params: socketTimeout=340000&connTimeout=45000&retry=true
   [junit4]   2> 876084 INFO  (TEST-TestReplicationHandler.doTestRepeater-seed#[18324C37DAD052B8]) [    ] o.a.s.l.LogWatcher SLF4J impl is org.slf4j.impl.Log4jLoggerFactory
   [junit4]   2> 876084 INFO  (TEST-TestReplicationHandler.doTestRepeater-seed#[18324C37DAD052B8]) [    ] o.a.s.l.LogWatcher Registering Log Listener [Log4j (org.slf4j.impl.Log4jLoggerFactory)]
   [junit4]   2> 876084 INFO  (TEST-TestReplicationHandler.doTestRepeater-seed#[18324C37DAD052B8]) [    ] o.a.s.c.CoreContainer Security conf doesn't exist. Skipping setup for authorization module.
   [junit4]   2> 876084 INFO  (TEST-TestReplicationHandler.doTestRepeater-seed#[18324C37DAD052B8]) [    ] o.a.s.c.CoreContainer No authentication plugin used.
   [junit4]   2> 876084 INFO  (TEST-TestReplicationHandler.doTestRepeater-seed#[18324C37DAD052B8]) [    ] o.a.s.c.CorePropertiesLocator Looking for core definitions underneath /home/jenkins/workspace/Lucene-Solr-6.x-Linux/solr/build/solr-core/test/J0/temp/solr.handler.TestReplicationHandler_18324C37DAD052B8-001/solr-instance-002/.
   [junit4]   2> 876085 INFO  (TEST-TestReplicationHandler.doTestRepeater-seed#[18324C37DAD052B8]) [    ] o.a.s.c.CoreDescriptor Created CoreDescriptor: {name=collection1, config=solrconfig.xml, loadOnStartup=true, schema=schema.xml, configSetProperties=configsetprops.json, transient=false, dataDir=data/}
   [junit4]   2> 876085 INFO  (TEST-TestReplicationHandler.doTestRepeater-seed#[18324C37DAD052B8]) [    ] o.a.s.c.CorePropertiesLocator Found core collection1 in /home/jenkins/workspace/Lucene-Solr-6.x-Linux/solr/build/solr-core/test/J0/temp/solr.handler.TestReplicationHandler_18324C37DAD052B8-001/solr-instance-002/./collection1
   [junit4]   2> 876085 INFO  (TEST-TestReplicationHandler.doTestRepeater-seed#[18324C37DAD052B8]) [    ] o.a.s.c.CorePropertiesLocator Found 1 core definitions
   [junit4]   2> 876085 INFO  (coreLoadExecutor-2943-thread-1) [    ] o.a.s.c.SolrResourceLoader new SolrResourceLoader for directory: '/home/jenkins/workspace/Lucene-Solr-6.x-Linux/solr/build/solr-core/test/J0/temp/solr.handler.TestReplicationHandler_18324C37DAD052B8-001/solr-instance-002/collection1'
   [junit4]   2> 876085 INFO  (coreLoadExecutor-2943-thread-1) [    ] o.a.s.c.SolrResourceLoader JNDI not configured for solr (NoInitialContextEx)
   [junit4]   2> 876085 INFO  (TEST-TestReplicationHandler.doTestRepeater-seed#[18324C37DAD052B8]) [    ] o.a.s.s.SolrDispatchFilter user.dir=/home/jenkins/workspace/Lucene-Solr-6.x-Linux/solr/build/solr-core/test/J0
   [junit4]   2> 876086 INFO  (coreLoadExecutor-2943-thread-1) [    ] o.a.s.c.SolrResourceLoader solr home defaulted to 'solr/' (could not find system property or JNDI)
   [junit4]   2> 876086 INFO  (TEST-TestReplicationHandler.doTestRepeater-seed#[18324C37DAD052B8]) [    ] o.a.s.s.SolrDispatchFilter SolrDispatchFilter.init() done
   [junit4]   2> 876089 INFO  (coreLoadExecutor-2943-thread-1) [    ] o.a.s.c.SolrConfig current version of requestparams : -1
   [junit4]   2> 876093 INFO  (coreLoadExecutor-2943-thread-1) [    ] o.a.s.c.SolrConfig Using Lucene MatchVersion: 6.1.0
   [junit4]   2> 876098 INFO  (coreLoadExecutor-2943-thread-1) [    ] o.a.s.c.SolrConfig Loaded SolrConfig: solrconfig.xml
   [junit4]   2> 876100 INFO  (coreLoadExecutor-2943-thread-1) [    ] o.a.s.s.IndexSchema [collection1] Schema name=test
   [junit4]   2> 876101 INFO  (coreLoadExecutor-2943-thread-1) [    ] o.a.s.s.IndexSchema unique key field: id
   [junit4]   2> 876102 INFO  (coreLoadExecutor-2943-thread-1) [    ] o.a.s.c.ConfigSetProperties Did not find ConfigSet properties, assuming default properties: Can't find resource 'configsetprops.json' in classpath or '/home/jenkins/workspace/Lucene-Solr-6.x-Linux/solr/build/solr-core/test/J0/temp/solr.handler.TestReplicationHandler_18324C37DAD052B8-001/solr-instance-002/collection1'
   [junit4]   2> 876102 INFO  (coreLoadExecutor-2943-thread-1) [    ] o.a.s.c.CoreContainer Creating SolrCore 'collection1' using configuration from instancedir /home/jenkins/workspace/Lucene-Solr-6.x-Linux/solr/build/solr-core/test/J0/temp/solr.handler.TestReplicationHandler_18324C37DAD052B8-001/solr-instance-002/./collection1
   [junit4]   2> 876102 INFO  (coreLoadExecutor-2943-thread-1) [    x:collection1] o.a.s.c.SolrCore org.apache.solr.core.MockDirectoryFactory
   [junit4]   2> 876102 INFO  (coreLoadExecutor-2943-thread-1) [    x:collection1] o.a.s.c.SolrCore [[collection1] ] Opening new SolrCore at [/home/jenkins/workspace/Lucene-Solr-6.x-Linux/solr/build/solr-core/test/J0/temp/solr.handler.TestReplicationHandler_18324C37DAD052B8-001/solr-instance-002/collection1], dataDir=[/home/jenkins/workspace/Lucene-Solr-6.x-Linux/solr/build/solr-core/test/J0/temp/solr.handler.TestReplicationHandler_18324C37DAD052B8-001/solr-instance-002/./collection1/data/]
   [junit4]   2> 876102 INFO  (coreLoadExecutor-2943-thread-1) [    x:collection1] o.a.s.c.SolrCore JMX monitoring not detected for core: collection1
   [junit4]   2> 876102 INFO  (coreLoadExecutor-2943-thread-1) [    x:collection1] o.a.s.c.CachingDirectoryFactory return new directory for /home/jenkins/workspace/Lucene-Solr-6.x-Linux/solr/build/solr-core/test/J0/temp/solr.handler.TestReplicationHandler_18324C37DAD052B8-001/solr-instance-002/./collection1/data
   [junit4]   2> 876102 INFO  (coreLoadExecutor-2943-thread-1) [    x:collection1] o.a.s.c.SolrCore New index directory detected: old=null new=/home/jenkins/workspace/Lucene-Solr-6.x-Linux/solr/build/solr-core/test/J0/temp/solr.handler.TestReplicationHandler_18324C37DAD052B8-001/solr-instance-002/./collection1/data/index/
   [junit4]   2> 876102 WARN  (coreLoadExecutor-2943-thread-1) [    x:collection1] o.a.s.c.SolrCore [collection1] Solr index directory '/home/jenkins/workspace/Lucene-Solr-6.x-Linux/solr/build/solr-core/test/J0/temp/solr.handler.TestReplicationHandler_18324C37DAD052B8-001/solr-instance-002/./collection1/data/index' doesn't exist. Creating new index...
   [junit4]   2> 876102 INFO  (coreLoadExecutor-2943-thread-1) [    x:collection1] o.a.s.c.CachingDirectoryFactory return new directory for /home/jenkins/workspace/Lucene-Solr-6.x-Linux/solr/build/solr-core/test/J0/temp/solr.handler.TestReplicationHandler_18324C37DAD052B8-001/solr-instance-002/./collection1/data/index
   [junit4]   2> 876103 INFO  (coreLoadExecutor-2943-thread-1) [    x:collection1] o.a.s.u.RandomMergePolicy RandomMergePolicy wrapping class org.apache.lucene.index.TieredMergePolicy: [TieredMergePolicy: maxMergeAtOnce=24, maxMergeAtOnceExplicit=24, maxMergedSegmentMB=49.423828125, floorSegmentMB=1.7294921875, forceMergeDeletesPctAllowed=17.21229244549716, segmentsPerTier=41.0, maxCFSSegmentSizeMB=8.796093022207999E12, noCFSRatio=0.5322415730235422
   [junit4]   2> 876103 INFO  (coreLoadExecutor-2943-thread-1) [    x:collection1] o.a.s.c.SolrDeletionPolicy SolrDeletionPolicy.onCommit: commits: num=1
   [junit4]   2> 	commit{dir=MockDirectoryWrapper(RAMDirectory@3e1f1e72 lockFactory=org.apache.lucene.store.SingleInstanceLockFactory@15c6346),segFN=segments_1,generation=1}
   [junit4]   2> 876103 INFO  (coreLoadExecutor-2943-thread-1) [    x:collection1] o.a.s.c.SolrDeletionPolicy newest commit generation = 1
   [junit4]   2> 876103 INFO  (OldIndexDirectoryCleanupThreadForCore-collection1) [    x:collection1] o.a.s.c.SolrCore Looking for old index directories to cleanup for core collection1 in /home/jenkins/workspace/Lucene-Solr-6.x-Linux/solr/build/solr-core/test/J0/temp/solr.handler.TestReplicationHandler_18324C37DAD052B8-001/solr-instance-002/./collection1/data/
   [junit4]   2> 876104 INFO  (coreLoadExecutor-2943-thread-1) [    x:collection1] o.a.s.c.SolrCore no updateRequestProcessorChain defined as default, creating implicit default
   [junit4]   2> 876104 INFO  (coreLoadExecutor-2943-thread-1) [    x:collection1] o.a.s.h.l.XMLLoader xsltCacheLifetimeSeconds=60
   [junit4]   2> 876105 INFO  (coreLoadExecutor-2943-thread-1) [    x:collection1] o.a.s.h.l.XMLLoader xsltCacheLifetimeSeconds=60
   [junit4]   2> 876105 INFO  (coreLoadExecutor-2943-thread-1) [    x:collection1] o.a.s.h.l.XMLLoader xsltCacheLifetimeSeconds=60
   [junit4]   2> 876106 INFO  (coreLoadExecutor-2943-thread-1) [    x:collection1] o.a.s.h.l.XMLLoader xsltCacheLifetimeSeconds=60
   [junit4]   2> 876107 INFO  (coreLoadExecutor-2943-thread-1) [    x:collection1] o.a.s.c.PluginBag requestHandler : 'lazy' created with startup=lazy 
   [junit4]   2> 876107 INFO  (coreLoadExecutor-2943-thread-1) [    x:collection1] o.a.s.c.RequestHandlers Registered paths: /admin/mbeans,standard,lazy,/update/json/docs,/admin/luke,/export,/get,/admin/properties,/update/json,/admin/threads,/update/csv,/sql,/graph,/admin/segments,/admin/system,/replication,defaults,/config,/stream,/schema,/admin/plugins,/admin/logging,/admin/ping,/update,/admin/file
   [junit4]   2> 876107 INFO  (coreLoadExecutor-2943-thread-1) [    x:collection1] o.a.s.c.SolrCore Using default statsCache cache: org.apache.solr.search.stats.LocalStatsCache
   [junit4]   2> 876107 INFO  (coreLoadExecutor-2943-thread-1) [    x:collection1] o.a.s.u.CommitTracker Hard AutoCommit: disabled
   [junit4]   2> 876107 INFO  (coreLoadExecutor-2943-thread-1) [    x:collection1] o.a.s.u.CommitTracker Soft AutoCommit: disabled
   [junit4]   2> 876107 INFO  (coreLoadExecutor-2943-thread-1) [    x:collection1] o.a.s.u.RandomMergePolicy RandomMergePolicy wrapping class org.apache.lucene.index.LogByteSizeMergePolicy: [LogByteSizeMergePolicy: minMergeSize=1677721, mergeFactor=16, maxMergeSize=2147483648, maxMergeSizeForForcedMerge=9223372036854775807, calibrateSizeByDeletes=false, maxMergeDocs=2147483647, maxCFSSegmentSizeMB=8.796093022207999E12, noCFSRatio=0.3687505357253279]
   [junit4]   2> 876107 INFO  (coreLoadExecutor-2943-thread-1) [    x:collection1] o.a.s.c.SolrDeletionPolicy SolrDeletionPolicy.onInit: commits: num=1
   [junit4]   2> 	commit{dir=MockDirectoryWrapper(RAMDirectory@3e1f1e72 lockFactory=org.apache.lucene.store.SingleInstanceLockFactory@15c6346),segFN=segments_1,generation=1}
   [junit4]   2> 876107 INFO  (coreLoadExecutor-2943-thread-1) [    x:collection1] o.a.s.c.SolrDeletionPolicy newest commit generation = 1
   [junit4]   2> 876107 INFO  (coreLoadExecutor-2943-thread-1) [    x:collection1] o.a.s.s.SolrIndexSearcher Opening [Searcher@5668ffa7[collection1] main]
   [junit4]   2> 876108 INFO  (coreLoadExecutor-2943-thread-1) [    x:collection1] o.a.s.r.ManagedResourceStorage File-based storage initialized to use dir: /home/jenkins/workspace/Lucene-Solr-6.x-Linux/solr/build/solr-core/test/J0/temp/solr.handler.TestReplicationHandler_18324C37DAD052B8-001/solr-instance-002/collection1/conf
   [junit4]   2> 876108 INFO  (coreLoadExecutor-2943-thread-1) [    x:collection1] o.a.s.r.RestManager Initializing RestManager with initArgs: {storageDir=/home/jenkins/workspace/Lucene-Solr-6.x-Linux/solr/build/solr-core/test/J0/temp/solr.handler.TestReplicationHandler_18324C37DAD052B8-001/solr-instance-002/collection1/conf}
   [junit4]   2> 876108 INFO  (coreLoadExecutor-2943-thread-1) [    x:collection1] o.a.s.r.ManagedResourceStorage Reading _rest_managed.json using file:dir=/home/jenkins/workspace/Lucene-Solr-6.x-Linux/solr/build/solr-core/test/J0/temp/solr.handler.TestReplicationHandler_18324C37DAD052B8-001/solr-instance-002/collection1/conf
   [junit4]   2> 876108 INFO  (coreLoadExecutor-2943-thread-1) [    x:collection1] o.a.s.r.RestManager Initializing 0 registered ManagedResources
   [junit4]   2> 876108 INFO  (coreLoadExecutor-2943-thread-1) [    x:collection1] o.a.s.h.ReplicationHandler Commits will be reserved for  10000
   [junit4]   2> 876108 INFO  (searcherExecutor-2944-thread-1-processing-x:collection1) [    x:collection1] o.a.s.c.SolrCore [collection1] Registered new searcher Searcher@5668ffa7[collection1] main{ExitableDirectoryReader(UninvertingDirectoryReader())}
   [junit4]   2> 876108 INFO  (coreLoadExecutor-2943-thread-1) [    x:collection1] o.a.s.c.CoreContainer registering core: collection1
   [junit4]   2> 876587 INFO  (TEST-TestReplicationHandler.doTestRepeater-seed#[18324C37DAD052B8]) [    ] o.a.s.SolrTestCaseJ4 Writing core.properties file to /home/jenkins/workspace/Lucene-Solr-6.x-Linux/solr/build/solr-core/test/J0/temp/solr.handler.TestReplicationHandler_18324C37DAD052B8-001/solr-instance-003/collection1
   [junit4]   2> 876599 INFO  (TEST-TestReplicationHandler.doTestRepeater-seed#[18324C37DAD052B8]) [    ] o.e.j.s.Server jetty-9.3.8.v20160314
   [junit4]   2> 876600 INFO  (TEST-TestReplicationHandler.doTestRepeater-seed#[18324C37DAD052B8]) [    ] o.e.j.s.h.ContextHandler Started o.e.j.s.ServletContextHandler@6b530e35{/solr,null,AVAILABLE}
   [junit4]   2> 876600 INFO  (TEST-TestReplicationHandler.doTestRepeater-seed#[18324C37DAD052B8]) [    ] o.e.j.s.ServerConnector Started ServerConnector@1e0a0635{HTTP/1.1,[http/1.1]}{127.0.0.1:32845}
   [junit4]   2> 876600 INFO  (TEST-TestReplicationHandler.doTestRepeater-seed#[18324C37DAD052B8]) [    ] o.e.j.s.Server Started @878270ms
   [junit4]   2> 876600 INFO  (TEST-TestReplicationHandler.doTestRepeater-seed#[18324C37DAD052B8]) [    ] o.a.s.c.s.e.JettySolrRunner Jetty properties: {solr.data.dir=/home/jenkins/workspace/Lucene-Solr-6.x-Linux/solr/build/solr-core/test/J0/temp/solr.handler.TestReplicationHandler_18324C37DAD052B8-001/solr-instance-003/collection1/data, hostContext=/solr, hostPort=32845}
   [junit4]   2> 876601 INFO  (TEST-TestReplicationHandler.doTestRepeater-seed#[18324C37DAD052B8]) [    ] o.a.s.s.SolrDispatchFilter SolrDispatchFilter.init(): sun.misc.Launcher$AppClassLoader@73d16e93
   [junit4]   2> 876601 INFO  (TEST-TestReplicationHandler.doTestRepeater-seed#[18324C37DAD052B8]) [    ] o.a.s.c.SolrResourceLoader new SolrResourceLoader for directory: '/home/jenkins/workspace/Lucene-Solr-6.x-Linux/solr/build/solr-core/test/J0/temp/solr.handler.TestReplicationHandler_18324C37DAD052B8-001/solr-instance-003'
   [junit4]   2> 876601 INFO  (TEST-TestReplicationHandler.doTestRepeater-seed#[18324C37DAD052B8]) [    ] o.a.s.c.SolrResourceLoader JNDI not configured for solr (NoInitialContextEx)
   [junit4]   2> 876601 INFO  (TEST-TestReplicationHandler.doTestRepeater-seed#[18324C37DAD052B8]) [    ] o.a.s.c.SolrResourceLoader solr home defaulted to 'solr/' (could not find system property or JNDI)
   [junit4]   2> 876601 INFO  (TEST-TestReplicationHandler.doTestRepeater-seed#[18324C37DAD052B8]) [    ] o.a.s.c.SolrXmlConfig Loading container configuration from /home/jenkins/workspace/Lucene-Solr-6.x-Linux/solr/build/solr-core/test/J0/temp/solr.handler.TestReplicationHandler_18324C37DAD052B8-001/solr-instance-003/solr.xml
   [junit4]   2> 876603 INFO  (TEST-TestReplicationHandler.doTestRepeater-seed#[18324C37DAD052B8]) [    ] o.a.s.c.CorePropertiesLocator Config-defined core root directory: /home/jenkins/workspace/Lucene-Solr-6.x-Linux/solr/build/solr-core/test/J0/temp/solr.handler.TestReplicationHandler_18324C37DAD052B8-001/solr-instance-003/.
   [junit4]   2> 876604 INFO  (TEST-TestReplicationHandler.doTestRepeater-seed#[18324C37DAD052B8]) [    ] o.a.s.c.CoreContainer New CoreContainer 1906401674
   [junit4]   2> 876604 INFO  (TEST-TestReplicationHandler.doTestRepeater-seed#[18324C37DAD052B8]) [    ] o.a.s.c.CoreContainer Loading cores into CoreContainer [instanceDir=/home/jenkins/workspace/Lucene-Solr-6.x-Linux/solr/build/solr-core/test/J0/temp/solr.handler.TestReplicationHandler_18324C37DAD052B8-001/solr-instance-003]
   [junit4]   2> 876604 WARN  (TEST-TestReplicationHandler.doTestRepeater-seed#[18324C37DAD052B8]) [    ] o.a.s.c.CoreContainer Couldn't add files from /home/jenkins/workspace/Lucene-Solr-6.x-Linux/solr/build/solr-core/test/J0/temp/solr.handler.TestReplicationHandler_18324C37DAD052B8-001/solr-instance-003/lib to classpath: /home/jenkins/workspace/Lucene-Solr-6.x-Linux/solr/build/solr-core/test/J0/temp/solr.handler.TestReplicationHandler_18324C37DAD052B8-001/solr-instance-003/lib
   [junit4]   2> 876604 INFO  (TEST-TestReplicationHandler.doTestRepeater-seed#[18324C37DAD052B8]) [    ] o.a.s.h.c.HttpShardHandlerFactory created with socketTimeout : 90000,urlScheme : ,connTimeout : 15000,maxConnectionsPerHost : 20,maxConnections : 10000,corePoolSize : 0,maximumPoolSize : 2147483647,maxThreadIdleTime : 5,sizeOfQueue : -1,fairnessPolicy : false,useRetries : false,
   [junit4]   2> 876604 INFO  (TEST-TestReplicationHandler.doTestRepeater-seed#[18324C37DAD052B8]) [    ] o.a.s.u.UpdateShardHandler Creating UpdateShardHandler HTTP client with params: socketTimeout=340000&connTimeout=45000&retry=true
   [junit4]   2> 876605 INFO  (TEST-TestReplicationHandler.doTestRepeater-seed#[18324C37DAD052B8]) [    ] o.a.s.l.LogWatcher SLF4J impl is org.slf4j.impl.Log4jLoggerFactory
   [junit4]   2> 876605 INFO  (TEST-TestReplicationHandler.doTestRepeater-seed#[18324C37DAD052B8]) [    ] o.a.s.l.LogWatcher Registering Log Listener [Log4j (org.slf4j.impl.Log4jLoggerFactory)]
   [junit4]   2> 876605 INFO  (TEST-TestReplicationHandler.doTestRepeater-seed#[18324C37DAD052B8]) [    ] o.a.s.c.CoreContainer Security conf doesn't exist. Skipping setup for authorization module.
   [junit4]   2> 876605 INFO  (TEST-TestReplicationHandler.doTestRepeater-seed#[18324C37DAD052B8]) [    ] o.a.s.c.CoreContainer No authentication plugin used.
   [junit4]   2> 876605 INFO  (TEST-TestReplicationHandler.doTestRepeater-seed#[18324C37DAD052B8]) [    ] o.a.s.c.CorePropertiesLocator Looking for core definitions underneath /home/jenkins/workspace/Lucene-Solr-6.x-Linux/solr/build/solr-core/test/J0/temp/solr.handler.TestReplicationHandler_18324C37DAD052B8-001/solr-instance-003/.
   [junit4]   2> 876605 INFO  (TEST-TestReplicationHandler.doTestRepeater-seed#[18324C37DAD052B8]) [    ] o.a.s.c.CoreDescriptor Created CoreDescriptor: {name=collection1, config=solrconfig.xml, loadOnStartup=true, schema=schema.xml, configSetProperties=configsetprops.json, transient=false, dataDir=data/}
   [junit4]   2> 876606 INFO  (TEST-TestReplicationHandler.doTestRepeater-seed#[18324C37DAD052B8]) [    ] o.a.s.c.CorePropertiesLocator Found core collection1 in /home/jenkins/workspace/Lucene-Solr-6.x-Linux/solr/build/solr-core/test/J0/temp/solr.handler.TestReplicationHandler_18324C37DAD052B8-001/solr-instance-003/./collection1
   [junit4]   2> 876606 INFO  (TEST-TestReplicationHandler.doTestRepeater-seed#[18324C37DAD052B8]) [    ] o.a.s.c.CorePropertiesLocator Found 1 core definitions
   [junit4]   2> 876606 INFO  (coreLoadExecutor-2953-thread-1) [    ] o.a.s.c.SolrResourceLoader new SolrResourceLoader for directory: '/home/jenkins/workspace/Lucene-Solr-6.x-Linux/solr/build/solr-core/test/J0/temp/solr.handler.TestReplicationHandler_18324C37DAD052B8-001/solr-instance-003/collection1'
   [junit4]   2> 876606 INFO  (TEST-TestReplicationHandler.doTestRepeater-seed#[18324C37DAD052B8]) [    ] o.a.s.s.SolrDispatchFilter user.dir=/home/jenkins/workspace/Lucene-Solr-6.x-Linux/solr/build/solr-core/test/J0
   [junit4]   2> 876606 INFO  (TEST-TestReplicationHandler.doTestRepeater-seed#[18324C37DAD052B8]) [    ] o.a.s.s.SolrDispatchFilter SolrDispatchFilter.init() done
   [junit4]   2> 876606 INFO  (coreLoadExecutor-2953-thread-1) [    ] o.a.s.c.SolrResourceLoader JNDI not configured for solr (NoInitialContextEx)
   [junit4]   2> 876606 INFO  (coreLoadExecutor-2953-thread-1) [    ] o.a.s.c.SolrResourceLoader solr home defaulted to 'solr/' (could not find system property or JNDI)
   [junit4]   2> 876611 INFO  (coreLoadExecutor-2953-thread-1) [    ] o.a.s.c.SolrConfig current version of requestparams : -1
   [junit4]   2> 876613 INFO  (coreLoadExecutor-2953-thread-1) [    ] o.a.s.c.SolrConfig Using Lucene MatchVersion: 6.1.0
   [junit4]   2> 876618 INFO  (coreLoadExecutor-2953-thread-1) [    ] o.a.s.c.SolrConfig Loaded SolrConfig: solrconfig.xml
   [junit4]   2> 876620 INFO  (coreLoadExecutor-2953-thread-1) [    ] o.a.s.s.IndexSchema [collection1] Schema name=test
   [junit4]   2> 876622 INFO  (coreLoadExecutor-2953-thread-1) [    ] o.a.s.s.IndexSchema unique key field: id
   [junit4]   2> 876623 INFO  (coreLoadExecutor-2953-thread-1) [    ] o.a.s.c.ConfigSetProperties Did not find ConfigSet properties, assuming default properties: Can't find resource 'configsetprops.json' in classpath or '/home/jenkins/workspace/Lucene-Solr-6.x-Linux/solr/build/solr-core/test/J0/temp/solr.handler.TestReplicationHandler_18324C37DAD052B8-001/solr-instance-003/collection1'
   [junit4]   2> 876623 INFO  (coreLoadExecutor-2953-thread-1) [    ] o.a.s.c.CoreContainer Creating SolrCore 'collection1' using configuration from instancedir /home/jenkins/workspace/Lucene-Solr-6.x-Linux/solr/build/solr-core/test/J0/temp/solr.handler.TestReplicationHandler_18324C37DAD052B8-001/solr-instance-003/./collection1
   [junit4]   2> 876623 INFO  (coreLoadExecutor-2953-thread-1) [    x:collection1] o.a.s.c.SolrCore org.apache.solr.core.MockDirectoryFactory
   [junit4]   2> 876623 INFO  (coreLoadExecutor-2953-thread-1) [    x:collection1] o.a.s.c.SolrCore [[collection1] ] Opening new SolrCore at [/home/jenkins/workspace/Lucene-Solr-6.x-Linux/solr/build/solr-core/test/J0/temp/solr.handler.TestReplicationHandler_18324C37DAD052B8-001/solr-instance-003/collection1], dataDir=[/home/jenkins/workspace/Lucene-Solr-6.x-Linux/solr/build/solr-core/test/J0/temp/solr.handler.TestReplicationHandler_18324C37DAD052B8-001/solr-instance-003/./collection1/data/]
   [junit4]   2> 876623 INFO  (coreLoadExecutor-2953-thread-1) [    x:collection1] o.a.s.c.SolrCore JMX monitoring not detected for core: collection1
   [junit4]   2> 876624 INFO  (coreLoadExecutor-2953-thread-1) [    x:collection1] o.a.s.c.CachingDirectoryFactory return new directory for /home/jenkins/workspace/Lucene-Solr-6.x-Linux/solr/build/solr-core/test/J0/temp/solr.handler.TestReplicationHandler_18324C37DAD052B8-001/solr-instance-003/./collection1/data
   [junit4]   2> 876624 INFO  (coreLoadExecutor-2953-thread-1) [    x:collection1] o.a.s.c.SolrCore New index directory detected: old=null new=/home/jenkins/workspace/Lucene-Solr-6.x-Linux/solr/build/solr-core/test/J0/temp/solr.handler.TestReplicationHandler_18324C37DAD052B8-001/solr-instance-003/./collection1/data/index/
   [junit4]   2> 876624 WARN  (coreLoadExecutor-2953-thread-1) [    x:collection1] o.a.s.c.SolrCore [collection1] Solr index directory '/home/jenkins/workspace/Lucene-Solr-6.x-Linux/solr/build/solr-core/test/J0/temp/solr.handler.TestReplicationHandler_18324C37DAD052B8-001/solr-instance-003/./collection1/data/index' doesn't exist. Creating new index...
   [junit4]   2> 876624 INFO  (coreLoadExecutor-2953-thread-1) [    x:collection1] o.a.s.c.CachingDirectoryFactory return new directory for /home/jenkins/workspace/Lucene-Solr-6.x-Linux/solr/build/solr-core/test/J0/temp/solr.handler.TestReplicationHandler_18324C37DAD052B8-001/solr-instance-003/./collection1/data/index
   [junit4]   2> 876624 INFO  (coreLoadExecutor-2953-thread-1) [    x:collection1] o.a.s.u.RandomMergePolicy RandomMergePolicy wrapping class org.apache.lucene.index.TieredMergePolicy: [TieredMergePolicy: maxMergeAtOnce=24, maxMergeAtOnceExplicit=24, maxMergedSegmentMB=49.423828125, floorSegmentMB=1.7294921875, forceMergeDeletesPctAllowed=17.21229244549716, segmentsPerTier=41.0, maxCFSSegmentSizeMB=8.796093022207999E12, noCFSRatio=0.5322415730235422
   [junit4]   2> 876624 INFO  (coreLoadExecutor-2953-thread-1) [    x:collection1] o.a.s.c.SolrDeletionPolicy SolrDeletionPolicy.onCommit: commits: num=1
   [junit4]   2> 	commit{dir=MockDirectoryWrapper(RAMDirectory@562b4bf lockFactory=org.apache.lucene.store.SingleInstanceLockFactory@360a5c05),segFN=segments_1,generation=1}
   [junit4]   2> 876624 INFO  (coreLoadExecutor-2953-thread-1) [    x:collection1] o.a.s.c.SolrDeletionPolicy newest commit generation = 1
   [junit4]   2> 876625 INFO  (OldIndexDirectoryCleanupThreadForCore-collection1) [    x:collection1] o.a.s.c.SolrCore Looking for old index directories to cleanup for core collection1 in /home/jenkins/workspace/Lucene-Solr-6.x-Linux/solr/build/solr-core/test/J0/temp/solr.handler.TestReplicationHandler_18324C37DAD052B8-001/solr-instance-003/./collection1/data/
   [junit4]   2> 876626 INFO  (coreLoadExecutor-2953-thread-1) [    x:collection1] o.a.s.c.SolrCore no updateRequestProcessorChain defined as default, creating implicit default
   [junit4]   2> 876627 INFO  (coreLoadExecutor-2953-thread-1) [    x:collection1] o.a.s.h.l.XMLLoader xsltCacheLifetimeSeconds=60
   [junit4]   2> 876627 INFO  (coreLoadExecutor-2953-thread-1) [    x:collection1] o.a.s.h.l.XMLLoader xsltCacheLifetimeSeconds=60
   [junit4]   2> 876628 INFO  (coreLoadExecutor-2953-thread-1) [    x:collection1] o.a.s.h.l.XMLLoader xsltCacheLifetimeSeconds=60
   [junit4]   2> 876628 INFO  (coreLoadExecutor-2953-thread-1) [    x:collection1] o.a.s.h.l.XMLLoader xsltCacheLifetimeSeconds=60
   [junit4]   2> 876629 INFO  (coreLoadExecutor-2953-thread-1) [    x:collection1] o.a.s.c.PluginBag requestHandler : 'lazy' created with startup=lazy 
   [junit4]   2> 876629 INFO  (coreLoadExecutor-2953-thread-1) [    x:collection1] o.a.s.c.RequestHandlers Registered paths: /admin/mbeans,standard,lazy,/update/json/docs,/admin/luke,/export,/get,/admin/properties,/update/json,/admin/threads,/update/csv,/sql,/graph,/admin/segments,/admin/system,/replication,defaults,/config,/stream,/schema,/admin/plugins,/admin/logging,/admin/ping,/update,/admin/file
   [junit4]   2> 876629 INFO  (coreLoadExecutor-2953-thread-1) [    x:collection1] o.a.s.c.SolrCore Using default statsCache cache: org.apache.solr.search.stats.LocalStatsCache
   [junit4]   2> 876629 INFO  (coreLoadExecutor-2953-thread-1) [    x:collection1] o.a.s.u.CommitTracker Hard AutoCommit: disabled
   [junit4]   2> 876629 INFO  (coreLoadExecutor-2953-thread-1) [    x:collection1] o.a.s.u.CommitTracker Soft AutoCommit: disabled
   [junit4]   2> 876629 INFO  (coreLoadExecutor-2953-thread-1) [    x:collection1] o.a.s.u.RandomMergePolicy RandomMergePolicy wrapping class org.apache.lucene.index.LogByteSizeMergePolicy: [LogByteSizeMergePolicy: minMergeSize=1677721, mergeFactor=16, maxMergeSize=2147483648, maxMergeSizeForForcedMerge=9223372036854775807, calibrateSizeByDeletes=false, maxMergeDocs=2147483647, maxCFSSegmentSizeMB=8.796093022207999E12, noCFSRatio=0.3687505357253279]
   [junit4]   2> 876629 INFO  (coreLoadExecutor-2953-thread-1) [    x:collection1] o.a.s.c.SolrDeletionPolicy SolrDeletionPolicy.onInit: commits: num=1
   [junit4]   2> 	commit{dir=MockDirectoryWrapper(RAMDirectory@562b4bf lockFactory=org.apache.lucene.store.SingleInstanceLockFactory@360a5c05),segFN=segments_1,generation=1}
   [junit4]   2> 876629 INFO  (coreLoadExecutor-2953-thread-1) [    x:collection1] o.a.s.c.SolrDeletionPolicy newest commit generation = 1
   [junit4]   2> 876629 INFO  (coreLoadExecutor-2953-thread-1) [    x:collection1] o.a.s.s.SolrIndexSearcher Opening [Searcher@4fc7116d[collection1] main]
   [junit4]   2> 876629 INFO  (coreLoadExecutor-2953-thread-1) [    x:collection1] o.a.s.r.ManagedResourceStorage File-based storage initialized to use dir: /home/jenkins/workspace/Lucene-Solr-6.x-Linux/solr/build/solr-core/test/J0/temp/solr.handler.TestReplicationHandler_18324C37DAD052B8-001/solr-instance-003/collection1/conf
   [junit4]   2> 876629 INFO  (coreLoadExecutor-2953-thread-1) [    x:collection1] o.a.s.r.RestManager Initializing RestManager with initArgs: {storageDir=/home/jenkins/workspace/Lucene-Solr-6.x-Linux/solr/build/solr-core/test/J0/temp/solr.handler.TestReplicationHandler_18324C37DAD052B8-001/solr-instance-003/collection1/conf}
   [junit4]   2> 876629 INFO  (coreLoadExecutor-2953-thread-1) [    x:collection1] o.a.s.r.ManagedResourceStorage Reading _rest_managed.json using file:dir=/home/jenkins/workspace/Lucene-Solr-6.x-Linux/solr/build/solr-core/test/J0/temp/solr.handler.TestReplicationHandler_18324C37DAD052B8-001/solr-instance-003/collection1/conf
   [junit4]   2> 876630 INFO  (coreLoadExecutor-2953-thread-1) [    x:collection1] o.a.s.r.RestManager Initializing 0 registered ManagedResources
   [junit4]   2> 876630 WARN  (coreLoadExecutor-2953-thread-1) [    x:collection1] o.a.s.h.IndexFetcher 'masterUrl' must be specified without the /replication suffix
   [junit4]   2> 876630 INFO  (coreLoadExecutor-2953-thread-1) [    x:collection1] o.a.s.h.ReplicationHandler  No value set for 'pollInterval'. Timer Task not started.
   [junit4]   2> 876630 INFO  (coreLoadExecutor-2953-thread-1) [    x:collection1] o.a.s.h.ReplicationHandler Replication enabled for following config files: schema.xml
   [junit4]   2> 876630 INFO  (coreLoadExecutor-2953-thread-1) [    x:collection1] o.a.s.h.ReplicationHandler Commits will be reserved for  10000
   [junit4]   2> 876630 INFO  (searcherExecutor-2954-thread-1-processing-x:collection1) [    x:collection1] o.a.s.c.SolrCore [collection1] Registered new searcher Searcher@4fc7116d[collection1] main{ExitableDirectoryReader(UninvertingDirectoryReader())}
   [junit4]   2> 876630 INFO  (coreLoadExecutor-2953-thread-1) [    x:collection1] o.a.s.c.CoreContainer registering core: collection1
   [junit4]   2> 877109 INFO  (qtp1819271663-5780) [    x:collection1] o.a.s.u.p.LogUpdateProcessorFactory [collection1]  webapp=/solr path=/update params={wt=javabin&version=2}{add=[0]} 0 0
   [junit4]   2> 877110 INFO  (qtp1819271663-5775) [    x:collection1] o.a.s.u.p.LogUpdateProcessorFactory [collection1]  webapp=/solr path=/update params={wt=javabin&version=2}{add=[1]} 0 0
   [junit4]   2> 877112 INFO  (qtp1819271663-5782) [    x:collection1] o.a.s.u.p.LogUpdateProcessorFactory [collection1]  webapp=/solr path=/update params={wt=javabin&version=2}{add=[2]} 0 0
   [junit4]   2> 877113 INFO  (qtp1819271663-5776) [    x:collection1] o.a.s.u.DirectUpdateHandler2 start commit{,optimize=false,openSearcher=true,waitSearcher=true,expungeDeletes=false,softCommit=false,prepareCommit=false}
   [junit4]   2> 877114 INFO  (qtp1819271663-5776) [    x:collection1] o.a.s.c.SolrDeletionPolicy SolrDeletionPolicy.onCommit: commits: num=2
   [junit4]   2> 	commit{dir=MockDirectoryWrapper(RAMDirectory@7af860cc lockFactory=org.apache.lucene.store.SingleInstanceLockFactory@5fb33bfc),segFN=segments_1,generation=1}
   [junit4]   2> 	commit{dir=MockDirectoryWrapper(RAMDirectory@7af860cc lockFactory=org.apache.lucene.store.SingleInstanceLockFactory@5fb33bfc),segFN=segments_2,generation=2}
   [junit4]   2> 877115 INFO  (qtp1819271663-5776) [    x:collection1] o.a.s.c.SolrDeletionPolicy newest commit generation = 2
   [junit4]   2> 877116 INFO  (qtp1819271663-5776) [    x:collection1] o.a.s.s.SolrIndexSearcher Opening [Searcher@a6061ee[collection1] main]
   [junit4]   2> 877116 INFO  (qtp1819271663-5776) [    x:collection1] o.a.s.u.DirectUpdateHandler2 end_commit_flush
   [junit4]   2> 877116 INFO  (searcherExecutor-2921-thread-1-processing-x:collection1) [    x:collection1] o.a.s.c.SolrCore [collection1] Registered new searcher Searcher@a6061ee[collection1] main{ExitableDirectoryReader(UninvertingDirectoryReader(Uninverting(_0(6.1.0):c3)))}
   [junit4]   2> 877116 INFO  (qtp1819271663-5776) [    x:collection1] o.a.s.u.p.LogUpdateProcessorFactory [collection1]  webapp=/solr path=/update params={waitSearcher=true&commit=true&softCommit=false&wt=javabin&version=2}{commit=} 0 2
   [junit4]   2> 877117 WARN  (explicit-fetchindex-cmd) [    x:collection1] o.a.s.h.IndexFetcher 'masterUrl' must be specified without the /replication suffix
   [junit4]   2> 877119 INFO  (qtp1819271663-5775) [    x:collection1] o.a.s.c.S.Request [collection1]  webapp=/solr path=/replication params={qt=/replication&wt=javabin&version=2&command=indexversion} status=0 QTime=0
   [junit4]   2> 877119 INFO  (explicit-fetchindex-cmd) [    x:collection1] o.a.s.h.IndexFetcher Master's generation: 2
   [junit4]   2> 877119 INFO  (explicit-fetchindex-cmd) [    x:collection1] o.a.s.h.IndexFetcher Slave's generation: 1
   [junit4]   2> 877119 INFO  (explicit-fetchindex-cmd) [    x:collection1] o.a.s.h.IndexFetcher Starting replication process
   [junit4]   2> 877122 INFO  (qtp1819271663-5782) [    x:collection1] o.a.s.c.S.Request [collection1]  webapp=/solr path=/replication params={generation=2&qt=/replication&wt=javabin&version=2&command=filelist} status=0 QTime=1
   [junit4]   2> 877122 INFO  (explicit-fetchindex-cmd) [    x:collection1] o.a.s.h.IndexFetcher Number of files in latest index in master: 4
   [junit4]   2> 877122 INFO  (explicit-fetchindex-cmd) [    x:collection1] o.a.s.c.CachingDirectoryFactory return new directory for /home/jenkins/workspace/Lucene-Solr-6.x-Linux/solr/build/solr-core/test/J0/temp/solr.handler.TestReplicationHandler_18324C37DAD052B8-001/solr-instance-003/./collection1/data/index.20160527022120775
   [junit4]   2> 877122 INFO  (explicit-fetchindex-cmd) [    x:collection1] o.a.s.u.DefaultSolrCoreState Rollback old IndexWriter... core=collection1
   [junit4]   2> 877123 INFO  (explicit-fetchindex-cmd) [    x:collection1] o.a.s.u.RandomMergePolicy RandomMergePolicy wrapping class org.apache.lucene.index.LogDocMergePolicy: [LogDocMergePolicy: minMergeSize=1000, mergeFactor=26, maxMergeSize=9223372036854775807, maxMergeSizeForForcedMerge=9223372036854775807, calibrateSizeByDeletes=true, maxMergeDocs=2147483647, maxCFSSegmentSizeMB=8.796093022207999E12, noCFSRatio=0.0]
   [junit4]   2> 877123 INFO  (explicit-fetchindex-cmd) [    x:collection1] o.a.s.c.SolrDeletionPolicy SolrDeletionPolicy.onInit: commits: num=1
   [junit4]   2> 	commit{dir=MockDirectoryWrapper(RAMDirectory@562b4bf lockFactory=org.apache.lucene.store.SingleInstanceLockFactory@360a5c05),segFN=segments_1,generation=1}
   [junit4]   2> 877123 INFO  (explicit-fetchindex-cmd) [    x:collection1] o.a.s.c.SolrDeletionPolicy newest commit generation = 1
   [junit4]   2> 877123 INFO  (explicit-fetchindex-cmd) [    x:collection1] o.a.s.u.DefaultSolrCoreState New IndexWriter is ready to be used.
   [junit4]   2> 877123 INFO  (explicit-fetchindex-cmd) [    x:collection1] o.a.s.c.SolrDeletionPolicy SolrDeletionPolicy.onCommit: commits: num=1
   [junit4]   2> 	commit{dir=MockDirectoryWrapper(RAMDirectory@562b4bf lockFactory=org.apache.lucene.store.SingleInstanceLockFactory@360a5c05),segFN=segments_1,generation=1}
   [junit4]   2> 877123 INFO  (explicit-fetchindex-cmd) [    x:collection1] o.a.s.c.SolrDeletionPolicy newest commit generation = 1
   [junit4]   2> 877123 INFO  (explicit-fetchindex-cmd) [    x:collection1] o.a.s.u.DefaultSolrCoreState Rollback old IndexWriter... core=collection1
   [junit4]   2> 877123 INFO  (explicit-fetchindex-cmd) [    x:collection1] o.a.s.h.IndexFetcher Starting download (fullCopy=false) to MockDirectoryWrapper(RAMDirectory@46c4eb3 lockFactory=org.apache.lucene.store.SingleInstanceLockFactory@5d5e22ca)
   [junit4]   2> 877125 INFO  (qtp1819271663-5776) [    x:collection1] o.a.s.c.S.Request [collection1]  webapp=/solr path=/replication params={generation=2&qt=/replication&file=_0.cfe&checksum=true&wt=filestream&command=filecontent} status=0 QTime=0
   [junit4]   2> 877127 INFO  (qtp1819271663-5777) [    x:collection1] o.a.s.c.S.Request [collection1]  webapp=/solr path=/replication params={generation=2&qt=/replication&file=_0.si&checksum=true&wt=filestream&command=filecontent} status=0 QTime=0
   [junit4]   2> 877130 INFO  (qtp1819271663-5775) [    x:collection1] o.a.s.c.S.Request [collection1]  webapp=/solr path=/replication params={generation=2&qt=/replication&file=_0.cfs&checksum=true&wt=filestream&command=filecontent} status=0 QTime=0
   [junit4]   2> 877132 INFO  (qtp1819271663-5782) [    x:collection1] o.a.s.c.S.Request [collection1]  webapp=/solr path=/replication params={generation=2&qt=/replication&file=segments_2&checksum=true&wt=filestream&command=filecontent} status=0 QTime=0
   [junit4]   2> 877132 INFO  (explicit-fetchindex-cmd) [    x:collection1] o.a.s.h.IndexFetcher Total time taken for download (fullCopy=false,bytesDownloaded=1952) : 0 secs (null bytes/sec) to MockDirectoryWrapper(RAMDirectory@46c4eb3 lockFactory=org.apache.lucene.store.SingleInstanceLockFactory@5d5e22ca)
   [junit4]   2> 877133 INFO  (explicit-fetchindex-cmd) [    x:collection1] o.a.s.u.RandomMergePolicy RandomMergePolicy wrapping class org.apache.lucene.index.LogDocMergePolicy: [LogDocMergePolicy: minMergeSize=1000, mergeFactor=26, maxMergeSize=9223372036854775807, maxMergeSizeForForcedMerge=9223372036854775807, calibrateSizeByDeletes=true, maxMergeDocs=2147483647, maxCFSSegmentSizeMB=8.796093022207999E12, noCFSRatio=0.839335662606978]
   [junit4]   2> 877133 INFO  (explicit-fetchindex-cmd) [    x:collection1] o.a.s.c.SolrDeletionPolicy SolrDeletionPolicy.onInit: commits: num=2
   [junit4]   2> 	commit{dir=MockDirectoryWrapper(RAMDirectory@562b4bf lockFactory=org.apache.lucene.store.SingleInstanceLockFactory@360a5c05),segFN=segments_1,generation=1}
   [junit4]   2> 	commit{dir=MockDirectoryWrapper(RAMDirectory@562b4bf lockFactory=org.apache.lucene.store.SingleInstanceLockFactory@360a5c05),segFN=segments_2,generation=2}
   [junit4]   2> 877134 INFO  (explicit-fetchindex-cmd) [    x:collection1] o.a.s.c.SolrDeletionPolicy newest commit generation = 2
   [junit4]   2> 877134 INFO  (explicit-fetchindex-cmd) [    x:collection1] o.a.s.u.DefaultSolrCoreState New IndexWriter is ready to be used.
   [junit4]   2> 877134 INFO  (explicit-fetchindex-cmd) [    x:collection1] o.a.s.s.SolrIndexSearcher Opening [Searcher@7ffbc4ee[collection1] main]
   [junit4]   2> 877134 INFO  (searcherExecutor-2954-thread-1-processing-x:collection1) [    x:collection1] o.a.s.c.SolrCore [collection1] Registered new searcher Searcher@7ffbc4ee[collection1] main{ExitableDirectoryReader(UninvertingDirectoryReader(Uninverting(_0(6.1.0):c3)))}
   [junit4]   2> 877134 INFO  (explicit-fetchindex-cmd) [    x:collection1] o.a.s.c.CachingDirectoryFactory looking to close /home/jenkins/workspace/Lucene-Solr-6.x-Linux/solr/build/solr-core/test/J0/temp/solr.handler.TestReplicationHandler_18324C37DAD052B8-001/solr-instance-003/./collection1/data/index.20160527022120775 [CachedDir<<refCount=0;path=/home/jenkins/workspace/Lucene-Solr-6.x-Linux/solr/build/solr-core/test/J0/temp/solr.handler.TestReplicationHandler_18324C37DAD052B8-001/solr-instance-003/./collection1/data/index.20160527022120775;done=true>>]
   [junit4]   2> 877135 INFO  (explicit-fetchindex-cmd) [    x:collection1] o.a.s.c.CachingDirectoryFactory Closing directory, CoreContainer#isShutdown=false
   [junit4]   2> 877135 INFO  (explicit-fetchindex-cmd) [    x:collection1] o.a.s.c.CachingDirectoryFactory Closing directory: /home/jenkins/workspace/Lucene-Solr-6.x-Linux/solr/build/solr-core/test/J0/temp/solr.handler.TestReplicationHandler_18324C37DAD052B8-001/solr-instance-003/./collection1/data/index.20160527022120775
   [junit4]   2> 877135 INFO  (qtp1898003583-5834) [    x:collection1] o.a.s.c.S.Request [collection1]  webapp=/solr path=/replication params={wait=true&masterUrl=http://127.0.0.1:43927/solr/collection1/replication&command=fetchindex} status=0 QTime=17
   [junit4]   2> 877138 INFO  (qtp1898003583-5836) [    x:collection1] o.a.s.c.S.Request [collection1]  webapp=/solr path=/select params={q=*:*&sort=id+desc&wt=javabin&version=2} hits=3 status=0 QTime=1
   [junit4]   2> 877139 INFO  (TEST-TestReplicationHandler.doTestRepeater-seed#[18324C37DAD052B8]) [    ] o.a.s.h.TestReplicationHandler Waited for 0ms and found 3 docs
   [junit4]   2> 877140 WARN  (explicit-fetchindex-cmd) [    x:collection1] o.a.s.h.IndexFetcher 'masterUrl' must be specified without the /replication suffix
   [junit4]   2> 877141 INFO  (qtp1898003583-5834) [    x:collection1] o.a.s.c.S.Request [collection1]  webapp=/solr path=/replication params={qt=/replication&wt=javabin&version=2&command=indexversion} status=0 QTime=0
   [junit4]   2> 877141 INFO  (explicit-fetchindex-cmd) [    x:collection1] o.a.s.h.IndexFetcher Master's generation: 2
   [junit4]   2> 877141 INFO  (explicit-fetchindex-cmd) [    x:collection1] o.a.s.h.IndexFetcher Slave's generation: 1
   [junit4]   2> 877141 INFO  (explicit-fetchindex-cmd) [    x:collection1] o.a.s.h.IndexFetcher Starting replication process
   [junit4]   2> 877143 INFO  (qtp1898003583-5830) [    x:collection1] o.a.s.c.S.Request [collection1]  webapp=/solr path=/replication params={generation=2&qt=/replication&wt=javabin&version=2&command=filelist} status=0 QTime=0
   [junit4]   2> 877144 INFO  (explicit-fetchindex-cmd) [    x:collection1] o.a.s.h.IndexFetcher Number of files in latest index in master: 4
   [junit4]   2> 877144 INFO  (explicit-fetchindex-cmd) [    x:collection1] o.a.s.c.CachingDirectoryFactory return new directory for /home/jenkins/workspace/Lucene-Solr-6.x-Linux/solr/build/solr-core/test/J0/temp/solr.handler.TestReplicationHandler_18324C37DAD052B8-001/solr-instance-002/./collection1/data/index.20160527022120797
   [junit4]   2> 877144 INFO  (explicit-fetchindex-cmd) [    x:collection1] o.a.s.u.DefaultSolrCoreState Rollback old IndexWriter... core=collection1
   [junit4]   2> 877144 INFO  (explicit-fetchindex-cmd) [    x:collection1] o.a.s.u.RandomMergePolicy RandomMergePolicy wrapping class org.apache.lucene.index.LogDocMergePolicy: [LogDocMergePolicy: minMergeSize=1000, mergeFactor=26, maxMergeSize=9223372036854775807, maxMergeSizeForForcedMerge=9223372036854775807, calibrateSizeByDeletes=true, maxMergeDocs=2147483647, maxCFSSegmentSizeMB=8.796093022207999E12, noCFSRatio=0.0]
   [junit4]   2> 877145 INFO  (explicit-fetchindex-cmd) [    x:collection1] o.a.s.c.SolrDeletionPolicy SolrDeletionPolicy.onInit: commits: num=1
   [junit4]   2> 	commit{dir=MockDirectoryWrapper(RAMDirectory@3e1f1e72 lockFactory=org.apache.lucene.store.SingleInstanceLockFactory@15c6346),segFN=segments_1,generation=1}
   [junit4]   2> 877145 INFO  (explicit-fetchindex-cmd) [    x:collection1] o.a.s.c.SolrDeletionPolicy newest commit generation = 1
   [junit4]   2> 877145 INFO  (explicit-fetchindex-cmd) [    x:collection1] o.a.s.u.DefaultSolrCoreState New IndexWriter is ready to be used.
   [junit4]   2> 877145 INFO  (explicit-fetchindex-cmd) [    x:collection1] o.a.s.c.SolrDeletionPolicy SolrDeletionPolicy.onCommit: commits: num=1
   [junit4]   2> 	commit{dir=MockDirectoryWrapper(RAMDirectory@3e1f1e72 lockFactory=org.apache.lucene.store.SingleInstanceLockFactory@15c6346),segFN=segments_1,generation=1}
   [junit4]   2> 877145 INFO  (explicit-fetchindex-cmd) [    x:collection1] o.a.s.c.SolrDeletionPolicy newest commit generation = 1
   [junit4]   2> 877145 INFO  (explicit-fetchindex-cmd) [    x:collection1] o.a.s.u.DefaultSolrCoreState Rollback old IndexWriter... core=collection1
   [junit4]   2> 877145 INFO  (explicit-fetchindex-cmd) [    x:collection1] o.a.s.h.IndexFetcher Starting download (fullCopy=false) to MockDirectoryWrapper(RAMDirectory@6cb092c3 lockFactory=org.apache.lucene.store.SingleInstanceLockFactory@5c53a562)
   [junit4]   2> 877147 INFO  (qtp1898003583-5836) [    x:collection1] o.a.s.c.S.Request [collection1]  webapp=/solr path=/replication params={generation=2&qt=/replication&file=_0.cfe&checksum=true&wt=filestream&command=filecontent} status=0 QTime=0
   [junit4]   2> 877149 INFO  (qtp1898003583-5831) [    x:collection1] o.a.s.c.S.Request [collection1]  webapp=/solr path=/replication params={generation=2&qt=/replication&file=_0.si&checksum=true&wt=filestream&command=filecontent} status=0 QTime=0
   [junit4]   2> 877152 INFO  (qtp1898003583-5834) [    x:collection1] o.a.s.c.S.Request [collection1]  webapp=/solr path=/replication params={generation=2&qt=/replication&file=_0.cfs&checksum=true&wt=filestream&command=filecontent} status=0 QTime=0
   [junit4]   2> 877154 INFO  (qtp1898003583-5830) [    x:collection1] o.a.s.c.S.Request [collection1]  webapp=/solr path=/replication params={generation=2&qt=/replication&file=segments_2&checksum=true&wt=filestream&command=filecontent} status=0 QTime=0
   [junit4]   2> 877155 INFO  (explicit-fetchindex-cmd) [    x:collection1] o.a.s.h.IndexFetcher Total time taken for download (fullCopy=false,bytesDownloaded=1952) : 0 secs (null bytes/sec) to MockDirectoryWrapper(RAMDirectory@6cb092c3 lockFactory=org.apache.lucene.store.SingleInstanceLockFactory@5c53a562)
   [junit4]   2> 877156 INFO  (explicit-fetchindex-cmd) [    x:collection1] o.a.s.u.RandomMergePolicy RandomMergePolicy wrapping class org.apache.lucene.index.LogDocMergePolicy: [LogDocMergePolicy: minMergeSize=1000, mergeFactor=26, maxMergeSize=9223372036854775807, maxMergeSizeForForcedMerge=9223372036854775807, calibrateSizeByDeletes=true, maxMergeDocs=2147483647, maxCFSSegmentSizeMB=8.796093022207999E12, noCFSRatio=0.839335662606978]
   [junit4]   2> 877156 INFO  (explicit-fetchindex-cmd) [    x:collection1] o.a.s.c.SolrDeletionPolicy SolrDeletionPolicy.onInit: commits: num=2
   [junit4]   2> 	commit{dir=MockDirectoryWrapper(RAMDirectory@3e1f1e72 lockFactory=org.apache.lucene.store.SingleInstanceLockFactory@15c6346),segFN=segments_1,generation=1}
   [junit4]   2> 	commit{dir=MockDirectoryWrapper(RAMDirectory@3e1f1e72 lockFactory=org.apache.lucene.store.SingleInstanceLockFactory@15c6346),segFN=segments_2,generation=2}
   [jun

[...truncated too long message...]

me/jenkins/workspace/Lucene-Solr-6.x-Linux/solr/build/solr-core/test/J0/temp/solr.handler.TestReplicationHandler_18324C37DAD052B8-001/solr-instance-029/./collection1/data
   [junit4]   2> 967586 INFO  (TEST-TestReplicationHandler.doTestReplicateAfterCoreReload-seed#[18324C37DAD052B8]) [    ] o.e.j.s.h.ContextHandler Stopped o.e.j.s.ServletContextHandler@3a87a59c{/solr,null,UNAVAILABLE}
   [junit4]   2> 967587 INFO  (TEST-TestReplicationHandler.doTestReplicateAfterCoreReload-seed#[18324C37DAD052B8]) [    ] o.e.j.s.ServerConnector Stopped ServerConnector@4c88649d{HTTP/1.1,[http/1.1]}{127.0.0.1:0}
   [junit4]   2> 967587 INFO  (TEST-TestReplicationHandler.doTestReplicateAfterCoreReload-seed#[18324C37DAD052B8]) [    ] o.a.s.c.CoreContainer Shutting down CoreContainer instance=1948134146
   [junit4]   2> 967587 INFO  (coreCloseExecutor-3567-thread-1) [    x:collection1] o.a.s.c.SolrCore [collection1]  CLOSING SolrCore org.apache.solr.core.SolrCore@57b3db5
   [junit4]   2> 967587 INFO  (coreCloseExecutor-3567-thread-1) [    x:collection1] o.a.s.u.DirectUpdateHandler2 closing DirectUpdateHandler2{commits=0,autocommits=0,soft autocommits=0,optimizes=0,rollbacks=0,expungeDeletes=0,docsPending=0,adds=0,deletesById=0,deletesByQuery=0,errors=0,cumulative_adds=0,cumulative_deletesById=0,cumulative_deletesByQuery=0,cumulative_errors=0}
   [junit4]   2> 967587 INFO  (coreCloseExecutor-3567-thread-1) [    x:collection1] o.a.s.u.SolrCoreState Closing SolrCoreState
   [junit4]   2> 967587 INFO  (coreCloseExecutor-3567-thread-1) [    x:collection1] o.a.s.u.DefaultSolrCoreState SolrCoreState ref count has reached 0 - closing IndexWriter
   [junit4]   2> 967587 INFO  (coreCloseExecutor-3567-thread-1) [    x:collection1] o.a.s.u.DefaultSolrCoreState closing IndexWriter with IndexWriterCloser
   [junit4]   2> 967587 INFO  (coreCloseExecutor-3567-thread-1) [    x:collection1] o.a.s.c.SolrCore [collection1] Closing main searcher on request.
   [junit4]   2> 967587 INFO  (coreCloseExecutor-3567-thread-1) [    x:collection1] o.a.s.c.CachingDirectoryFactory Closing MockDirectoryFactory - 2 directories currently being tracked
   [junit4]   2> 967587 INFO  (coreCloseExecutor-3567-thread-1) [    x:collection1] o.a.s.c.CachingDirectoryFactory looking to close /home/jenkins/workspace/Lucene-Solr-6.x-Linux/solr/build/solr-core/test/J0/temp/solr.handler.TestReplicationHandler_18324C37DAD052B8-001/solr-instance-030/./collection1/data/index [CachedDir<<refCount=0;path=/home/jenkins/workspace/Lucene-Solr-6.x-Linux/solr/build/solr-core/test/J0/temp/solr.handler.TestReplicationHandler_18324C37DAD052B8-001/solr-instance-030/./collection1/data/index;done=false>>]
   [junit4]   2> 967588 INFO  (coreCloseExecutor-3567-thread-1) [    x:collection1] o.a.s.c.CachingDirectoryFactory Closing directory, CoreContainer#isShutdown=true
   [junit4]   2> 967588 INFO  (coreCloseExecutor-3567-thread-1) [    x:collection1] o.a.s.c.CachingDirectoryFactory Closing directory: /home/jenkins/workspace/Lucene-Solr-6.x-Linux/solr/build/solr-core/test/J0/temp/solr.handler.TestReplicationHandler_18324C37DAD052B8-001/solr-instance-030/./collection1/data/index
   [junit4]   2> 967588 INFO  (coreCloseExecutor-3567-thread-1) [    x:collection1] o.a.s.c.CachingDirectoryFactory looking to close /home/jenkins/workspace/Lucene-Solr-6.x-Linux/solr/build/solr-core/test/J0/temp/solr.handler.TestReplicationHandler_18324C37DAD052B8-001/solr-instance-030/./collection1/data [CachedDir<<refCount=0;path=/home/jenkins/workspace/Lucene-Solr-6.x-Linux/solr/build/solr-core/test/J0/temp/solr.handler.TestReplicationHandler_18324C37DAD052B8-001/solr-instance-030/./collection1/data;done=false>>]
   [junit4]   2> 967588 INFO  (coreCloseExecutor-3567-thread-1) [    x:collection1] o.a.s.c.CachingDirectoryFactory Closing directory, CoreContainer#isShutdown=true
   [junit4]   2> 967588 INFO  (coreCloseExecutor-3567-thread-1) [    x:collection1] o.a.s.c.CachingDirectoryFactory Closing directory: /home/jenkins/workspace/Lucene-Solr-6.x-Linux/solr/build/solr-core/test/J0/temp/solr.handler.TestReplicationHandler_18324C37DAD052B8-001/solr-instance-030/./collection1/data
   [junit4]   2> 967588 INFO  (TEST-TestReplicationHandler.doTestReplicateAfterCoreReload-seed#[18324C37DAD052B8]) [    ] o.e.j.s.h.ContextHandler Stopped o.e.j.s.ServletContextHandler@575ab02{/solr,null,UNAVAILABLE}
   [junit4]   2> 967589 INFO  (SUITE-TestReplicationHandler-seed#[18324C37DAD052B8]-worker) [    ] o.a.s.SolrTestCaseJ4 ###deleteCore
   [junit4]   2> ObjectTracker found 1 object(s) that were not released!!! [NRTCachingDirectory]
   [junit4]   2> org.apache.solr.common.util.ObjectReleaseTracker$ObjectTrackerException
   [junit4]   2> 	at org.apache.solr.common.util.ObjectReleaseTracker.track(ObjectReleaseTracker.java:42)
   [junit4]   2> 	at org.apache.solr.core.CachingDirectoryFactory.get(CachingDirectoryFactory.java:347)
   [junit4]   2> 	at org.apache.solr.handler.IndexFetcher.fetchLatestIndex(IndexFetcher.java:367)
   [junit4]   2> 	at org.apache.solr.handler.IndexFetcher.fetchLatestIndex(IndexFetcher.java:251)
   [junit4]   2> 	at org.apache.solr.handler.ReplicationHandler.doFetch(ReplicationHandler.java:388)
   [junit4]   2> 	at org.apache.solr.handler.ReplicationHandler$1.run(ReplicationHandler.java:276)
   [junit4]   2> 
   [junit4]   2> NOTE: test params are: codec=Asserting(Lucene60), sim=RandomSimilarity(queryNorm=true,coord=crazy): {}, locale=fr-CH, timezone=CET
   [junit4]   2> NOTE: Linux 4.4.0-21-generic amd64/Oracle Corporation 1.8.0_92 (64-bit)/cpus=12,threads=1,free=258569808,total=518979584
   [junit4]   2> NOTE: All tests run in this JVM: [QueryEqualityTest, DateFieldTest, ChangedSchemaMergeTest, TestManagedStopFilterFactory, DisMaxRequestHandlerTest, TestCloudBackupRestore, TestHighlightDedupGrouping, AddBlockUpdateTest, BigEndianAscendingWordDeserializerTest, TestRandomFaceting, TestSolrQueryParserDefaultOperatorResource, TestPKIAuthenticationPlugin, EnumFieldTest, TestLRUCache, DocumentAnalysisRequestHandlerTest, TestFilteredDocIdSet, DistributedFacetPivotSmallAdvancedTest, TestHdfsUpdateLog, TestLazyCores, MultiThreadedOCPTest, TestSubQueryTransformer, AtomicUpdatesTest, CdcrVersionReplicationTest, TestHighFrequencyDictionaryFactory, TestAnalyzedSuggestions, TestCollationFieldDocValues, TestPivotHelperCode, TestTrieFacet, TestAtomicUpdateErrorCases, ConcurrentDeleteAndCreateCollectionTest, TestComplexPhraseQParserPlugin, TestSchemaManager, DocExpirationUpdateProcessorFactoryTest, TestBlendedInfixSuggestions, TestMiniSolrCloudClusterBase, TestOnReconnectListenerSupport, CurrencyFieldOpenExchangeTest, BasicAuthIntegrationTest, HdfsWriteToMultipleCollectionsTest, TestManagedResource, PreAnalyzedUpdateProcessorTest, TestFoldingMultitermQuery, EchoParamsTest, TestFieldTypeResource, TestStressLucene, TestDistribDocBasedVersion, UUIDFieldTest, BlockJoinFacetSimpleTest, ForceLeaderTest, PeerSyncTest, TestReqParamsAPI, XsltUpdateRequestHandlerTest, TestOmitPositions, JsonLoaderTest, TestScoreJoinQPScore, TestRandomCollapseQParserPlugin, TriLevelCompositeIdRoutingTest, BJQParserTest, CopyFieldTest, CdcrReplicationDistributedZkTest, IndexSchemaTest, SolrRequestParserTest, DeleteLastCustomShardedReplicaTest, RequiredFieldsTest, TestLMDirichletSimilarityFactory, TestSolrFieldCacheMBean, TestRemoteStreaming, TestPseudoReturnFields, TestBadConfig, HdfsBasicDistributedZkTest, PingRequestHandlerTest, TestExactSharedStatsCache, TestSimpleQParserPlugin, SyncSliceTest, TestComponentsName, TestInfoStreamLogging, OverseerTaskQueueTest, TestGraphMLResponseWriter, DistribJoinFromCollectionTest, TestBlobHandler, TestValueSourceCache, TestLuceneMatchVersion, HighlighterMaxOffsetTest, DistributedExpandComponentTest, PolyFieldTest, TestRTimerTree, DataDrivenBlockJoinTest, TestBulkSchemaAPI, URLClassifyProcessorTest, AsyncCallRequestStatusResponseTest, ExitableDirectoryReaderTest, DistributedQueryElevationComponentTest, TestReplicationHandler]
   [junit4]   2> NOTE: reproduce with: ant test  -Dtestcase=TestReplicationHandler -Dtests.seed=18324C37DAD052B8 -Dtests.multiplier=3 -Dtests.slow=true -Dtests.locale=fr-CH -Dtests.timezone=CET -Dtests.asserts=true -Dtests.file.encoding=ISO-8859-1
   [junit4] ERROR   0.00s J0 | TestReplicationHandler (suite) <<<
   [junit4]    > Throwable #1: java.lang.AssertionError: ObjectTracker found 1 object(s) that were not released!!! [NRTCachingDirectory]
   [junit4]    > 	at __randomizedtesting.SeedInfo.seed([18324C37DAD052B8]:0)
   [junit4]    > 	at org.apache.solr.SolrTestCaseJ4.afterClass(SolrTestCaseJ4.java:256)
   [junit4]    > 	at java.lang.Thread.run(Thread.java:745)
   [junit4] Completed [246/599 (1!)] on J0 in 92.62s, 15 tests, 1 failure, 1 skipped <<< FAILURES!

[...truncated 1160 lines...]
BUILD FAILED
/home/jenkins/workspace/Lucene-Solr-6.x-Linux/build.xml:740: The following error occurred while executing this line:
/home/jenkins/workspace/Lucene-Solr-6.x-Linux/build.xml:684: The following error occurred while executing this line:
/home/jenkins/workspace/Lucene-Solr-6.x-Linux/build.xml:59: The following error occurred while executing this line:
/home/jenkins/workspace/Lucene-Solr-6.x-Linux/solr/build.xml:233: The following error occurred while executing this line:
/home/jenkins/workspace/Lucene-Solr-6.x-Linux/solr/common-build.xml:531: The following error occurred while executing this line:
/home/jenkins/workspace/Lucene-Solr-6.x-Linux/lucene/common-build.xml:1427: The following error occurred while executing this line:
/home/jenkins/workspace/Lucene-Solr-6.x-Linux/lucene/common-build.xml:984: There were test failures: 599 suites (10 ignored), 2441 tests, 1 suite-level error, 115 ignored (71 assumptions) [seed: 18324C37DAD052B8]

Total time: 70 minutes 50 seconds
Build step 'Invoke Ant' marked build as failure
Archiving artifacts
[WARNINGS] Skipping publisher since build result is FAILURE
Recording test results
Email was triggered for: Failure - Any
Sending email for trigger: Failure - Any



[JENKINS-EA] Lucene-Solr-6.x-Linux (32bit/jdk-9-ea+119) - Build # 747 - Still Failing!

Posted by Policeman Jenkins Server <je...@thetaphi.de>.
Build: http://jenkins.thetaphi.de/job/Lucene-Solr-6.x-Linux/747/
Java: 32bit/jdk-9-ea+119 -server -XX:+UseSerialGC

1 tests failed.
FAILED:  org.apache.solr.handler.TestReqParamsAPI.test

Error Message:
Could not get expected value  'CY val' for path 'response/params/y/c' full output: {   "responseHeader":{     "status":0,     "QTime":0},   "response":{     "znodeVersion":0,     "params":{"x":{         "a":"A val",         "b":"B val",         "":{"v":0}}}}},  from server:  http://127.0.0.1:38829/collection1

Stack Trace:
java.lang.AssertionError: Could not get expected value  'CY val' for path 'response/params/y/c' full output: {
  "responseHeader":{
    "status":0,
    "QTime":0},
  "response":{
    "znodeVersion":0,
    "params":{"x":{
        "a":"A val",
        "b":"B val",
        "":{"v":0}}}}},  from server:  http://127.0.0.1:38829/collection1
	at __randomizedtesting.SeedInfo.seed([819FD2FB7BA86F:88D5A0085587C597]:0)
	at org.junit.Assert.fail(Assert.java:93)
	at org.junit.Assert.assertTrue(Assert.java:43)
	at org.apache.solr.core.TestSolrConfigHandler.testForResponseElement(TestSolrConfigHandler.java:457)
	at org.apache.solr.handler.TestReqParamsAPI.testReqParams(TestReqParamsAPI.java:160)
	at org.apache.solr.handler.TestReqParamsAPI.test(TestReqParamsAPI.java:62)
	at jdk.internal.reflect.NativeMethodAccessorImpl.invoke0(java.base@9-ea/Native Method)
	at jdk.internal.reflect.NativeMethodAccessorImpl.invoke(java.base@9-ea/NativeMethodAccessorImpl.java:62)
	at jdk.internal.reflect.DelegatingMethodAccessorImpl.invoke(java.base@9-ea/DelegatingMethodAccessorImpl.java:43)
	at java.lang.reflect.Method.invoke(java.base@9-ea/Method.java:531)
	at com.carrotsearch.randomizedtesting.RandomizedRunner.invoke(RandomizedRunner.java:1764)
	at com.carrotsearch.randomizedtesting.RandomizedRunner$8.evaluate(RandomizedRunner.java:871)
	at com.carrotsearch.randomizedtesting.RandomizedRunner$9.evaluate(RandomizedRunner.java:907)
	at com.carrotsearch.randomizedtesting.RandomizedRunner$10.evaluate(RandomizedRunner.java:921)
	at org.apache.solr.BaseDistributedSearchTestCase$ShardsRepeatRule$ShardsFixedStatement.callStatement(BaseDistributedSearchTestCase.java:992)
	at org.apache.solr.BaseDistributedSearchTestCase$ShardsRepeatRule$ShardsStatement.evaluate(BaseDistributedSearchTestCase.java:967)
	at com.carrotsearch.randomizedtesting.rules.SystemPropertiesRestoreRule$1.evaluate(SystemPropertiesRestoreRule.java:57)
	at org.apache.lucene.util.TestRuleSetupTeardownChained$1.evaluate(TestRuleSetupTeardownChained.java:49)
	at org.apache.lucene.util.AbstractBeforeAfterRule$1.evaluate(AbstractBeforeAfterRule.java:45)
	at org.apache.lucene.util.TestRuleThreadAndTestName$1.evaluate(TestRuleThreadAndTestName.java:48)
	at org.apache.lucene.util.TestRuleIgnoreAfterMaxFailures$1.evaluate(TestRuleIgnoreAfterMaxFailures.java:64)
	at org.apache.lucene.util.TestRuleMarkFailure$1.evaluate(TestRuleMarkFailure.java:47)
	at com.carrotsearch.randomizedtesting.rules.StatementAdapter.evaluate(StatementAdapter.java:36)
	at com.carrotsearch.randomizedtesting.ThreadLeakControl$StatementRunner.run(ThreadLeakControl.java:367)
	at com.carrotsearch.randomizedtesting.ThreadLeakControl.forkTimeoutingTask(ThreadLeakControl.java:809)
	at com.carrotsearch.randomizedtesting.ThreadLeakControl$3.evaluate(ThreadLeakControl.java:460)
	at com.carrotsearch.randomizedtesting.RandomizedRunner.runSingleTest(RandomizedRunner.java:880)
	at com.carrotsearch.randomizedtesting.RandomizedRunner$5.evaluate(RandomizedRunner.java:781)
	at com.carrotsearch.randomizedtesting.RandomizedRunner$6.evaluate(RandomizedRunner.java:816)
	at com.carrotsearch.randomizedtesting.RandomizedRunner$7.evaluate(RandomizedRunner.java:827)
	at com.carrotsearch.randomizedtesting.rules.StatementAdapter.evaluate(StatementAdapter.java:36)
	at com.carrotsearch.randomizedtesting.rules.SystemPropertiesRestoreRule$1.evaluate(SystemPropertiesRestoreRule.java:57)
	at org.apache.lucene.util.AbstractBeforeAfterRule$1.evaluate(AbstractBeforeAfterRule.java:45)
	at com.carrotsearch.randomizedtesting.rules.StatementAdapter.evaluate(StatementAdapter.java:36)
	at org.apache.lucene.util.TestRuleStoreClassName$1.evaluate(TestRuleStoreClassName.java:41)
	at com.carrotsearch.randomizedtesting.rules.NoShadowingOrOverridesOnMethodsRule$1.evaluate(NoShadowingOrOverridesOnMethodsRule.java:40)
	at com.carrotsearch.randomizedtesting.rules.NoShadowingOrOverridesOnMethodsRule$1.evaluate(NoShadowingOrOverridesOnMethodsRule.java:40)
	at com.carrotsearch.randomizedtesting.rules.StatementAdapter.evaluate(StatementAdapter.java:36)
	at com.carrotsearch.randomizedtesting.rules.StatementAdapter.evaluate(StatementAdapter.java:36)
	at com.carrotsearch.randomizedtesting.rules.StatementAdapter.evaluate(StatementAdapter.java:36)
	at org.apache.lucene.util.TestRuleAssertionsRequired$1.evaluate(TestRuleAssertionsRequired.java:53)
	at org.apache.lucene.util.TestRuleMarkFailure$1.evaluate(TestRuleMarkFailure.java:47)
	at org.apache.lucene.util.TestRuleIgnoreAfterMaxFailures$1.evaluate(TestRuleIgnoreAfterMaxFailures.java:64)
	at org.apache.lucene.util.TestRuleIgnoreTestSuites$1.evaluate(TestRuleIgnoreTestSuites.java:54)
	at com.carrotsearch.randomizedtesting.rules.StatementAdapter.evaluate(StatementAdapter.java:36)
	at com.carrotsearch.randomizedtesting.ThreadLeakControl$StatementRunner.run(ThreadLeakControl.java:367)
	at java.lang.Thread.run(java.base@9-ea/Thread.java:804)




Build Log:
[...truncated 10624 lines...]
   [junit4] Suite: org.apache.solr.handler.TestReqParamsAPI
   [junit4]   2> Creating dataDir: /home/jenkins/workspace/Lucene-Solr-6.x-Linux/solr/build/solr-core/test/J0/temp/solr.handler.TestReqParamsAPI_819FD2FB7BA86F-001/init-core-data-001
   [junit4]   2> 188701 INFO  (SUITE-TestReqParamsAPI-seed#[819FD2FB7BA86F]-worker) [    ] o.a.s.SolrTestCaseJ4 Randomized ssl (false) and clientAuth (false)
   [junit4]   2> 188702 INFO  (SUITE-TestReqParamsAPI-seed#[819FD2FB7BA86F]-worker) [    ] o.a.s.BaseDistributedSearchTestCase Setting hostContext system property: /
   [junit4]   2> 188703 INFO  (TEST-TestReqParamsAPI.test-seed#[819FD2FB7BA86F]) [    ] o.a.s.c.ZkTestServer STARTING ZK TEST SERVER
   [junit4]   2> 188703 INFO  (Thread-601) [    ] o.a.s.c.ZkTestServer client port:0.0.0.0/0.0.0.0:0
   [junit4]   2> 188703 INFO  (Thread-601) [    ] o.a.s.c.ZkTestServer Starting server
   [junit4]   2> 188803 INFO  (TEST-TestReqParamsAPI.test-seed#[819FD2FB7BA86F]) [    ] o.a.s.c.ZkTestServer start zk server on port:46240
   [junit4]   2> 188804 INFO  (TEST-TestReqParamsAPI.test-seed#[819FD2FB7BA86F]) [    ] o.a.s.c.c.SolrZkClient Using default ZkCredentialsProvider
   [junit4]   2> 188804 INFO  (TEST-TestReqParamsAPI.test-seed#[819FD2FB7BA86F]) [    ] o.a.s.c.c.ConnectionManager Waiting for client to connect to ZooKeeper
   [junit4]   2> 188805 INFO  (zkCallback-493-thread-1) [    ] o.a.s.c.c.ConnectionManager Watcher org.apache.solr.common.cloud.ConnectionManager@11086bd name:ZooKeeperConnection Watcher:127.0.0.1:46240 got event WatchedEvent state:SyncConnected type:None path:null path:null type:None
   [junit4]   2> 188805 INFO  (TEST-TestReqParamsAPI.test-seed#[819FD2FB7BA86F]) [    ] o.a.s.c.c.ConnectionManager Client is connected to ZooKeeper
   [junit4]   2> 188806 INFO  (TEST-TestReqParamsAPI.test-seed#[819FD2FB7BA86F]) [    ] o.a.s.c.c.SolrZkClient Using default ZkACLProvider
   [junit4]   2> 188806 INFO  (TEST-TestReqParamsAPI.test-seed#[819FD2FB7BA86F]) [    ] o.a.s.c.c.SolrZkClient makePath: /solr
   [junit4]   2> 188807 INFO  (TEST-TestReqParamsAPI.test-seed#[819FD2FB7BA86F]) [    ] o.a.s.c.c.SolrZkClient Using default ZkCredentialsProvider
   [junit4]   2> 188807 INFO  (TEST-TestReqParamsAPI.test-seed#[819FD2FB7BA86F]) [    ] o.a.s.c.c.ConnectionManager Waiting for client to connect to ZooKeeper
   [junit4]   2> 188808 INFO  (zkCallback-494-thread-1) [    ] o.a.s.c.c.ConnectionManager Watcher org.apache.solr.common.cloud.ConnectionManager@a4b5c1 name:ZooKeeperConnection Watcher:127.0.0.1:46240/solr got event WatchedEvent state:SyncConnected type:None path:null path:null type:None
   [junit4]   2> 188808 INFO  (TEST-TestReqParamsAPI.test-seed#[819FD2FB7BA86F]) [    ] o.a.s.c.c.ConnectionManager Client is connected to ZooKeeper
   [junit4]   2> 188808 INFO  (TEST-TestReqParamsAPI.test-seed#[819FD2FB7BA86F]) [    ] o.a.s.c.c.SolrZkClient Using default ZkACLProvider
   [junit4]   2> 188808 INFO  (TEST-TestReqParamsAPI.test-seed#[819FD2FB7BA86F]) [    ] o.a.s.c.c.SolrZkClient makePath: /collections/collection1
   [junit4]   2> 188809 INFO  (TEST-TestReqParamsAPI.test-seed#[819FD2FB7BA86F]) [    ] o.a.s.c.c.SolrZkClient makePath: /collections/collection1/shards
   [junit4]   2> 188809 INFO  (TEST-TestReqParamsAPI.test-seed#[819FD2FB7BA86F]) [    ] o.a.s.c.c.SolrZkClient makePath: /collections/control_collection
   [junit4]   2> 188810 INFO  (TEST-TestReqParamsAPI.test-seed#[819FD2FB7BA86F]) [    ] o.a.s.c.c.SolrZkClient makePath: /collections/control_collection/shards
   [junit4]   2> 188810 INFO  (TEST-TestReqParamsAPI.test-seed#[819FD2FB7BA86F]) [    ] o.a.s.c.AbstractZkTestCase put /home/jenkins/workspace/Lucene-Solr-6.x-Linux/solr/core/src/test-files/solr/collection1/conf/solrconfig-tlog.xml to /configs/conf1/solrconfig.xml
   [junit4]   2> 188811 INFO  (TEST-TestReqParamsAPI.test-seed#[819FD2FB7BA86F]) [    ] o.a.s.c.c.SolrZkClient makePath: /configs/conf1/solrconfig.xml
   [junit4]   2> 188811 INFO  (TEST-TestReqParamsAPI.test-seed#[819FD2FB7BA86F]) [    ] o.a.s.c.AbstractZkTestCase put /home/jenkins/workspace/Lucene-Solr-6.x-Linux/solr/core/src/test-files/solr/collection1/conf/schema.xml to /configs/conf1/schema.xml
   [junit4]   2> 188811 INFO  (TEST-TestReqParamsAPI.test-seed#[819FD2FB7BA86F]) [    ] o.a.s.c.c.SolrZkClient makePath: /configs/conf1/schema.xml
   [junit4]   2> 188812 INFO  (TEST-TestReqParamsAPI.test-seed#[819FD2FB7BA86F]) [    ] o.a.s.c.AbstractZkTestCase put /home/jenkins/workspace/Lucene-Solr-6.x-Linux/solr/core/src/test-files/solr/collection1/conf/solrconfig.snippet.randomindexconfig.xml to /configs/conf1/solrconfig.snippet.randomindexconfig.xml
   [junit4]   2> 188812 INFO  (TEST-TestReqParamsAPI.test-seed#[819FD2FB7BA86F]) [    ] o.a.s.c.c.SolrZkClient makePath: /configs/conf1/solrconfig.snippet.randomindexconfig.xml
   [junit4]   2> 188813 INFO  (TEST-TestReqParamsAPI.test-seed#[819FD2FB7BA86F]) [    ] o.a.s.c.AbstractZkTestCase put /home/jenkins/workspace/Lucene-Solr-6.x-Linux/solr/core/src/test-files/solr/collection1/conf/stopwords.txt to /configs/conf1/stopwords.txt
   [junit4]   2> 188813 INFO  (TEST-TestReqParamsAPI.test-seed#[819FD2FB7BA86F]) [    ] o.a.s.c.c.SolrZkClient makePath: /configs/conf1/stopwords.txt
   [junit4]   2> 188814 INFO  (TEST-TestReqParamsAPI.test-seed#[819FD2FB7BA86F]) [    ] o.a.s.c.AbstractZkTestCase put /home/jenkins/workspace/Lucene-Solr-6.x-Linux/solr/core/src/test-files/solr/collection1/conf/protwords.txt to /configs/conf1/protwords.txt
   [junit4]   2> 188814 INFO  (TEST-TestReqParamsAPI.test-seed#[819FD2FB7BA86F]) [    ] o.a.s.c.c.SolrZkClient makePath: /configs/conf1/protwords.txt
   [junit4]   2> 188815 INFO  (TEST-TestReqParamsAPI.test-seed#[819FD2FB7BA86F]) [    ] o.a.s.c.AbstractZkTestCase put /home/jenkins/workspace/Lucene-Solr-6.x-Linux/solr/core/src/test-files/solr/collection1/conf/currency.xml to /configs/conf1/currency.xml
   [junit4]   2> 188815 INFO  (TEST-TestReqParamsAPI.test-seed#[819FD2FB7BA86F]) [    ] o.a.s.c.c.SolrZkClient makePath: /configs/conf1/currency.xml
   [junit4]   2> 188816 INFO  (TEST-TestReqParamsAPI.test-seed#[819FD2FB7BA86F]) [    ] o.a.s.c.AbstractZkTestCase put /home/jenkins/workspace/Lucene-Solr-6.x-Linux/solr/core/src/test-files/solr/collection1/conf/enumsConfig.xml to /configs/conf1/enumsConfig.xml
   [junit4]   2> 188816 INFO  (TEST-TestReqParamsAPI.test-seed#[819FD2FB7BA86F]) [    ] o.a.s.c.c.SolrZkClient makePath: /configs/conf1/enumsConfig.xml
   [junit4]   2> 188816 INFO  (TEST-TestReqParamsAPI.test-seed#[819FD2FB7BA86F]) [    ] o.a.s.c.AbstractZkTestCase put /home/jenkins/workspace/Lucene-Solr-6.x-Linux/solr/core/src/test-files/solr/collection1/conf/open-exchange-rates.json to /configs/conf1/open-exchange-rates.json
   [junit4]   2> 188816 INFO  (TEST-TestReqParamsAPI.test-seed#[819FD2FB7BA86F]) [    ] o.a.s.c.c.SolrZkClient makePath: /configs/conf1/open-exchange-rates.json
   [junit4]   2> 188817 INFO  (TEST-TestReqParamsAPI.test-seed#[819FD2FB7BA86F]) [    ] o.a.s.c.AbstractZkTestCase put /home/jenkins/workspace/Lucene-Solr-6.x-Linux/solr/core/src/test-files/solr/collection1/conf/mapping-ISOLatin1Accent.txt to /configs/conf1/mapping-ISOLatin1Accent.txt
   [junit4]   2> 188817 INFO  (TEST-TestReqParamsAPI.test-seed#[819FD2FB7BA86F]) [    ] o.a.s.c.c.SolrZkClient makePath: /configs/conf1/mapping-ISOLatin1Accent.txt
   [junit4]   2> 188817 INFO  (TEST-TestReqParamsAPI.test-seed#[819FD2FB7BA86F]) [    ] o.a.s.c.AbstractZkTestCase put /home/jenkins/workspace/Lucene-Solr-6.x-Linux/solr/core/src/test-files/solr/collection1/conf/old_synonyms.txt to /configs/conf1/old_synonyms.txt
   [junit4]   2> 188817 INFO  (TEST-TestReqParamsAPI.test-seed#[819FD2FB7BA86F]) [    ] o.a.s.c.c.SolrZkClient makePath: /configs/conf1/old_synonyms.txt
   [junit4]   2> 188818 INFO  (TEST-TestReqParamsAPI.test-seed#[819FD2FB7BA86F]) [    ] o.a.s.c.AbstractZkTestCase put /home/jenkins/workspace/Lucene-Solr-6.x-Linux/solr/core/src/test-files/solr/collection1/conf/synonyms.txt to /configs/conf1/synonyms.txt
   [junit4]   2> 188818 INFO  (TEST-TestReqParamsAPI.test-seed#[819FD2FB7BA86F]) [    ] o.a.s.c.c.SolrZkClient makePath: /configs/conf1/synonyms.txt
   [junit4]   2> 188878 INFO  (TEST-TestReqParamsAPI.test-seed#[819FD2FB7BA86F]) [    ] o.a.s.SolrTestCaseJ4 Writing core.properties file to /home/jenkins/workspace/Lucene-Solr-6.x-Linux/solr/build/solr-core/test/J0/temp/solr.handler.TestReqParamsAPI_819FD2FB7BA86F-001/control-001/cores/collection1
   [junit4]   2> 188879 INFO  (TEST-TestReqParamsAPI.test-seed#[819FD2FB7BA86F]) [    ] o.e.j.s.Server jetty-9.3.8.v20160314
   [junit4]   2> 188880 INFO  (TEST-TestReqParamsAPI.test-seed#[819FD2FB7BA86F]) [    ] o.e.j.s.h.ContextHandler Started o.e.j.s.ServletContextHandler@16843ab{/,null,AVAILABLE}
   [junit4]   2> 188882 INFO  (TEST-TestReqParamsAPI.test-seed#[819FD2FB7BA86F]) [    ] o.e.j.s.ServerConnector Started ServerConnector@18274d7{HTTP/1.1,[http/1.1]}{127.0.0.1:42194}
   [junit4]   2> 188882 INFO  (TEST-TestReqParamsAPI.test-seed#[819FD2FB7BA86F]) [    ] o.e.j.s.Server Started @190675ms
   [junit4]   2> 188882 INFO  (TEST-TestReqParamsAPI.test-seed#[819FD2FB7BA86F]) [    ] o.a.s.c.s.e.JettySolrRunner Jetty properties: {solr.data.dir=/home/jenkins/workspace/Lucene-Solr-6.x-Linux/solr/build/solr-core/test/J0/temp/solr.handler.TestReqParamsAPI_819FD2FB7BA86F-001/tempDir-001/control/data, hostContext=/, hostPort=42194, coreRootDirectory=/home/jenkins/workspace/Lucene-Solr-6.x-Linux/solr/build/solr-core/test/J0/../../../../../../../../../home/jenkins/workspace/Lucene-Solr-6.x-Linux/solr/build/solr-core/test/J0/temp/solr.handler.TestReqParamsAPI_819FD2FB7BA86F-001/control-001/cores}
   [junit4]   2> 188882 INFO  (TEST-TestReqParamsAPI.test-seed#[819FD2FB7BA86F]) [    ] o.a.s.s.SolrDispatchFilter SolrDispatchFilter.init(): jdk.internal.loader.ClassLoaders$AppClassLoader@53fd30
   [junit4]   2> 188883 INFO  (TEST-TestReqParamsAPI.test-seed#[819FD2FB7BA86F]) [    ] o.a.s.c.SolrResourceLoader new SolrResourceLoader for directory: '/home/jenkins/workspace/Lucene-Solr-6.x-Linux/solr/build/solr-core/test/J0/temp/solr.handler.TestReqParamsAPI_819FD2FB7BA86F-001/control-001'
   [junit4]   2> 188883 INFO  (TEST-TestReqParamsAPI.test-seed#[819FD2FB7BA86F]) [    ] o.a.s.c.SolrResourceLoader JNDI not configured for solr (NoInitialContextEx)
   [junit4]   2> 188883 INFO  (TEST-TestReqParamsAPI.test-seed#[819FD2FB7BA86F]) [    ] o.a.s.c.SolrResourceLoader solr home defaulted to 'solr/' (could not find system property or JNDI)
   [junit4]   2> 188883 INFO  (TEST-TestReqParamsAPI.test-seed#[819FD2FB7BA86F]) [    ] o.a.s.c.c.SolrZkClient Using default ZkCredentialsProvider
   [junit4]   2> 188883 INFO  (TEST-TestReqParamsAPI.test-seed#[819FD2FB7BA86F]) [    ] o.a.s.c.c.ConnectionManager Waiting for client to connect to ZooKeeper
   [junit4]   2> 188884 INFO  (zkCallback-495-thread-1) [    ] o.a.s.c.c.ConnectionManager Watcher org.apache.solr.common.cloud.ConnectionManager@d234c0 name:ZooKeeperConnection Watcher:127.0.0.1:46240/solr got event WatchedEvent state:SyncConnected type:None path:null path:null type:None
   [junit4]   2> 188884 INFO  (TEST-TestReqParamsAPI.test-seed#[819FD2FB7BA86F]) [    ] o.a.s.c.c.ConnectionManager Client is connected to ZooKeeper
   [junit4]   2> 188884 INFO  (TEST-TestReqParamsAPI.test-seed#[819FD2FB7BA86F]) [    ] o.a.s.c.c.SolrZkClient Using default ZkACLProvider
   [junit4]   2> 188885 INFO  (TEST-TestReqParamsAPI.test-seed#[819FD2FB7BA86F]) [    ] o.a.s.s.SolrDispatchFilter Loading solr.xml from SolrHome (not found in ZooKeeper)
   [junit4]   2> 188885 INFO  (TEST-TestReqParamsAPI.test-seed#[819FD2FB7BA86F]) [    ] o.a.s.c.SolrXmlConfig Loading container configuration from /home/jenkins/workspace/Lucene-Solr-6.x-Linux/solr/build/solr-core/test/J0/temp/solr.handler.TestReqParamsAPI_819FD2FB7BA86F-001/control-001/solr.xml
   [junit4]   2> 188896 INFO  (TEST-TestReqParamsAPI.test-seed#[819FD2FB7BA86F]) [    ] o.a.s.c.CorePropertiesLocator Config-defined core root directory: /home/jenkins/workspace/Lucene-Solr-6.x-Linux/solr/build/solr-core/test/J0/../../../../../../../../../home/jenkins/workspace/Lucene-Solr-6.x-Linux/solr/build/solr-core/test/J0/temp/solr.handler.TestReqParamsAPI_819FD2FB7BA86F-001/control-001/cores
   [junit4]   2> 188896 INFO  (TEST-TestReqParamsAPI.test-seed#[819FD2FB7BA86F]) [    ] o.a.s.c.CoreContainer New CoreContainer 30044972
   [junit4]   2> 188896 INFO  (TEST-TestReqParamsAPI.test-seed#[819FD2FB7BA86F]) [    ] o.a.s.c.CoreContainer Loading cores into CoreContainer [instanceDir=/home/jenkins/workspace/Lucene-Solr-6.x-Linux/solr/build/solr-core/test/J0/temp/solr.handler.TestReqParamsAPI_819FD2FB7BA86F-001/control-001]
   [junit4]   2> 188896 WARN  (TEST-TestReqParamsAPI.test-seed#[819FD2FB7BA86F]) [    ] o.a.s.c.CoreContainer Couldn't add files from /home/jenkins/workspace/Lucene-Solr-6.x-Linux/solr/build/solr-core/test/J0/temp/solr.handler.TestReqParamsAPI_819FD2FB7BA86F-001/control-001/lib to classpath: /home/jenkins/workspace/Lucene-Solr-6.x-Linux/solr/build/solr-core/test/J0/temp/solr.handler.TestReqParamsAPI_819FD2FB7BA86F-001/control-001/lib
   [junit4]   2> 188896 INFO  (TEST-TestReqParamsAPI.test-seed#[819FD2FB7BA86F]) [    ] o.a.s.h.c.HttpShardHandlerFactory created with socketTimeout : 90000,urlScheme : ,connTimeout : 15000,maxConnectionsPerHost : 20,maxConnections : 10000,corePoolSize : 0,maximumPoolSize : 2147483647,maxThreadIdleTime : 5,sizeOfQueue : -1,fairnessPolicy : false,useRetries : false,
   [junit4]   2> 188897 INFO  (TEST-TestReqParamsAPI.test-seed#[819FD2FB7BA86F]) [    ] o.a.s.u.UpdateShardHandler Creating UpdateShardHandler HTTP client with params: socketTimeout=340000&connTimeout=45000&retry=true
   [junit4]   2> 188898 INFO  (TEST-TestReqParamsAPI.test-seed#[819FD2FB7BA86F]) [    ] o.a.s.l.LogWatcher SLF4J impl is org.slf4j.impl.Log4jLoggerFactory
   [junit4]   2> 188898 INFO  (TEST-TestReqParamsAPI.test-seed#[819FD2FB7BA86F]) [    ] o.a.s.l.LogWatcher Registering Log Listener [Log4j (org.slf4j.impl.Log4jLoggerFactory)]
   [junit4]   2> 188898 INFO  (TEST-TestReqParamsAPI.test-seed#[819FD2FB7BA86F]) [    ] o.a.s.c.ZkContainer Zookeeper client=127.0.0.1:46240/solr
   [junit4]   2> 188898 INFO  (TEST-TestReqParamsAPI.test-seed#[819FD2FB7BA86F]) [    ] o.a.s.c.ZkController zkHost includes chroot
   [junit4]   2> 188898 INFO  (TEST-TestReqParamsAPI.test-seed#[819FD2FB7BA86F]) [    ] o.a.s.c.c.SolrZkClient Using default ZkCredentialsProvider
   [junit4]   2> 188898 INFO  (TEST-TestReqParamsAPI.test-seed#[819FD2FB7BA86F]) [    ] o.a.s.c.c.ConnectionManager Waiting for client to connect to ZooKeeper
   [junit4]   2> 188900 INFO  (zkCallback-498-thread-1) [    ] o.a.s.c.c.ConnectionManager Watcher org.apache.solr.common.cloud.ConnectionManager@1bf6251 name:ZooKeeperConnection Watcher:127.0.0.1:46240 got event WatchedEvent state:SyncConnected type:None path:null path:null type:None
   [junit4]   2> 188900 INFO  (TEST-TestReqParamsAPI.test-seed#[819FD2FB7BA86F]) [    ] o.a.s.c.c.ConnectionManager Client is connected to ZooKeeper
   [junit4]   2> 188900 INFO  (TEST-TestReqParamsAPI.test-seed#[819FD2FB7BA86F]) [    ] o.a.s.c.c.SolrZkClient Using default ZkACLProvider
   [junit4]   2> 188901 INFO  (TEST-TestReqParamsAPI.test-seed#[819FD2FB7BA86F]) [    ] o.a.s.c.ZkController Added new OnReconnect listener org.apache.solr.cloud.ZkController$$Lambda$194/3488229@1966994
   [junit4]   2> 188901 INFO  (TEST-TestReqParamsAPI.test-seed#[819FD2FB7BA86F]) [    ] o.a.s.c.c.ConnectionManager Waiting for client to connect to ZooKeeper
   [junit4]   2> 188902 INFO  (zkCallback-499-thread-1) [    ] o.a.s.c.c.ConnectionManager Watcher org.apache.solr.common.cloud.ConnectionManager@13a2a19 name:ZooKeeperConnection Watcher:127.0.0.1:46240/solr got event WatchedEvent state:SyncConnected type:None path:null path:null type:None
   [junit4]   2> 188902 INFO  (TEST-TestReqParamsAPI.test-seed#[819FD2FB7BA86F]) [    ] o.a.s.c.c.ConnectionManager Client is connected to ZooKeeper
   [junit4]   2> 188903 INFO  (TEST-TestReqParamsAPI.test-seed#[819FD2FB7BA86F]) [    ] o.a.s.c.c.SolrZkClient makePath: /overseer/queue
   [junit4]   2> 188903 INFO  (TEST-TestReqParamsAPI.test-seed#[819FD2FB7BA86F]) [    ] o.a.s.c.c.SolrZkClient makePath: /overseer/collection-queue-work
   [junit4]   2> 188904 INFO  (TEST-TestReqParamsAPI.test-seed#[819FD2FB7BA86F]) [    ] o.a.s.c.c.SolrZkClient makePath: /overseer/collection-map-running
   [junit4]   2> 188905 INFO  (TEST-TestReqParamsAPI.test-seed#[819FD2FB7BA86F]) [    ] o.a.s.c.c.SolrZkClient makePath: /overseer/collection-map-completed
   [junit4]   2> 188905 INFO  (TEST-TestReqParamsAPI.test-seed#[819FD2FB7BA86F]) [    ] o.a.s.c.c.SolrZkClient makePath: /overseer/collection-map-failure
   [junit4]   2> 188905 INFO  (TEST-TestReqParamsAPI.test-seed#[819FD2FB7BA86F]) [    ] o.a.s.c.c.SolrZkClient makePath: /live_nodes
   [junit4]   2> 188906 INFO  (TEST-TestReqParamsAPI.test-seed#[819FD2FB7BA86F]) [    ] o.a.s.c.c.SolrZkClient makePath: /aliases.json
   [junit4]   2> 188906 INFO  (TEST-TestReqParamsAPI.test-seed#[819FD2FB7BA86F]) [    ] o.a.s.c.c.SolrZkClient makePath: /clusterstate.json
   [junit4]   2> 188907 INFO  (TEST-TestReqParamsAPI.test-seed#[819FD2FB7BA86F]) [    ] o.a.s.c.c.SolrZkClient makePath: /security.json
   [junit4]   2> 188907 INFO  (TEST-TestReqParamsAPI.test-seed#[819FD2FB7BA86F]) [    ] o.a.s.c.c.ZkStateReader Updating cluster state from ZooKeeper... 
   [junit4]   2> 188907 INFO  (TEST-TestReqParamsAPI.test-seed#[819FD2FB7BA86F]) [    ] o.a.s.c.c.ZkStateReader Loaded empty cluster properties
   [junit4]   2> 188907 INFO  (TEST-TestReqParamsAPI.test-seed#[819FD2FB7BA86F]) [    ] o.a.s.c.c.ZkStateReader Updated live nodes from ZooKeeper... (0) -> (0)
   [junit4]   2> 188908 INFO  (TEST-TestReqParamsAPI.test-seed#[819FD2FB7BA86F]) [    ] o.a.s.c.c.SolrZkClient makePath: /overseer_elect
   [junit4]   2> 188909 INFO  (TEST-TestReqParamsAPI.test-seed#[819FD2FB7BA86F]) [    ] o.a.s.c.c.SolrZkClient makePath: /overseer_elect/election
   [junit4]   2> 188909 INFO  (TEST-TestReqParamsAPI.test-seed#[819FD2FB7BA86F]) [    ] o.a.s.c.Overseer Overseer (id=null) closing
   [junit4]   2> 188909 INFO  (TEST-TestReqParamsAPI.test-seed#[819FD2FB7BA86F]) [    ] o.a.s.c.LeaderElector Joined leadership election with path: /overseer_elect/election/95965823928958980-127.0.0.1:42194_-n_0000000000
   [junit4]   2> 188909 INFO  (TEST-TestReqParamsAPI.test-seed#[819FD2FB7BA86F]) [    ] o.a.s.c.OverseerElectionContext I am going to be the leader 127.0.0.1:42194_
   [junit4]   2> 188909 INFO  (TEST-TestReqParamsAPI.test-seed#[819FD2FB7BA86F]) [    ] o.a.s.c.c.SolrZkClient makePath: /overseer_elect/leader
   [junit4]   2> 188910 INFO  (TEST-TestReqParamsAPI.test-seed#[819FD2FB7BA86F]) [    ] o.a.s.c.Overseer Overseer (id=95965823928958980-127.0.0.1:42194_-n_0000000000) starting
   [junit4]   2> 188911 INFO  (TEST-TestReqParamsAPI.test-seed#[819FD2FB7BA86F]) [    ] o.a.s.c.c.SolrZkClient makePath: /overseer/queue-work
   [junit4]   2> 188913 INFO  (TEST-TestReqParamsAPI.test-seed#[819FD2FB7BA86F]) [    ] o.a.s.c.OverseerAutoReplicaFailoverThread Starting OverseerAutoReplicaFailoverThread autoReplicaFailoverWorkLoopDelay=10000 autoReplicaFailoverWaitAfterExpiration=30000 autoReplicaFailoverBadNodeExpiration=60000
   [junit4]   2> 188913 INFO  (OverseerCollectionConfigSetProcessor-95965823928958980-127.0.0.1:42194_-n_0000000000) [    ] o.a.s.c.OverseerTaskProcessor Process current queue of overseer operations
   [junit4]   2> 188913 INFO  (OverseerStateUpdate-95965823928958980-127.0.0.1:42194_-n_0000000000) [    ] o.a.s.c.Overseer Starting to work on the main queue
   [junit4]   2> 188913 INFO  (TEST-TestReqParamsAPI.test-seed#[819FD2FB7BA86F]) [    ] o.a.s.c.ZkController Register node as live in ZooKeeper:/live_nodes/127.0.0.1:42194_
   [junit4]   2> 188913 INFO  (TEST-TestReqParamsAPI.test-seed#[819FD2FB7BA86F]) [    ] o.a.s.c.c.SolrZkClient makePath: /live_nodes/127.0.0.1:42194_
   [junit4]   2> 188914 INFO  (OverseerStateUpdate-95965823928958980-127.0.0.1:42194_-n_0000000000) [    ] o.a.s.c.c.ZkStateReader Updated live nodes from ZooKeeper... (0) -> (0)
   [junit4]   2> 188914 INFO  (zkCallback-499-thread-1) [    ] o.a.s.c.c.ZkStateReader A live node change: [WatchedEvent state:SyncConnected type:NodeChildrenChanged path:/live_nodes], has occurred - updating... (live nodes size: [0])
   [junit4]   2> 188914 INFO  (zkCallback-499-thread-1) [    ] o.a.s.c.c.ZkStateReader Updated live nodes from ZooKeeper... (0) -> (1)
   [junit4]   2> 188937 INFO  (TEST-TestReqParamsAPI.test-seed#[819FD2FB7BA86F]) [    ] o.a.s.c.CoreContainer Security conf doesn't exist. Skipping setup for authorization module.
   [junit4]   2> 188937 INFO  (TEST-TestReqParamsAPI.test-seed#[819FD2FB7BA86F]) [    ] o.a.s.c.CoreContainer No authentication plugin used.
   [junit4]   2> 188937 INFO  (TEST-TestReqParamsAPI.test-seed#[819FD2FB7BA86F]) [    ] o.a.s.c.CorePropertiesLocator Looking for core definitions underneath /home/jenkins/workspace/Lucene-Solr-6.x-Linux/solr/build/solr-core/test/J0/../../../../../../../../../home/jenkins/workspace/Lucene-Solr-6.x-Linux/solr/build/solr-core/test/J0/temp/solr.handler.TestReqParamsAPI_819FD2FB7BA86F-001/control-001/cores
   [junit4]   2> 188938 INFO  (TEST-TestReqParamsAPI.test-seed#[819FD2FB7BA86F]) [    ] o.a.s.c.CoreDescriptor Created CoreDescriptor: {name=collection1, config=solrconfig.xml, transient=false, schema=schema.xml, loadOnStartup=true, configSetProperties=configsetprops.json, collection=control_collection, coreNodeName=, dataDir=data/, shard=}
   [junit4]   2> 188938 INFO  (TEST-TestReqParamsAPI.test-seed#[819FD2FB7BA86F]) [    ] o.a.s.c.CorePropertiesLocator Found core collection1 in /home/jenkins/workspace/Lucene-Solr-6.x-Linux/solr/build/solr-core/test/J0/../../../../../../../../../home/jenkins/workspace/Lucene-Solr-6.x-Linux/solr/build/solr-core/test/J0/temp/solr.handler.TestReqParamsAPI_819FD2FB7BA86F-001/control-001/cores/collection1
   [junit4]   2> 188938 INFO  (TEST-TestReqParamsAPI.test-seed#[819FD2FB7BA86F]) [    ] o.a.s.c.CorePropertiesLocator Found 1 core definitions
   [junit4]   2> 188939 INFO  (coreLoadExecutor-1068-thread-1) [    ] o.a.s.c.ZkController publishing state=down
   [junit4]   2> 188939 INFO  (coreLoadExecutor-1068-thread-1) [    ] o.a.s.c.ZkController numShards not found on descriptor - reading it from system property
   [junit4]   2> 188939 INFO  (TEST-TestReqParamsAPI.test-seed#[819FD2FB7BA86F]) [    ] o.a.s.s.SolrDispatchFilter user.dir=/home/jenkins/workspace/Lucene-Solr-6.x-Linux/solr/build/solr-core/test/J0
   [junit4]   2> 188939 INFO  (TEST-TestReqParamsAPI.test-seed#[819FD2FB7BA86F]) [    ] o.a.s.s.SolrDispatchFilter SolrDispatchFilter.init() done
   [junit4]   2> 188939 INFO  (coreLoadExecutor-1068-thread-1) [    ] o.a.s.c.ZkController Collection control_collection not visible yet, but flagging it so a watch is registered when it becomes visible
   [junit4]   2> 188940 INFO  (OverseerStateUpdate-95965823928958980-127.0.0.1:42194_-n_0000000000) [    ] o.a.s.c.Overseer processMessage: queueSize: 1, message = {
   [junit4]   2>   "core":"collection1",
   [junit4]   2>   "roles":null,
   [junit4]   2>   "base_url":"http://127.0.0.1:42194",
   [junit4]   2>   "node_name":"127.0.0.1:42194_",
   [junit4]   2>   "numShards":"1",
   [junit4]   2>   "state":"down",
   [junit4]   2>   "shard":null,
   [junit4]   2>   "collection":"control_collection",
   [junit4]   2>   "operation":"state"} current state version: 0
   [junit4]   2> 188940 INFO  (OverseerStateUpdate-95965823928958980-127.0.0.1:42194_-n_0000000000) [    ] o.a.s.c.o.ReplicaMutator Update state numShards=1 message={
   [junit4]   2>   "core":"collection1",
   [junit4]   2>   "roles":null,
   [junit4]   2>   "base_url":"http://127.0.0.1:42194",
   [junit4]   2>   "node_name":"127.0.0.1:42194_",
   [junit4]   2>   "numShards":"1",
   [junit4]   2>   "state":"down",
   [junit4]   2>   "shard":null,
   [junit4]   2>   "collection":"control_collection",
   [junit4]   2>   "operation":"state"}
   [junit4]   2> 188940 INFO  (coreLoadExecutor-1068-thread-1) [    ] o.a.s.c.c.ZkStateReader Deleting data for [control_collection]
   [junit4]   2> 188940 INFO  (OverseerStateUpdate-95965823928958980-127.0.0.1:42194_-n_0000000000) [    ] o.a.s.c.o.ClusterStateMutator building a new cName: control_collection
   [junit4]   2> 188940 INFO  (OverseerStateUpdate-95965823928958980-127.0.0.1:42194_-n_0000000000) [    ] o.a.s.c.o.ReplicaMutator Assigning new node to shard shard=shard1
   [junit4]   2> 188941 INFO  (zkCallback-499-thread-1) [    ] o.a.s.c.c.ZkStateReader A cluster state change: [WatchedEvent state:SyncConnected type:NodeDataChanged path:/clusterstate.json], has occurred - updating... (live nodes size: [1])
   [junit4]   2> 188941 INFO  (coreLoadExecutor-1068-thread-1) [    ] o.a.s.c.ZkController look for our core node name
   [junit4]   2> 188941 INFO  (coreLoadExecutor-1068-thread-1) [    ] o.a.s.c.ZkController waiting to find shard id in clusterstate for collection1
   [junit4]   2> 188941 INFO  (coreLoadExecutor-1068-thread-1) [    ] o.a.s.c.ZkController Check for collection zkNode:control_collection
   [junit4]   2> 188941 INFO  (coreLoadExecutor-1068-thread-1) [    ] o.a.s.c.ZkController Collection zkNode exists
   [junit4]   2> 188941 INFO  (coreLoadExecutor-1068-thread-1) [    ] o.a.s.c.c.ZkStateReader Load collection config from: [/collections/control_collection]
   [junit4]   2> 188942 INFO  (coreLoadExecutor-1068-thread-1) [    ] o.a.s.c.c.ZkStateReader path=[/collections/control_collection] [configName]=[conf1] specified config exists in ZooKeeper
   [junit4]   2> 188942 INFO  (coreLoadExecutor-1068-thread-1) [    ] o.a.s.c.SolrResourceLoader new SolrResourceLoader for directory: '/home/jenkins/workspace/Lucene-Solr-6.x-Linux/solr/build/solr-core/test/J0/temp/solr.handler.TestReqParamsAPI_819FD2FB7BA86F-001/control-001/cores/collection1'
   [junit4]   2> 188942 INFO  (coreLoadExecutor-1068-thread-1) [    ] o.a.s.c.SolrResourceLoader JNDI not configured for solr (NoInitialContextEx)
   [junit4]   2> 188942 INFO  (coreLoadExecutor-1068-thread-1) [    ] o.a.s.c.SolrResourceLoader solr home defaulted to 'solr/' (could not find system property or JNDI)
   [junit4]   2> 188943 INFO  (coreLoadExecutor-1068-thread-1) [    ] o.a.s.c.Config loaded config solrconfig.xml with version 0 
   [junit4]   2> 188946 INFO  (coreLoadExecutor-1068-thread-1) [    ] o.a.s.c.SolrConfig current version of requestparams : -1
   [junit4]   2> 188948 INFO  (coreLoadExecutor-1068-thread-1) [    ] o.a.s.c.SolrConfig Using Lucene MatchVersion: 6.1.0
   [junit4]   2> 188953 INFO  (coreLoadExecutor-1068-thread-1) [    ] o.a.s.c.SolrConfig Loaded SolrConfig: solrconfig.xml
   [junit4]   2> 188956 INFO  (coreLoadExecutor-1068-thread-1) [    ] o.a.s.s.IndexSchema [collection1] Schema name=test
   [junit4]   2> 189020 INFO  (coreLoadExecutor-1068-thread-1) [    ] o.a.s.s.OpenExchangeRatesOrgProvider Initialized with rates=open-exchange-rates.json, refreshInterval=1440.
   [junit4]   2> 189023 INFO  (coreLoadExecutor-1068-thread-1) [    ] o.a.s.s.IndexSchema default search field in schema is text
   [junit4]   2> 189024 INFO  (coreLoadExecutor-1068-thread-1) [    ] o.a.s.s.IndexSchema unique key field: id
   [junit4]   2> 189027 INFO  (coreLoadExecutor-1068-thread-1) [    ] o.a.s.s.FileExchangeRateProvider Reloading exchange rates from file currency.xml
   [junit4]   2> 189028 INFO  (coreLoadExecutor-1068-thread-1) [    ] o.a.s.s.FileExchangeRateProvider Reloading exchange rates from file currency.xml
   [junit4]   2> 189029 INFO  (coreLoadExecutor-1068-thread-1) [    ] o.a.s.s.OpenExchangeRatesOrgProvider Reloading exchange rates from open-exchange-rates.json
   [junit4]   2> 189029 INFO  (coreLoadExecutor-1068-thread-1) [    ] o.a.s.s.OpenExchangeRatesOrgProvider Reloading exchange rates from open-exchange-rates.json
   [junit4]   2> 189030 INFO  (coreLoadExecutor-1068-thread-1) [    ] o.a.s.c.ConfigSetProperties Did not find ConfigSet properties, assuming default properties: Can't find resource 'configsetprops.json' in classpath or '/configs/conf1', cwd=/home/jenkins/workspace/Lucene-Solr-6.x-Linux/solr/build/solr-core/test/J0
   [junit4]   2> 189030 INFO  (coreLoadExecutor-1068-thread-1) [    ] o.a.s.c.CoreContainer Creating SolrCore 'collection1' using configuration from collection control_collection
   [junit4]   2> 189030 INFO  (coreLoadExecutor-1068-thread-1) [    ] o.a.s.c.SolrCore org.apache.solr.core.MockDirectoryFactory
   [junit4]   2> 189030 INFO  (coreLoadExecutor-1068-thread-1) [    ] o.a.s.c.SolrCore [[collection1] ] Opening new SolrCore at [/home/jenkins/workspace/Lucene-Solr-6.x-Linux/solr/build/solr-core/test/J0/temp/solr.handler.TestReqParamsAPI_819FD2FB7BA86F-001/control-001/cores/collection1], dataDir=[/home/jenkins/workspace/Lucene-Solr-6.x-Linux/solr/build/solr-core/test/J0/../../../../../../../../../home/jenkins/workspace/Lucene-Solr-6.x-Linux/solr/build/solr-core/test/J0/temp/solr.handler.TestReqParamsAPI_819FD2FB7BA86F-001/control-001/cores/collection1/data/]
   [junit4]   2> 189031 INFO  (coreLoadExecutor-1068-thread-1) [    ] o.a.s.c.JmxMonitoredMap JMX monitoring is enabled. Adding Solr mbeans to JMX Server: com.sun.jmx.mbeanserver.JmxMBeanServer@17b345e
   [junit4]   2> 189031 INFO  (coreLoadExecutor-1068-thread-1) [    ] o.a.s.c.CachingDirectoryFactory return new directory for /home/jenkins/workspace/Lucene-Solr-6.x-Linux/solr/build/solr-core/test/J0/../../../../../../../../../home/jenkins/workspace/Lucene-Solr-6.x-Linux/solr/build/solr-core/test/J0/temp/solr.handler.TestReqParamsAPI_819FD2FB7BA86F-001/control-001/cores/collection1/data
   [junit4]   2> 189031 INFO  (coreLoadExecutor-1068-thread-1) [    ] o.a.s.c.SolrCore New index directory detected: old=null new=/home/jenkins/workspace/Lucene-Solr-6.x-Linux/solr/build/solr-core/test/J0/../../../../../../../../../home/jenkins/workspace/Lucene-Solr-6.x-Linux/solr/build/solr-core/test/J0/temp/solr.handler.TestReqParamsAPI_819FD2FB7BA86F-001/control-001/cores/collection1/data/index/
   [junit4]   2> 189031 WARN  (coreLoadExecutor-1068-thread-1) [    ] o.a.s.c.SolrCore [collection1] Solr index directory '/home/jenkins/workspace/Lucene-Solr-6.x-Linux/solr/build/solr-core/test/J0/../../../../../../../../../home/jenkins/workspace/Lucene-Solr-6.x-Linux/solr/build/solr-core/test/J0/temp/solr.handler.TestReqParamsAPI_819FD2FB7BA86F-001/control-001/cores/collection1/data/index' doesn't exist. Creating new index...
   [junit4]   2> 189031 INFO  (coreLoadExecutor-1068-thread-1) [    ] o.a.s.c.CachingDirectoryFactory return new directory for /home/jenkins/workspace/Lucene-Solr-6.x-Linux/solr/build/solr-core/test/J0/../../../../../../../../../home/jenkins/workspace/Lucene-Solr-6.x-Linux/solr/build/solr-core/test/J0/temp/solr.handler.TestReqParamsAPI_819FD2FB7BA86F-001/control-001/cores/collection1/data/index
   [junit4]   2> 189031 INFO  (coreLoadExecutor-1068-thread-1) [    ] o.a.s.u.RandomMergePolicy RandomMergePolicy wrapping class org.apache.lucene.index.TieredMergePolicy: [TieredMergePolicy: maxMergeAtOnce=36, maxMergeAtOnceExplicit=35, maxMergedSegmentMB=28.94140625, floorSegmentMB=1.4990234375, forceMergeDeletesPctAllowed=22.70121123455061, segmentsPerTier=16.0, maxCFSSegmentSizeMB=8.796093022207999E12, noCFSRatio=0.6369606149909646
   [junit4]   2> 189032 INFO  (coreLoadExecutor-1068-thread-1) [    ] o.a.s.c.SolrDeletionPolicy SolrDeletionPolicy.onCommit: commits: num=1
   [junit4]   2> 	commit{dir=MockDirectoryWrapper(RAMDirectory@491433 lockFactory=org.apache.lucene.store.SingleInstanceLockFactory@d7bc05),segFN=segments_1,generation=1}
   [junit4]   2> 189032 INFO  (coreLoadExecutor-1068-thread-1) [    ] o.a.s.c.SolrDeletionPolicy newest commit generation = 1
   [junit4]   2> 189032 INFO  (OldIndexDirectoryCleanupThreadForCore-collection1) [    ] o.a.s.c.SolrCore Looking for old index directories to cleanup for core collection1 in /home/jenkins/workspace/Lucene-Solr-6.x-Linux/solr/build/solr-core/test/J0/../../../../../../../../../home/jenkins/workspace/Lucene-Solr-6.x-Linux/solr/build/solr-core/test/J0/temp/solr.handler.TestReqParamsAPI_819FD2FB7BA86F-001/control-001/cores/collection1/data/
   [junit4]   2> 189032 WARN  (OldIndexDirectoryCleanupThreadForCore-collection1) [    ] o.a.s.c.DirectoryFactory /home/jenkins/workspace/Lucene-Solr-6.x-Linux/solr/build/solr-core/test/J0/../../../../../../../../../home/jenkins/workspace/Lucene-Solr-6.x-Linux/solr/build/solr-core/test/J0/temp/solr.handler.TestReqParamsAPI_819FD2FB7BA86F-001/control-001/cores/collection1/data/ does not point to a valid data directory; skipping clean-up of old index directories.
   [junit4]   2> 189034 INFO  (coreLoadExecutor-1068-thread-1) [    ] o.a.s.u.p.UpdateRequestProcessorChain creating updateRequestProcessorChain "nodistrib"
   [junit4]   2> 189034 INFO  (coreLoadExecutor-1068-thread-1) [    ] o.a.s.u.p.UpdateRequestProcessorChain creating updateRequestProcessorChain "dedupe"
   [junit4]   2> 189034 INFO  (coreLoadExecutor-1068-thread-1) [    ] o.a.s.u.p.UpdateRequestProcessorChain inserting DistributedUpdateProcessorFactory into updateRequestProcessorChain "dedupe"
   [junit4]   2> 189034 INFO  (coreLoadExecutor-1068-thread-1) [    ] o.a.s.u.p.UpdateRequestProcessorChain creating updateRequestProcessorChain "stored_sig"
   [junit4]   2> 189034 INFO  (coreLoadExecutor-1068-thread-1) [    ] o.a.s.u.p.UpdateRequestProcessorChain inserting DistributedUpdateProcessorFactory into updateRequestProcessorChain "stored_sig"
   [junit4]   2> 189034 INFO  (coreLoadExecutor-1068-thread-1) [    ] o.a.s.u.p.UpdateRequestProcessorChain creating updateRequestProcessorChain "distrib-dup-test-chain-explicit"
   [junit4]   2> 189034 INFO  (coreLoadExecutor-1068-thread-1) [    ] o.a.s.u.p.UpdateRequestProcessorChain creating updateRequestProcessorChain "distrib-dup-test-chain-implicit"
   [junit4]   2> 189034 INFO  (coreLoadExecutor-1068-thread-1) [    ] o.a.s.u.p.UpdateRequestProcessorChain inserting DistributedUpdateProcessorFactory into updateRequestProcessorChain "distrib-dup-test-chain-implicit"
   [junit4]   2> 189034 INFO  (coreLoadExecutor-1068-thread-1) [    ] o.a.s.c.SolrCore no updateRequestProcessorChain defined as default, creating implicit default
   [junit4]   2> 189034 WARN  (coreLoadExecutor-1068-thread-1) [    ] o.a.s.c.RequestHandlers INVALID paramSet a in requestHandler {type = requestHandler,name = /dump,class = DumpRequestHandler,args = {defaults={a=A,b=B}}}
   [junit4]   2> 189035 INFO  (coreLoadExecutor-1068-thread-1) [    ] o.a.s.h.l.XMLLoader xsltCacheLifetimeSeconds=60
   [junit4]   2> 189036 INFO  (coreLoadExecutor-1068-thread-1) [    ] o.a.s.h.l.XMLLoader xsltCacheLifetimeSeconds=60
   [junit4]   2> 189036 INFO  (coreLoadExecutor-1068-thread-1) [    ] o.a.s.h.l.XMLLoader xsltCacheLifetimeSeconds=60
   [junit4]   2> 189037 INFO  (coreLoadExecutor-1068-thread-1) [    ] o.a.s.h.l.XMLLoader xsltCacheLifetimeSeconds=60
   [junit4]   2> 189038 INFO  (coreLoadExecutor-1068-thread-1) [    ] o.a.s.c.RequestHandlers Registered paths: /admin/mbeans,standard,/update/json/docs,/admin/luke,/export,/get,/admin/properties,/update/json,/admin/threads,/dump,/update/csv,/sql,/graph,/admin/segments,/admin/system,/replication,/config,/stream,/schema,/admin/plugins,/admin/logging,/admin/ping,/update,/admin/file
   [junit4]   2> 189038 INFO  (coreLoadExecutor-1068-thread-1) [    ] o.a.s.c.SolrCore Using default statsCache cache: org.apache.solr.search.stats.LocalStatsCache
   [junit4]   2> 189039 INFO  (coreLoadExecutor-1068-thread-1) [    ] o.a.s.u.UpdateHandler Using UpdateLog implementation: org.apache.solr.update.UpdateLog
   [junit4]   2> 189039 INFO  (coreLoadExecutor-1068-thread-1) [    ] o.a.s.u.UpdateLog Initializing UpdateLog: dataDir= defaultSyncLevel=FLUSH numRecordsToKeep=100 maxNumLogsToKeep=10 numVersionBuckets=65536
   [junit4]   2> 189039 INFO  (coreLoadExecutor-1068-thread-1) [    ] o.a.s.u.CommitTracker Hard AutoCommit: disabled
   [junit4]   2> 189039 INFO  (coreLoadExecutor-1068-thread-1) [    ] o.a.s.u.CommitTracker Soft AutoCommit: disabled
   [junit4]   2> 189039 INFO  (coreLoadExecutor-1068-thread-1) [    ] o.a.s.u.RandomMergePolicy RandomMergePolicy wrapping class org.apache.lucene.index.LogDocMergePolicy: [LogDocMergePolicy: minMergeSize=1000, mergeFactor=31, maxMergeSize=9223372036854775807, maxMergeSizeForForcedMerge=9223372036854775807, calibrateSizeByDeletes=false, maxMergeDocs=2147483647, maxCFSSegmentSizeMB=8.796093022207999E12, noCFSRatio=1.0]
   [junit4]   2> 189039 INFO  (coreLoadExecutor-1068-thread-1) [    ] o.a.s.c.SolrDeletionPolicy SolrDeletionPolicy.onInit: commits: num=1
   [junit4]   2> 	commit{dir=MockDirectoryWrapper(RAMDirectory@491433 lockFactory=org.apache.lucene.store.SingleInstanceLockFactory@d7bc05),segFN=segments_1,generation=1}
   [junit4]   2> 189040 INFO  (coreLoadExecutor-1068-thread-1) [    ] o.a.s.c.SolrDeletionPolicy newest commit generation = 1
   [junit4]   2> 189040 INFO  (coreLoadExecutor-1068-thread-1) [    ] o.a.s.s.SolrIndexSearcher Opening [Searcher@4d9348[collection1] main]
   [junit4]   2> 189040 INFO  (coreLoadExecutor-1068-thread-1) [    ] o.a.s.c.c.ZkStateReader Load collection config from: [/collections/control_collection]
   [junit4]   2> 189040 INFO  (coreLoadExecutor-1068-thread-1) [    ] o.a.s.c.c.ZkStateReader path=[/collections/control_collection] [configName]=[conf1] specified config exists in ZooKeeper
   [junit4]   2> 189040 INFO  (coreLoadExecutor-1068-thread-1) [    ] o.a.s.r.ManagedResourceStorage Setting up ZooKeeper-based storage for the RestManager with znodeBase: /configs/conf1
   [junit4]   2> 189040 INFO  (coreLoadExecutor-1068-thread-1) [    ] o.a.s.r.ManagedResourceStorage Configured ZooKeeperStorageIO with znodeBase: /configs/conf1
   [junit4]   2> 189040 INFO  (coreLoadExecutor-1068-thread-1) [    ] o.a.s.r.RestManager Initializing RestManager with initArgs: {}
   [junit4]   2> 189040 INFO  (coreLoadExecutor-1068-thread-1) [    ] o.a.s.r.ManagedResourceStorage Reading _rest_managed.json using ZooKeeperStorageIO:path=/configs/conf1
   [junit4]   2> 189040 INFO  (coreLoadExecutor-1068-thread-1) [    ] o.a.s.r.ManagedResourceStorage No data found for znode /configs/conf1/_rest_managed.json
   [junit4]   2> 189040 INFO  (coreLoadExecutor-1068-thread-1) [    ] o.a.s.r.ManagedResourceStorage Loaded null at path _rest_managed.json using ZooKeeperStorageIO:path=/configs/conf1
   [junit4]   2> 189040 INFO  (coreLoadExecutor-1068-thread-1) [    ] o.a.s.r.RestManager Initializing 0 registered ManagedResources
   [junit4]   2> 189040 INFO  (coreLoadExecutor-1068-thread-1) [    ] o.a.s.h.ReplicationHandler Commits will be reserved for  10000
   [junit4]   2> 189041 INFO  (searcherExecutor-1069-thread-1) [    ] o.a.s.c.SolrCore [collection1] Registered new searcher Searcher@4d9348[collection1] main{ExitableDirectoryReader(UninvertingDirectoryReader())}
   [junit4]   2> 189041 INFO  (coreLoadExecutor-1068-thread-1) [    ] o.a.s.u.UpdateLog Looking up max value of version field to seed version buckets
   [junit4]   2> 189041 INFO  (coreLoadExecutor-1068-thread-1) [    ] o.a.s.u.VersionInfo Refreshing highest value of _version_ for 65536 version buckets from index
   [junit4]   2> 189041 INFO  (coreLoadExecutor-1068-thread-1) [    ] o.a.s.u.VersionInfo No terms found for _version_, cannot seed version bucket highest value from index
   [junit4]   2> 189041 INFO  (coreLoadExecutor-1068-thread-1) [    ] o.a.s.u.UpdateLog Could not find max version in index or recent updates, using new clock 1535453183216713728
   [junit4]   2> 189043 INFO  (coreLoadExecutor-1068-thread-1) [    ] o.a.s.u.UpdateLog Took 2.0ms to seed version buckets with highest version 1535453183216713728
   [junit4]   2> 189043 INFO  (coreLoadExecutor-1068-thread-1) [    ] o.a.s.c.ZkController watch zkdir /configs/conf1
   [junit4]   2> 189043 INFO  (coreLoadExecutor-1068-thread-1) [    ] o.a.s.c.CoreContainer registering core: collection1
   [junit4]   2> 189043 INFO  (coreZkRegister-1062-thread-1) [    ] o.a.s.c.ZkController Register replica - core:collection1 address:http://127.0.0.1:42194 collection:control_collection shard:shard1
   [junit4]   2> 189044 INFO  (coreZkRegister-1062-thread-1) [    ] o.a.s.c.c.SolrZkClient makePath: /collections/control_collection/leader_elect/shard1/election
   [junit4]   2> 189045 INFO  (coreZkRegister-1062-thread-1) [    ] o.a.s.c.LeaderElector Joined leadership election with path: /collections/control_collection/leader_elect/shard1/election/95965823928958980-core_node1-n_0000000000
   [junit4]   2> 189045 INFO  (coreZkRegister-1062-thread-1) [    ] o.a.s.c.ShardLeaderElectionContext Running the leader process for shard=shard1 and weAreReplacement=false and leaderVoteWait=10000
   [junit4]   2> 189045 INFO  (coreZkRegister-1062-thread-1) [    ] o.a.s.c.ShardLeaderElectionContext Enough replicas found to continue.
   [junit4]   2> 189045 INFO  (coreZkRegister-1062-thread-1) [    ] o.a.s.c.ShardLeaderElectionContext I may be the new leader - try and sync
   [junit4]   2> 189045 INFO  (coreZkRegister-1062-thread-1) [    ] o.a.s.c.SyncStrategy Sync replicas to http://127.0.0.1:42194/collection1/
   [junit4]   2> 189045 INFO  (coreZkRegister-1062-thread-1) [    ] o.a.s.c.SyncStrategy Sync Success - now sync replicas to me
   [junit4]   2> 189046 INFO  (coreZkRegister-1062-thread-1) [    ] o.a.s.c.SyncStrategy http://127.0.0.1:42194/collection1/ has no replicas
   [junit4]   2> 189046 INFO  (OverseerStateUpdate-95965823928958980-127.0.0.1:42194_-n_0000000000) [    ] o.a.s.c.Overseer processMessage: queueSize: 1, message = {
   [junit4]   2>   "operation":"leader",
   [junit4]   2>   "shard":"shard1",
   [junit4]   2>   "collection":"control_collection"} current state version: 1
   [junit4]   2> 189046 INFO  (coreZkRegister-1062-thread-1) [    ] o.a.s.c.c.SolrZkClient makePath: /collections/control_collection/leaders/shard1
   [junit4]   2> 189047 INFO  (coreZkRegister-1062-thread-1) [    ] o.a.s.c.ShardLeaderElectionContextBase Creating leader registration node /collections/control_collection/leaders/shard1/leader after winning as /collections/control_collection/leader_elect/shard1/election/95965823928958980-core_node1-n_0000000000
   [junit4]   2> 189047 INFO  (coreZkRegister-1062-thread-1) [    ] o.a.s.c.ShardLeaderElectionContext I am the new leader: http://127.0.0.1:42194/collection1/ shard1
   [junit4]   2> 189047 INFO  (OverseerStateUpdate-95965823928958980-127.0.0.1:42194_-n_0000000000) [    ] o.a.s.c.Overseer processMessage: queueSize: 1, message = {
   [junit4]   2>   "operation":"leader",
   [junit4]   2>   "shard":"shard1",
   [junit4]   2>   "collection":"control_collection",
   [junit4]   2>   "base_url":"http://127.0.0.1:42194",
   [junit4]   2>   "core":"collection1",
   [junit4]   2>   "state":"active"} current state version: 1
   [junit4]   2> 189148 INFO  (zkCallback-499-thread-1) [    ] o.a.s.c.c.ZkStateReader A cluster state change: [WatchedEvent state:SyncConnected type:NodeDataChanged path:/clusterstate.json], has occurred - updating... (live nodes size: [1])
   [junit4]   2> 189198 INFO  (coreZkRegister-1062-thread-1) [    ] o.a.s.c.ZkController We are http://127.0.0.1:42194/collection1/ and leader is http://127.0.0.1:42194/collection1/
   [junit4]   2> 189198 INFO  (coreZkRegister-1062-thread-1) [    ] o.a.s.c.ZkController No LogReplay needed for core=collection1 baseURL=http://127.0.0.1:42194
   [junit4]   2> 189198 INFO  (coreZkRegister-1062-thread-1) [    ] o.a.s.c.ZkController I am the leader, no recovery necessary
   [junit4]   2> 189198 INFO  (coreZkRegister-1062-thread-1) [    ] o.a.s.c.ZkController publishing state=active
   [junit4]   2> 189198 INFO  (coreZkRegister-1062-thread-1) [    ] o.a.s.c.ZkController numShards not found on descriptor - reading it from system property
   [junit4]   2> 189199 INFO  (OverseerStateUpdate-95965823928958980-127.0.0.1:42194_-n_0000000000) [    ] o.a.s.c.Overseer processMessage: queueSize: 1, message = {
   [junit4]   2>   "core":"collection1",
   [junit4]   2>   "core_node_name":"core_node1",
   [junit4]   2>   "roles":null,
   [junit4]   2>   "base_url":"http://127.0.0.1:42194",
   [junit4]   2>   "node_name":"127.0.0.1:42194_",
   [junit4]   2>   "numShards":"1",
   [junit4]   2>   "state":"active",
   [junit4]   2>   "shard":"shard1",
   [junit4]   2>   "collection":"control_collection",
   [junit4]   2>   "operation":"state"} current state version: 2
   [junit4]   2> 189199 INFO  (OverseerStateUpdate-95965823928958980-127.0.0.1:42194_-n_0000000000) [    ] o.a.s.c.o.ReplicaMutator Update state numShards=1 message={
   [junit4]   2>   "core":"collection1",
   [junit4]   2>   "core_node_name":"core_node1",
   [junit4]   2>   "roles":null,
   [junit4]   2>   "base_url":"http://127.0.0.1:42194",
   [junit4]   2>   "node_name":"127.0.0.1:42194_",
   [junit4]   2>   "numShards":"1",
   [junit4]   2>   "state":"active",
   [junit4]   2>   "shard":"shard1",
   [junit4]   2>   "collection":"control_collection",
   [junit4]   2>   "operation":"state"}
   [junit4]   2> 189300 INFO  (zkCallback-499-thread-1) [    ] o.a.s.c.c.ZkStateReader A cluster state change: [WatchedEvent state:SyncConnected type:NodeDataChanged path:/clusterstate.json], has occurred - updating... (live nodes size: [1])
   [junit4]   2> 189440 INFO  (TEST-TestReqParamsAPI.test-seed#[819FD2FB7BA86F]) [    ] o.a.s.c.c.SolrZkClient Using default ZkCredentialsProvider
   [junit4]   2> 189441 INFO  (TEST-TestReqParamsAPI.test-seed#[819FD2FB7BA86F]) [    ] o.a.s.c.c.ConnectionManager Waiting for client to connect to ZooKeeper
   [junit4]   2> 189442 INFO  (zkCallback-503-thread-1) [    ] o.a.s.c.c.ConnectionManager Watcher org.apache.solr.common.cloud.ConnectionManager@92f8c2 name:ZooKeeperConnection Watcher:127.0.0.1:46240/solr got event WatchedEvent state:SyncConnected type:None path:null path:null type:None
   [junit4]   2> 189442 INFO  (TEST-TestReqParamsAPI.test-seed#[819FD2FB7BA86F]) [    ] o.a.s.c.c.ConnectionManager Client is connected to ZooKeeper
   [junit4]   2> 189442 INFO  (TEST-TestReqParamsAPI.test-seed#[819FD2FB7BA86F]) [    ] o.a.s.c.c.SolrZkClient Using default ZkACLProvider
   [junit4]   2> 189442 INFO  (TEST-TestReqParamsAPI.test-seed#[819FD2FB7BA86F]) [    ] o.a.s.c.c.ZkStateReader Updating cluster state from ZooKeeper... 
   [junit4]   2> 189442 INFO  (TEST-TestReqParamsAPI.test-seed#[819FD2FB7BA86F]) [    ] o.a.s.c.c.ZkStateReader Loaded empty cluster properties
   [junit4]   2> 189443 INFO  (TEST-TestReqParamsAPI.test-seed#[819FD2FB7BA86F]) [    ] o.a.s.c.c.ZkStateReader Updated live nodes from ZooKeeper... (0) -> (1)
   [junit4]   2> 189443 INFO  (TEST-TestReqParamsAPI.test-seed#[819FD2FB7BA86F]) [    ] o.a.s.c.ChaosMonkey monkey: init - expire sessions:false cause connection loss:false
   [junit4]   2> 189511 INFO  (TEST-TestReqParamsAPI.test-seed#[819FD2FB7BA86F]) [    ] o.a.s.SolrTestCaseJ4 Writing core.properties file to /home/jenkins/workspace/Lucene-Solr-6.x-Linux/solr/build/solr-core/test/J0/temp/solr.handler.TestReqParamsAPI_819FD2FB7BA86F-001/shard-1-001/cores/collection1
   [junit4]   2> 189512 INFO  (TEST-TestReqParamsAPI.test-seed#[819FD2FB7BA86F]) [    ] o.a.s.c.AbstractFullDistribZkTestBase create jetty 1 in directory /home/jenkins/workspace/Lucene-Solr-6.x-Linux/solr/build/solr-core/test/J0/temp/solr.handler.TestReqParamsAPI_819FD2FB7BA86F-001/shard-1-001
   [junit4]   2> 189512 INFO  (TEST-TestReqParamsAPI.test-seed#[819FD2FB7BA86F]) [    ] o.e.j.s.Server jetty-9.3.8.v20160314
   [junit4]   2> 189513 INFO  (TEST-TestReqParamsAPI.test-seed#[819FD2FB7BA86F]) [    ] o.e.j.s.h.ContextHandler Started o.e.j.s.ServletContextHandler@c6d9cb{/,null,AVAILABLE}
   [junit4]   2> 189513 INFO  (TEST-TestReqParamsAPI.test-seed#[819FD2FB7BA86F]) [    ] o.e.j.s.ServerConnector Started ServerConnector@1a24add{HTTP/1.1,[http/1.1]}{127.0.0.1:36194}
   [junit4]   2> 189513 INFO  (TEST-TestReqParamsAPI.test-seed#[819FD2FB7BA86F]) [    ] o.e.j.s.Server Started @191306ms
   [junit4]   2> 189513 INFO  (TEST-TestReqParamsAPI.test-seed#[819FD2FB7BA86F]) [    ] o.a.s.c.s.e.JettySolrRunner Jetty properties: {solr.data.dir=/home/jenkins/workspace/Lucene-Solr-6.x-Linux/solr/build/solr-core/test/J0/temp/solr.handler.TestReqParamsAPI_819FD2FB7BA86F-001/tempDir-001/jetty1, solrconfig=solrconfig.xml, hostContext=/, hostPort=36194, coreRootDirectory=/home/jenkins/workspace/Lucene-Solr-6.x-Linux/solr/build/solr-core/test/J0/../../../../../../../../../home/jenkins/workspace/Lucene-Solr-6.x-Linux/solr/build/solr-core/test/J0/temp/solr.handler.TestReqParamsAPI_819FD2FB7BA86F-001/shard-1-001/cores}
   [junit4]   2> 189514 INFO  (TEST-TestReqParamsAPI.test-seed#[819FD2FB7BA86F]) [    ] o.a.s.s.SolrDispatchFilter SolrDispatchFilter.init(): jdk.internal.loader.ClassLoaders$AppClassLoader@53fd30
   [junit4]   2> 189514 INFO  (TEST-TestReqParamsAPI.test-seed#[819FD2FB7BA86F]) [    ] o.a.s.c.SolrResourceLoader new SolrResourceLoader for directory: '/home/jenkins/workspace/Lucene-Solr-6.x-Linux/solr/build/solr-core/test/J0/temp/solr.handler.TestReqParamsAPI_819FD2FB7BA86F-001/shard-1-001'
   [junit4]   2> 189514 INFO  (TEST-TestReqParamsAPI.test-seed#[819FD2FB7BA86F]) [    ] o.a.s.c.SolrResourceLoader JNDI not configured for solr (NoInitialContextEx)
   [junit4]   2> 189514 INFO  (TEST-TestReqParamsAPI.test-seed#[819FD2FB7BA86F]) [    ] o.a.s.c.SolrResourceLoader solr home defaulted to 'solr/' (could not find system property or JNDI)
   [junit4]   2> 189514 INFO  (TEST-TestReqParamsAPI.test-seed#[819FD2FB7BA86F]) [    ] o.a.s.c.c.SolrZkClient Using default ZkCredentialsProvider
   [junit4]   2> 189514 INFO  (TEST-TestReqParamsAPI.test-seed#[819FD2FB7BA86F]) [    ] o.a.s.c.c.ConnectionManager Waiting for client to connect to ZooKeeper
   [junit4]   2> 189515 INFO  (zkCallback-504-thread-1) [    ] o.a.s.c.c.ConnectionManager Watcher org.apache.solr.common.cloud.ConnectionManager@16f1 name:ZooKeeperConnection Watcher:127.0.0.1:46240/solr got event WatchedEvent state:SyncConnected type:None path:null path:null type:None
   [junit4]   2> 189515 INFO  (TEST-TestReqParamsAPI.test-seed#[819FD2FB7BA86F]) [    ] o.a.s.c.c.ConnectionManager Client is connected to ZooKeeper
   [junit4]   2> 189515 INFO  (TEST-TestReqParamsAPI.test-seed#[819FD2FB7BA86F]) [    ] o.a.s.c.c.SolrZkClient Using default ZkACLProvider
   [junit4]   2> 189516 INFO  (TEST-TestReqParamsAPI.test-seed#[819FD2FB7BA86F]) [    ] o.a.s.s.SolrDispatchFilter Loading solr.xml from SolrHome (not found in ZooKeeper)
   [junit4]   2> 189516 INFO  (TEST-TestReqParamsAPI.test-seed#[819FD2FB7BA86F]) [    ] o.a.s.c.SolrXmlConfig Loading container configuration from /home/jenkins/workspace/Lucene-Solr-6.x-Linux/solr/build/solr-core/test/J0/temp/solr.handler.TestReqParamsAPI_819FD2FB7BA86F-001/shard-1-001/solr.xml
   [junit4]   2> 189520 INFO  (TEST-TestReqParamsAPI.test-seed#[819FD2FB7BA86F]) [    ] o.a.s.c.CorePropertiesLocator Config-defined core root directory: /home/jenkins/workspace/Lucene-Solr-6.x-Linux/solr/build/solr-core/test/J0/../../../../../../../../../home/jenkins/workspace/Lucene-Solr-6.x-Linux/solr/build/solr-core/test/J0/temp/solr.handler.TestReqParamsAPI_819FD2FB7BA86F-001/shard-1-001/cores
   [junit4]   2> 189520 INFO  (TEST-TestReqParamsAPI.test-seed#[819FD2FB7BA86F]) [    ] o.a.s.c.CoreContainer New CoreContainer 16370693
   [junit4]   2> 189520 INFO  (TEST-TestReqParamsAPI.test-seed#[819FD2FB7BA86F]) [    ] o.a.s.c.CoreContainer Loading cores into CoreContainer [instanceDir=/home/jenkins/workspace/Lucene-Solr-6.x-Linux/solr/build/solr-core/test/J0/temp/solr.handler.TestReqParamsAPI_819FD2FB7BA86F-001/shard-1-001]
   [junit4]   2> 189520 WARN  (TEST-TestReqParamsAPI.test-seed#[819FD2FB7BA86F]) [    ] o.a.s.c.CoreContainer Couldn't add files from /home/jenkins/workspace/Lucene-Solr-6.x-Linux/solr/build/solr-core/test/J0/temp/solr.handler.TestReqParamsAPI_819FD2FB7BA86F-001/shard-1-001/lib to classpath: /home/jenkins/workspace/Lucene-Solr-6.x-Linux/solr/build/solr-core/test/J0/temp/solr.handler.TestReqParamsAPI_819FD2FB7BA86F-001/shard-1-001/lib
   [junit4]   2> 189520 INFO  (TEST-TestReqParamsAPI.test-seed#[819FD2FB7BA86F]) [    ] o.a.s.h.c.HttpShardHandlerFactory created with socketTimeout : 90000,urlScheme : ,connTimeout : 15000,maxConnectionsPerHost : 20,maxConnections : 10000,corePoolSize : 0,maximumPoolSize : 2147483647,maxThreadIdleTime : 5,sizeOfQueue : -1,fairnessPolicy : false,useRetries : false,
   [junit4]   2> 189521 INFO  (TEST-TestReqParamsAPI.test-seed#[819FD2FB7BA86F]) [    ] o.a.s.u.UpdateShardHandler Creating UpdateShardHandler HTTP client with params: socketTimeout=340000&connTimeout=45000&retry=true
   [junit4]   2> 189521 INFO  (TEST-TestReqParamsAPI.test-seed#[819FD2FB7BA86F]) [    ] o.a.s.l.LogWatcher SLF4J impl is org.slf4j.impl.Log4jLoggerFactory
   [junit4]   2> 189521 INFO  (TEST-TestReqParamsAPI.test-seed#[819FD2FB7BA86F]) [    ] o.a.s.l.LogWatcher Registering Log Listener [Log4j (org.slf4j.impl.Log4jLoggerFactory)]
   [junit4]   2> 189521 INFO  (TEST-TestReqParamsAPI.test-seed#[819FD2FB7BA86F]) [    ] o.a.s.c.ZkContainer Zookeeper client=127.0.0.1:46240/solr
   [junit4]   2> 189521 INFO  (TEST-TestReqParamsAPI.test-seed#[819FD2FB7BA86F]) [    ] o.a.s.c.ZkController zkHost includes chroot
   [junit4]   2> 189521 INFO  (TEST-TestReqParamsAPI.test-seed#[819FD2FB7BA86F]) [    ] o.a.s.c.c.SolrZkClient Using default ZkCredentialsProvider
   [junit4]   2> 189521 INFO  (TEST-TestReqParamsAPI.test-seed#[819FD2FB7BA86F]) [    ] o.a.s.c.c.ConnectionManager Waiting for client to connect to ZooKeeper
   [junit4]   2> 189523 INFO  (zkCallback-507-thread-1) [    ] o.a.s.c.c.ConnectionManager Watcher org.apache.solr.common.cloud.ConnectionManager@29b0cf name:ZooKeeperConnection Watcher:127.0.0.1:46240 got event WatchedEvent state:SyncConnected type:None path:null path:null type:None
   [junit4]   2> 189523 INFO  (TEST-TestReqParamsAPI.test-seed#[819FD2FB7BA86F]) [    ] o.a.s.c.c.ConnectionManager Client is connected to ZooKeeper
   [junit4]   2> 189524 INFO  (TEST-TestReqParamsAPI.test-seed#[819FD2FB7BA86F]) [    ] o.a.s.c.c.SolrZkClient Using default ZkACLProvider
   [junit4]   2> 189524 INFO  (TEST-TestReqParamsAPI.test-seed#[819FD2FB7BA86F]) [    ] o.a.s.c.ZkController Added new OnReconnect listener org.apache.solr.cloud.ZkController$$Lambda$194/3488229@1f4c1a6
   [junit4]   2> 189524 INFO  (TEST-TestReqParamsAPI.test-seed#[819FD2FB7BA86F]) [    ] o.a.s.c.c.ConnectionManager Waiting for client to connect to ZooKeeper
   [junit4]   2> 189525 INFO  (zkCallback-508-thread-1) [    ] o.a.s.c.c.ConnectionManager Watcher org.apache.solr.common.cloud.ConnectionManager@1ebcd66 name:ZooKeeperConnection Watcher:127.0.0.1:46240/solr got event WatchedEvent state:SyncConnected type:None path:null path:null type:None
   [junit4]   2> 189525 INFO  (TEST-TestReqParamsAPI.test-seed#[819FD2FB7BA86F]) [    ] o.a.s.c.c.ConnectionManager Client is connected to ZooKeeper
   [junit4]   2> 189528 INFO  (TEST-TestReqParamsAPI.test-seed#[819FD2FB7BA86F]) [    ] o.a.s.c.c.ZkStateReader Updating cluster state from ZooKeeper... 
   [junit4]   2> 189528 INFO  (TEST-TestReqParamsAPI.test-seed#[819FD2FB7BA86F]) [    ] o.a.s.c.c.ZkStateReader Loaded empty cluster properties
   [junit4]   2> 189528 INFO  (TEST-TestReqParamsAPI.test-seed#[819FD2FB7BA86F]) [    ] o.a.s.c.c.ZkStateReader Updated live nodes from ZooKeeper... (0) -> (1)
   [junit4]   2> 189529 INFO  (TEST-TestReqParamsAPI.test-seed#[819FD2FB7BA86F]) [    ] o.a.s.c.Overseer Overseer (id=null) closing
   [junit4]   2> 189529 INFO  (TEST-TestReqParamsAPI.test-seed#[819FD2FB7BA86F]) [    ] o.a.s.c.LeaderElector Joined leadership election with path: /overseer_elect/election/95965823928958984-127.0.0.1:36194_-n_0000000001
   [junit4]   2> 189529 INFO  (TEST-TestReqParamsAPI.test-seed#[819FD2FB7BA86F]) [    ] o.a.s.c.LeaderElector Watching path /overseer_elect/election/95965823928958980-127.0.0.1:42194_-n_0000000000 to know if I could be the leader
   [junit4]   2> 189529 INFO  (TEST-TestReqParamsAPI.test-seed#[819FD2FB7BA86F]) [    ] o.a.s.c.ZkController Publish node=127.0.0.1:36194_ as DOWN
   [junit4]   2> 189530 INFO  (OverseerStateUpdate-95965823928958980-127.0.0.1:42194_-n_0000000000) [    ] o.a.s.c.Overseer processMessage: queueSize: 1, message = {
   [junit4]   2>   "operation":"downnode",
   [junit4]   2>   "node_name":"127.0.0.1:36194_"} current state version: 3
   [junit4]   2> 189530 INFO  (OverseerStateUpdate-95965823928958980-127.0.0.1:42194_-n_0000000000) [    ] o.a.s.c.o.NodeMutator DownNode state invoked for node: 127.0.0.1:36194_
   [junit4]   2> 189631 INFO  (zkCallback-503-thread-1) [    ] o.a.s.c.c.ZkStateReader A cluster state change: [WatchedEvent state:SyncConnected type:NodeDataChanged path:/clusterstate.json], has occurred - updating... (live nodes size: [1])
   [junit4]   2> 189631 INFO  (zkCallback-508-thread-1) [    ] o.a.s.c.c.ZkStateReader A cluster state change: [WatchedEvent state:SyncConnected type:NodeDataChanged path:/clusterstate.json], has occurred - updating... (live nodes size: [1])
   [junit4]   2> 189631 INFO  (zkCallback-499-thread-1) [    ] o.a.s.c.c.ZkStateReader A cluster state change: [WatchedEvent state:SyncConnected type:NodeDataChanged path:/clusterstate.json], has occurred - updating... (live nodes size: [1])
   [junit4]   2> 190530 INFO  (TEST-TestReqParamsAPI.test-seed#[819FD2FB7BA86F]) [    ] o.a.s.c.ZkController Register node as live in ZooKeeper:/live_nodes/127.0.0.1:36194_
   [junit4]   2> 190530 INFO  (TEST-TestReqParamsAPI.test-seed#[819FD2FB7BA86F]) [    ] o.a.s.c.c.SolrZkClient makePath: /live_nodes/127.0.0.1:36194_
   [junit4]   2> 190531 INFO  (zkCallback-503-thread-1) [    ] o.a.s.c.c.ZkStateReader A live node change: [WatchedEvent state:SyncConnected type:NodeChildrenChanged path:/live_nodes], has occurred - updating... (live nodes size: [1])
   [junit4]   2> 190531 INFO  (zkCallback-508-thread-1) [    ] o.a.s.c.c.ZkStateReader A live node change: [WatchedEvent state:SyncConnected type:NodeChildrenChanged path:/live_nodes], has occurred - updating... (live nodes size: [1])
   [junit4]   2> 190531 INFO  (zkCallback-499-thread-1) [    ] o.a.s.c.c.ZkStateReader A live node change: [WatchedEvent state:SyncConnected type:NodeChildrenChanged path:/live_nodes], has occurred - updating... (live nodes size: [1])
   [junit4]   2> 190531 INFO  (zkCallback-503-thread-1) [    ] o.a.s.c.c.ZkStateReader Updated live nodes from ZooKeeper... (1) -> (2)
   [junit4]   2> 190531 INFO  (zkCallback-508-thread-1) [    ] o.a.s.c.c.ZkStateReader Updated live nodes from ZooKeeper... (1) -> (2)
   [junit4]   2> 190531 INFO  (zkCallback-499-thread-1) [    ] o.a.s.c.c.ZkStateReader Updated live nodes from ZooKeeper... (1) -> (2)
   [junit4]   2> 190566 INFO  (TEST-TestReqParamsAPI.test-seed#[819FD2FB7BA86F]) [    ] o.a.s.c.CoreContainer Security conf doesn't exist. Skipping setup for authorization module.
   [junit4]   2> 190566 INFO  (TEST-TestReqParamsAPI.test-seed#[819FD2FB7BA86F]) [    ] o.a.s.c.CoreContainer No authentication plugin used.
   [junit4]   2> 190566 INFO  (TEST-TestReqParamsAPI.test-seed#[819FD2FB7BA86F]) [    ] o.a.s.c.CorePropertiesLocator Looking for core definitions underneath /home/jenkins/workspace/Lucene-Solr-6.x-Linux/solr/build/solr-core/test/J0/../../../../../../../../../home/jenkins/workspace/Lucene-Solr-6.x-Linux/solr/build/solr-core/test/J0/temp/solr.handler.TestReqParamsAPI_819FD2FB7BA86F-001/shard-1-001/cores
   [junit4]   2> 190567 INFO  (TEST-TestReqParamsAPI.test-seed#[819FD2FB7BA86F]) [    ] o.a.s.c.CoreDescriptor Created CoreDescriptor: {name=collection1, config=solrconfig.xml, transient=false, schema=schema.xml, loadOnStartup=true, configSetProperties=configsetprops.json, collection=collection1, coreNodeName=, dataDir=data/, shard=}
   [junit4]   2> 190567 INFO  (TEST-TestReqParamsAPI.test-seed#[819FD2FB7BA86F]) [    ] o.a.s.c.CorePropertiesLocator Found core collection1 in /home/jenkins/workspace/Lucene-Solr-6.x-Linux/solr/build/solr-core/test/J0/../../../../../../../../../home/jenkins/workspace/Lucene-Solr-6.x-Linux/solr/build/solr-core/test/J0/temp/solr.handler.TestReqParamsAPI_819FD2FB7BA86F-001/shard-1-001/cores/collection1
   [junit4]   2> 190567 INFO  (TEST-TestReqParamsAPI.test-seed#[819FD2FB7BA86F]) [    ] o.a.s.c.CorePropertiesLocator Found 1 core definitions
   [junit4]   2> 190568 INFO  (coreLoadExecutor-1079-thread-1) [    ] o.a.s.c.ZkController publishing state=down
   [junit4]   2> 190568 INFO  (coreLoadExecutor-1079-thread-1) [    ] o.a.s.c.ZkController numShards not found on descriptor - reading it from system property
   [junit4]   2> 190568 INFO  (TEST-TestReqParamsAPI.test-seed#[819FD2FB7BA86F]) [    ] o.a.s.s.SolrDispatchFilter user.dir=/home/jenkins/workspace/Lucene-Solr-6.x-Linux/solr/build/solr-core/test/J0
   [junit4]   2> 190568 INFO  (TEST-TestReqParamsAPI.test-seed#[819FD2FB7BA86F]) [    ] o.a.s.s.SolrDispatchFilter SolrDispatchFilter.init() done
   [junit4]   2> 190568 INFO  (coreLoadExecutor-1079-thread-1) [    ] o.a.s.c.ZkController Collection collection1 not visible yet, but flagging it so a watch is registered when it becomes visible
   [junit4]   2> 190569 INFO  (OverseerStateUpdate-95965823928958980-127.0.0.1:42194_-n_0000000000) [    ] o.a.s.c.Overseer processMessage: queueSize: 1, message = {
   [junit4]   2>   "core":"collection1",
   [junit4]   2>   "roles":null,
   [junit4]   2>   "base_url":"http://127.0.0.1:36194",
   [junit4]   2>   "node_name":"127.0.0.1:36194_",
   [junit4]   2>   "numShards":"2",
   [junit4]   2>   "state":"down",
   [junit4]   2>   "shard":null,
   [junit4]   2>   "collection":"collection1",
   [junit4]   2>   "operation":"state"} current state version: 4
   [junit4]   2> 190569 INFO  (OverseerStateUpdate-95965823928958980-127.0.0.1:42194_-n_0000000000) [    ] o.a.s.c.o.ReplicaMutator Update state numShards=2 message={
   [junit4]   2>   "core":"collection1",
   [junit4]   2>   "roles":null,
   [junit4]   2>   "base_url":"http://127.0.0.1:36194",
   [junit4]   2>   "node_name":"127.0.0.1:36194_",
   [junit4]   2>   "numShards":"2",
   [junit4]   2>   "state":"down",
   [junit4]   2>   "shard":null,
   [junit4]   2>   "collection":"collection1",
   [junit4]   2>   "operation":"state"}
   [junit4]   2> 190569 INFO  (coreLoadExecutor-1079-thread-1) [    ] o.a.s.c.c.ZkStateReader Deleting data for [collection1]
   [junit4]   2> 190569 INFO  (OverseerStateUpdate-95965823928958980-127.0.0.1:42194_-n_0000000000) [    ] o.a.s.c.o.ClusterStateMutator building a new cName: collection1
   [junit4]   2> 190569 INFO  (OverseerStateUpdate-95965823928958980-127.0.0.1:42194_-n_0000000000) [    ] o.a.s.c.o.ReplicaMutator Assigning new node to shard shard=shard2
   [junit4]   2> 190569 INFO  (coreLoadExecutor-1079-thread-1) [    ] o.a.s.c.ZkController look for our core node name
   [junit4]   2> 190670 INFO  (zkCallback-508-thread-1) [    ] o.a.s.c.c.ZkStateReader A cluster state change: [WatchedEvent state:SyncConnected type:NodeDataChanged path:/clusterstate.json], has occurred - updating... (live nodes size: [2])
   [junit4]   2> 190670 INFO  (zkCallback-499-thread-1) [    ] o.a.s.c.c.ZkStateReader A cluster state change: [WatchedEvent state:SyncConnected type:NodeDataChanged path:/clusterstate.json], has occurred - updating... (live nodes size: [2])
   [junit4]   2> 190670 INFO  (zkCallback-503-thread-1) [    ] o.a.s.c.c.ZkStateReader A cluster state change: [WatchedEvent state:SyncConnected type:NodeDataChanged path:/clusterstate.json], has occurred - updating... (live nodes size: [2])
   [junit4]   2> 191569 INFO  (coreLoadExecutor-1079-thread-1) [    ] o.a.s.c.ZkController waiting to find shard id in clusterstate for collection1
   [junit4]   2> 191569 INFO  (coreLoadExecutor-1079-thread-1) [    ] o.a.s.c.ZkController Check for collection zkNode:collection1
   [junit4]   2> 191570 INFO  (coreLoadExecutor-1079-thread-1) [    ] o.a.s.c.ZkController Collection zkNode exists
   [junit4]   2> 191570 INFO  (coreLoadExecutor-1079-thread-1) [    ] o.a.s.c.c.ZkStateReader Load collection config from: [/collections/collection1]
   [junit4]   2> 191570 INFO  (coreLoadExecutor-1079-thread-1) [    ] o.a.s.c.c.ZkStateReader path=[/collections/collection1] [configName]=[conf1] specified config exists in ZooKeeper
   [junit4]   2> 191570 INFO  (coreLoadExecutor-1079-thread-1) [    ] o.a.s.c.SolrResourceLoader new SolrResourceLoader for directory: '/home/jenkins/workspace/Lucene-Solr-6.x-Linux/solr/build/solr-core/test/J0/temp/solr.handler.TestReqParamsAPI_819FD2FB7BA86F-001/shard-1-001/cores/collection1'
   [junit4]   2> 191570 INFO  (coreLoadExecutor-1079-thread-1) [    ] o.a.s.c.SolrResourceLoader JNDI not configured for solr (NoInitialContextEx)
   [junit4]   2> 191570 INFO  (coreLoadExecutor-1079-thread-1) [    ] o.a.s.c.SolrResourceLoader solr home defaulted to 'solr/' (could not find system property or JNDI)
   [junit4]   2> 191571 INFO  (coreLoadExecutor-1079-thread-1) [    ] o.a.s.c.Config loaded config solrconfig.xml with version 0 
   [junit4]   2> 191574 INFO  (coreLoadExecutor-1079-thread-1) [    ] o.a.s.c.SolrConfig current version of requestparams : -1
   [junit4]   2> 191577 INFO  (coreLoadExecutor-1079-thread-1) [    ] o.a.s.c.SolrConfig Using Lucene MatchVersion: 6.1.0
   [junit4]   2> 191584 INFO  (coreLoadExecutor-1079-thread-1) [    ] o.a.s.c.SolrConfig Loaded SolrConfig: solrconfig.xml
   [junit4]   2> 191589 INFO  (coreLoadExecutor-1079-thread-1) [    ] o.a.s.s.IndexSchema [collection1] Schema name=test
   [junit4]   2> 191671 INFO  (coreLoadExecutor-1079-thread-1) [    ] o.a.s.s.OpenExchangeRatesOrgProvider Initialized with rates=open-exchange-rates.json, refreshInterval=1440.
   [junit4]   2> 191675 INFO  (coreLoadExecutor-1079-thread-1) [    ] o.a.s.s.IndexSchema default search field in schema is text
   [junit4]   2> 191676 INFO  (coreLoadExecutor-1079-thread-1) [    ] o.a.s.s.IndexSchema unique key field: id
   [junit4]   2> 191680 INFO  (coreLoadExecutor-1079-thread-1) [    ] o.a.s.s.FileExchangeRateProvider Reloading exchange rates from file currency.xml
   [junit4]   2> 191681 INFO  (coreLoadExecutor-1079-thread-1) [    ] o.a.s.s.FileExchangeRateProvider Reloading exchange rates from file currency.xml
   [junit4]   2> 191682 INFO  (coreLoadExecutor-1079-thread-1) [    ] o.a.s.s.OpenExchangeRatesOrgProvider Reloading exchange rates from open-exchange-rates.json
   [junit4]   2> 191683 INFO  (coreLoadExecutor-1079-thread-1) [    ] o.a.s.s.OpenExchangeRatesOrgProvider Reloading exchange rates from open-exchange-rates.json
   [junit4]   2> 191684 INFO  (coreLoadExecutor-1079-thread-1) [    ] o.a.s.c.ConfigSetProperties Did not find ConfigSet properties, assuming default properties: Can't find resource 'configsetprops.json' in classpath or '/configs/conf1', cwd=/home/jenkins/workspace/Lucene-Solr-6.x-Linux/solr/build/solr-core/test/J0
   [junit4]   2> 191684 INFO  (coreLoadExecutor-1079-thread-1) [    ] o.a.s.c.CoreContainer Creating SolrCore 'collection1' using configuration from collection collection1
   [junit4]   2> 191684 INFO  (coreLoadExecutor-1079-thread-1) [    ] o.a.s.c.SolrCore org.apache.solr.core.MockDirectoryFactory
   [junit4]   2> 191684 INFO  (coreLoadExecutor-1079-thread-1) [    ] o.a.s.c.SolrCore [[collection1] ] Opening new SolrCore at [/home/jenkins/workspace/Lucene-Solr-6.x-Linux/solr/build/solr-core/test/J0/temp/solr.handler.TestReqParamsAPI_819FD2FB7BA86F-001/shard-1-001/cores/collection1], dataDir=[/home/jenkins/workspace/Lucene-Solr-6.x-Linux/solr/build/solr-core/test/J0/../../../../../../../../../home/jenkins/workspace/Lucene-Solr-6.x-Linux/solr/build/solr-core/test/J0/temp/solr.handler.TestReqParamsAPI_819FD2FB7BA86F-001/shard-1-001/cores/collection1/data/]
   [junit4]   2> 191684 INFO  (coreLoadExecutor-1079-thread-1) [    ] o.a.s.c.JmxMonitoredMap JMX monitoring is enabled. Adding Solr mbeans to JMX Server: com.sun.jmx.mbeanserver.JmxMBeanServer@17b345e
   [junit4]   2> 191684 INFO  (coreLoadExecutor-1079-thread-1) [    ] o.a.s.c.CachingDirectoryFactory return new directory for /home/jenkins/workspace/Lucene-Solr-6.x-Linux/solr/build/solr-core/test/J0/../../../../../../../../../home/jenkins/workspace/Lucene-Solr-6.x-Linux/solr/build/solr-core/test/J0/temp/solr.handler.TestReqParamsAPI_819FD2FB7BA86F-001/shard-1-001/cores/collection1/data
   [junit4]   2> 191684 INFO  (coreLoadExecutor-1079-thread-1) [    ] o.a.s.c.SolrCore New index directory detected: old=null new=/home/jenkins/workspace/Lucene-Solr-6.x-Linux/solr/build/solr-core/test/J0/../../../../../../../../../home/jenkins/workspace/Lucene-Solr-6.x-Linux/solr/build/solr-core/test/J0/temp/solr.handler.TestReqParamsAPI_819FD2FB7BA86F-001/shard-1-001/cores/collection1/data/index/
   [junit4]   2> 191685 WARN  (coreLoadExecutor-1079-thread-1) [    ] o.a.s.c.SolrCore [collection1] Solr index directory '/home/jenkins/workspace/Lucene-Solr-6.x-Linux/solr/build/solr-core/test/J0/../../../../../../../../../home/jenkins/workspace/Lucene-Solr-6.x-Linux/solr/build/solr-core/test/J0/temp/solr.handler.TestReqParamsAPI_819FD2FB7BA86F-001/shard-1-001/cores/collection1/data/index' doesn't exist. Creating new index...
   [junit4]   2> 191685 INFO  (coreLoadExecutor-1079-thread-1) [    ] o.a.s.c.CachingDirectoryFactory return new directory for /home/jenkins/workspace/Lucene-Solr-6.x-Linux/solr/build/solr-core/test/J0/../../../../../../../../../home/jenkins/workspace/Lucene-Solr-6.x-Linux/solr/build/solr-core/test/J0/temp/solr.handler.TestReqParamsAPI_819FD2FB7BA86F-001/shard-1-001/cores/collection1/data/index
   [junit4]   2> 191685 INFO  (coreLoadExecutor-1079-thread-1) [    ] o.a.s.u.RandomMergePolicy RandomMergePolicy wrapping class org.apache.lucene.index.TieredMergePolicy: [TieredMergePolicy: maxMergeAtOnce=36, maxMergeAtOnceExplicit=35, maxMergedSegmentMB=28.94140625, floorSegmentMB=1.4990234375, forceMergeDeletesPctAllowed=22.70121123455061, segmentsPerTier=16.0, maxCFSSegmentSizeMB=8.796093022207999E12, noCFSRatio=0.6369606149909646
   [junit4]   2> 191685 INFO  (coreLoadExecutor-1079-thread-1) [    ] o.a.s.c.SolrDeletionPolicy SolrDeletionPolicy.onCommit: commits: num=1
   [junit4]   2> 	commit{dir=MockDirectoryWrapper(RAMDirectory@b74558 lockFactory=org.apache.lucene.store.SingleInstanceLockFactory@1449dcf),segFN=segments_1,generation=1}
   [junit4]   2> 191685 INFO  (coreLoadExecutor-1079-thread-1) [    ] o.a.s.c.SolrDeletionPolicy newest commit generation = 1
   [junit4]   2> 191685 INFO  (OldIndexDirectoryCleanupThreadForCore-collection1) [    ] o.a.s.c.SolrCore Looking for old index directories to cleanup for core collection1 in /home/jenkins/workspace/Lucene-Solr-6.x-Linux/solr/build/solr-core/test/J0/../../../../../../../../../home/jenkins/workspace/Lucene-Solr-6.x-Linux/solr/build/solr-core/test/J0/temp/solr.handler.TestReqParamsAPI_819FD2FB7BA86F-001/shard-1-001/cores/collection1/data/
   [junit4]   2> 191686 WARN  (OldIndexDirectoryCleanupThreadForCore-collection1) [    ] o.a.s.c.DirectoryFactory /home/jenkins/workspace/Lucene-Solr-6.x-Linux/solr/build/solr-core/test/J0/../../../../../../../../../home/jenkins/workspace/Lucene-Solr-6.x-Linux/solr/build/solr-core/test/J0/temp/solr.handler.TestReqParamsAPI_819FD2FB7BA86F-001/shard-1-001/cores/collection1/data/ does not point to a valid data directory; skipping clean-up of old index directories.
   [junit4]   2> 191688 INFO  (coreLoadExecutor-1079-thread-1) [    ] o.a.s.u.p.UpdateRequestProcessorChain creating updateRequestProcessorChain "nodistrib"
   [junit4]   2> 191689 INFO  (coreLoadExecutor-1079-thread-1) [    ] o.a.s.u.p.UpdateRequestProcessorChain creating updateRequestProcessorChain "dedupe"
   [junit4]   2> 191689 INFO  (coreLoadExecutor-1079-thread-1) [    ] o.a.s.u.p.UpdateRequestProcessorChain inserting DistributedUpdateProcessorFactory into updateRequestProcessorChain "dedupe"
   [junit4]   2> 191689 INFO  (coreLoadExecutor-1079-thread-1) [    ] o.a.s.u.p.UpdateRequestProcessorChain creating updateRequestProcessorChain "stored_sig"
   [junit4]   2> 191689 INFO  (coreLoadExecutor-1079-thread-1) [    ] o.a.s.u.p.UpdateRequestProcessorChain inserting DistributedUpdateProcessorFactory into updateRequestProcessorChain "stored_sig"
   [junit4]   2> 191689 INFO  (coreLoadExecutor-1079-thread-1) [    ] o.a.s.u.p.UpdateRequestProcessorChain creating updateRequestProcessorChain "distrib-dup-test-chain-explicit"
   [junit4]   2> 191689 INFO  (coreLoadExecutor-1079-thread-1) [    ] o.a.s.u.p.UpdateRequestProcessorChain creating updateRequestProcessorChain "distrib-dup-test-chain-implicit"
   [junit4]   2> 191689 INFO  (coreLoadExecutor-1079-thread-1) [    ] o.a.s.u.p.UpdateRequestProcessorChain inserting DistributedUpdateProcessorFactory into updateRequestProcessorChain "distrib-dup-test-chain-implicit"
   [junit4]   2> 191689 INFO  (coreLoadExecutor-1079-thread-1) [    ] o.a.s.c.SolrCore no updateRequestProcessorChain defined as default, creating implicit default
   [junit4]   2> 191689 WARN  (coreLoadExecutor-1079-thread-1) [    ] o.a.s.c.RequestHandlers INVALID paramSet a in requestHandler {type = requestHandler,name = /dump,class = DumpRequestHandler,args = {defaults={a=A,b=B}}}
   [junit4]   2> 191698 INFO  (coreLoadExecutor-1079-thread-1) [    ] o.a.s.h.l.XMLLoader xsltCacheLifetimeSeconds=60
   [junit4]   2> 191698 INFO  (coreLoadExecutor-1079-thread-1) [    ] o.a.s.h.l.XMLLoader xsltCacheLifetimeSeconds=60
   [junit4]   2> 191699 INFO  (coreLoadExecutor-1079-thread-1) [    ] o.a.s.h.l.XMLLoader xsltCacheLifetimeSeconds=60
   [junit4]   2> 191699 INFO  (coreLoadExecutor-1079-thread-1) [    ] o.a.s.h.l.XMLLoader xsltCacheLifetimeSeconds=60
   [junit4]   2> 191702 INFO  (coreLoadExecutor-1079-thread-1) [    ] o.a.s.c.RequestHandlers Registered paths: /admin/mbeans,standard,/update/json/docs,/admin/luke,/export,/get,/admin/properties,/update/json,/admin/threads,/dump,/update/csv,/sql,/graph,/admin/segments,/admin/system,/replication,/config,/stream,/schema,/admin/plugins,/admin/logging,/admin/ping,/update,/admin/file
   [junit4]   2> 191702 INFO  (coreLoadExecutor-1079-thread-1) [    ] o.a.s.c.SolrCore Using default statsCache cache: org.apache.solr.search.stats.LocalStatsCache
   [junit4]   2> 191702 INFO  (coreLoadExecutor-1079-thread-1) [    ] o.a.s.u.UpdateHandler Using UpdateLog implementation: org.apache.solr.update.UpdateLog
   [junit4]   2> 191702 INFO  (coreLoadExecutor-1079-thread-1) [    ] o.a.s.u.UpdateLog Initializing UpdateLog: dataDir= defaultSyncLevel=FLUSH numRecordsToKeep=100 maxNumLogsToKeep=10 numVersionBuckets=65536
   [junit4]   2> 191703 INFO  (coreLoadExecutor-1079-thread-1) [    ] o.a.s.u.CommitTracker Hard AutoCommit: disabled
   [junit4]   2> 191703 INFO  (coreLoadExecutor-1079-thread-1) [    ] o.a.s.u.CommitTracker Soft AutoCommit: disabled
   [junit4]   2> 191703 INFO  (coreLoadExecutor-1079-thread-1) [    ] o.a.s.u.RandomMergePolicy RandomMergePolicy wrapping class org.apache.lucene.index.LogDocMergePolicy: [LogDocMergePolicy: minMergeSize=1000, mergeFactor=31, maxMergeSize=9223372036854775807, maxMergeSizeForForcedMerge=9223372036854775807, calibrateSizeByDeletes=false, maxMergeDocs=2147483647, maxCFSSegmentSizeMB=8.796093022207999E12, noCFSRatio=1.0]
   [junit4]   2> 191704 INFO  (coreLoadExecutor-1079-thread-1) [    ] o.a.s.c.SolrDeletionPolicy SolrDeletionPolicy.onInit: commits: num=1
   [junit4]   2> 	commit{dir=MockDirectoryWrapper(RAMDirectory@b74558 lockFactory=org.apache.lucene.store.SingleInstanceLockFactory@1449dcf),segFN=segments_1,generation=1}
   [junit4]   2> 191704 INFO  (coreLoadExecutor-1079-thread-1) [    ] o.a.s.c.SolrDeletionPolicy newest commit generation = 1
   [junit4]   2> 191704 INFO  (coreLoadExecutor-1079-thread-1) [    ] o.a.s.s.SolrIndexSearcher Opening [Searcher@a5102[collection1] main]
   [junit4]   2> 191704 INFO  (coreLoadExecutor-1079-thread-1) [    ] o.a.s.c.c.ZkStateReader Load collection config from: [/collections/collection1]
   [junit4]   2> 191704 INFO  (coreLoadExecutor-1079-thread-1) [    ] o.a.s.c.c.ZkStateReader path=[/collections/collection1] [configName]=[conf1] specified config exists in ZooKeeper
   [junit4]   2> 191704 INFO  (coreLoadExecutor-1079-thread-1) [    ] o.a.s.r.ManagedResourceStorage Setting up ZooKeeper-based storage for the RestManager with znodeBase: /configs/conf1
   [junit4]   2> 191704 INFO  (coreLoadExecutor-1079-thread-1) [    ] o.a.s.r.ManagedResourceStorage Configured ZooKeeperStorageIO with znodeBase: /configs/conf1
   [junit4]   2> 191704 INFO  (coreLoadExecutor-1079-thread-1) [    ] o.a.s.r.RestManager Initializing RestManager with initArgs: {}
   [junit4]   2> 191704 INFO  (coreLoadExecutor-1079-thread-1) [    ] o.a.s.r.ManagedResourceStorage Reading _rest_managed.json using ZooKeeperStorageIO:path=/configs/conf1
   [junit4]   2> 191704 INFO  (coreLoadExecutor-1079-thread-1) [    ] o.a.s.r.ManagedResourceStorage No data found for znode /configs/conf1/_rest_managed.json
   [junit4]   2> 191704 INFO  (coreLoadExecutor-1079-thread-1) [    ] o.a.s.r.ManagedResourceStorage Loaded null at path _rest_managed.json using ZooKeeperStorageIO:path=/configs/conf1
   [junit4]   2> 191705 INFO  (coreLoadExecutor-1079-thread-1) [    ] o.a.s.r.RestManager Initializing 0 registered ManagedResources
   [junit4]   2> 191705 INFO  (coreLoadExecutor-1079-thread-1) [    ] o.a.s.h.ReplicationHandler Commits will be reserved for  10000
   [junit4]   2> 191705 INFO  (searcherExecutor-1080-thread-1) [    ] o.a.s.c.SolrCore [collection1] Registered new searcher Searcher@a5102[collection1] main{ExitableDirectoryReader(UninvertingDirectoryReader())}
   [junit4]   2> 191705 INFO  (coreLoadExecutor-1079-thread-1) [    ] o.a.s.u.UpdateLog Looking up max value of version field to seed version buckets
   [junit4]   2> 191705 INFO  (coreLoadExecutor-1079-thread-1) [    ] o.a.s.u.VersionInfo Refreshing highest value of _version_ for 65536 version buckets from index
   [junit4]   2> 191705 INFO  (coreLoadExecutor-1079-thread-1) [    ] o.a.s.u.VersionInfo No terms found for _version_, cannot seed version bucket highest value from index
   [junit4]   2> 191705 INFO  (coreLoadExecutor-1079-thread-1) [    ] o.a.s.u.UpdateLog Could not find max version in index or recent updates, using new clock 1535453186010120192
   [junit4]   2> 191707 INFO  (coreLoadExecutor-1079-thread-1) [    ] o.a.s.u.UpdateLog Took 1.0ms to seed version buckets with highest version 1535453186010120192
   [junit4]   2> 191707 INFO  (coreLoadExecutor-1079-thread-1) [    ] o.a.s.c.ZkController watch zkdir /configs/conf1
   [junit4]   2> 191707 INFO  (coreLoadExecutor-1079-thread-1) [    ] o.a.s.c.CoreContainer registering core: collection1
   [junit4]   2> 191708 INFO  (coreZkRegister-1074-thread-1) [    ] o.a.s.c.ZkController Register replica - core:collection1 address:http://127.0.0.1:36194 collection:collection1 shard:shard2
   [junit4]   2> 191708 INFO  (coreZkRegister-1074-thread-1) [    ] o.a.s.c.c.SolrZkClient makePath: /collections/collection1/leader_elect/shard2/election
   [junit4]   2> 191709 INFO  (coreZkRegister-1074-thread-1) [    ] o.a.s.c.LeaderElector Joined leadership election with path: /collections/collection1/leader_elect/shard2/election/95965823928958984-core_node1-n_0000000000
   [junit4]   2> 191709 INFO  (coreZkRegister-1074-thread-1) [    ] o.a.s.c.ShardLeaderElectionContext Running the leader process for shard=shard2 and weAreReplacement=false and leaderVoteWait=10000
   [junit4]   2> 191709 INFO  (coreZkRegister-1074-thread-1) [    ] o.a.s.c.ShardLeaderElectionContext Enough replicas found to continue.
   [junit4]   2> 191709 INFO  (coreZkRegister-1074-thread-1) [    ] o.a.s.c.ShardLeaderElectionContext I may be the new leader - try and sync
   [junit4]   2> 191710 INFO  (coreZkRegister-1074-thread-1) [    ] o.a.s.c.SyncStrategy Sync replicas to http://127.0.0.1:36194/collection1/
   [junit4]   2> 191710 INFO  (coreZkRegister-1074-thread-1) [    ] o.a.s.c.SyncStrategy Sync Success - now sync replicas to me
   [junit4]   2> 191710 INFO  (coreZkRegister-1074-thread-1) [    ] o.a.s.c.SyncStrategy http://127.0.0.1:36194/collection1/ has no replicas
   [junit4]   2> 191710 INFO  (OverseerStateUpdate-95965823928958980-127.0.0.1:42194_-n_0000000000) [    ] o.a.s.c.Overseer processMessage: queueSize: 1, message = {
   [junit4]   2>   "operation":"leader",
   [junit4]   2>   "shard":"shard2",
   [junit4]   2>   "collection":"collection1"} current state version: 5
   [junit4]   2> 191710 INFO  (coreZkRegister-1074-thread-1) [    ] o.a.s.c.c.SolrZkClient makePath: /collections/collection1/leaders/shard2
   [junit4]   2> 191711 INFO  (coreZkRegister-1074-thread-1) [    ] o.a.s.c.ShardLeaderElectionContextBase Creating leader registration node /collections/collection1/leaders/shard2/leader after winning as /collections/collection1/leader_elect/shard2/election/95965823928958984-core_node1-n_0000000000
   [junit4]   2> 191711 INFO  (coreZkRegister-1074-thread-1) [    ] o.a.s.c.ShardLeaderElectionContext I am the new leader: http://127.0.0.1:36194/collection1/ shard2
   [junit4]   2> 191712 INFO  (OverseerStateUpdate-95965823928958980-127.0.0.1:42194_-n_0000000000) [    ] o.a.s.c.Overseer processMessage: queueSize: 1, message = {
   [junit4]   2>   "operation":"leader",
   [junit4]   2>   "shard":"shard2",
   [junit4]   2>   "collection":"collection1",
   [junit4]   2>   "base_url":"http://127.0.0.1:36194",
   [junit4]   2>   "core":"collection1",
   [junit4]   2>   "state":"active"} current state version: 5
   [junit4]   2> 191813 INFO  (zkCallback-508-thread-1) [    ] o.a.s.c.c.ZkStateReader A cluster state change: [WatchedEvent state:SyncConnected type:NodeDataChanged path:/clusterstate.json], has occurred - updating... (live nodes size: [2])
   [junit4]   2> 191813 INFO  (zkCallback-503-thread-1) [    ] o.a.s.c.c.ZkStateReader A cluster state change: [WatchedEvent state:SyncConnected type:NodeDataChanged path:/clusterstate.json], has occurred - updating... (live nodes size: [2])
   [junit4]   2> 191813 INFO  (zkCallback-499-thread-1) [    ] o.a.s.c.c.ZkStateReader A cluster state change: [WatchedEvent state:SyncConnected type:NodeDataChanged path:/clusterstate.json], has occurred - updating... (live nodes size: [2])
   [junit4]   2> 191862 INFO  (coreZkRegister-1074-thread-1) [    ] o.a.s.c.ZkController We are http://127.0.0.1:36194/collection1/ and leader is http://127.0.0.1:36194/collection1/
   [junit4]   2> 191862 INFO  (coreZkRegister-1074-thread-1) [    ] o.a.s.c.ZkController No LogReplay needed for core=collection1 baseURL=http://127.0.0.1:36194
   [junit4]   2> 191862 INFO  (coreZkRegister-1074-thread-1) [    ] o.a.s.c.ZkController I am the leader, no recovery necessary
   [junit4]   2> 191862 INFO  (coreZkRegister-1074-thread-1) [    ] o.a.s.c.ZkController publishing state=active
   [junit4]   2> 191862 INFO  (coreZkRegister-1074-thread-1) [    ] o.a.s.c.ZkController numShards not found on descriptor - reading it from system property
   [junit4]   2> 191863 INFO  (OverseerStateUpdate-95965823928958980-127.0.0.1:42194_-n_0000000000) [    ] o.a.s.c.Overseer processMessage: queueSize: 1, message = {
   [junit4]   2>   "core":"collection1",
   [junit4]   2>   "core_node_name":"core_node1",
   [junit4]   2>   "roles":null,
   [junit4]   2>   "base_url":"http://127.0.0.1:36194",
   [junit4]   2>   "node_name":"127.0.0.1:36194_",
   [junit4]   2>   "numShards":"2",
   [junit4]   2>   "state":"active",
   [junit4]   2>   "shard":"shard2",
   [junit4]   2>   "collection":"collection1",
   [junit4]   2>   "operation":"state"} current state version: 6
   [junit4]   2> 191863 INFO  (OverseerStateUpdate-95965823928958980-127.0.0.1:42194_-n_0000000000) [    ] o.a.s.c.o.ReplicaMutator Update state numShards=2 message={
   [junit4]   2>   "core":"collection1",
   [junit4]   2>   "core_node_name":"core_node1",
   [junit4]   2>   "roles":null,
   [junit4]   2>   "base_url":"http://127.0.0.1:36194",
   [junit4]   2>   "node_name":"127.0.0.1:36194_",
   [junit4]   2>   "numShards":"2",
   [junit4]   2>   "state":"active",
   [junit4]   2>   "shard":"shard2",
   [junit4]   2>   "collection":"collection1",
   [junit4]   2>   "operation":"state"}
   [junit4]   2> 191964 INFO  

[...truncated too long message...]

001/shard-4-001/cores/collection1/data
   [junit4]   2> 214089 INFO  (zkCallback-527-thread-2) [    ] o.a.s.c.CachingDirectoryFactory looking to close /home/jenkins/workspace/Lucene-Solr-6.x-Linux/solr/build/solr-core/test/J0/../../../../../../../../../home/jenkins/workspace/Lucene-Solr-6.x-Linux/solr/build/solr-core/test/J0/temp/solr.handler.TestReqParamsAPI_819FD2FB7BA86F-001/shard-4-001/cores/collection1/data/index [CachedDir<<refCount=0;path=/home/jenkins/workspace/Lucene-Solr-6.x-Linux/solr/build/solr-core/test/J0/../../../../../../../../../home/jenkins/workspace/Lucene-Solr-6.x-Linux/solr/build/solr-core/test/J0/temp/solr.handler.TestReqParamsAPI_819FD2FB7BA86F-001/shard-4-001/cores/collection1/data/index;done=false>>]
   [junit4]   2> 214089 INFO  (zkCallback-527-thread-2) [    ] o.a.s.c.CachingDirectoryFactory Closing directory, CoreContainer#isShutdown=true
   [junit4]   2> 214089 INFO  (zkCallback-527-thread-2) [    ] o.a.s.c.CachingDirectoryFactory Closing directory: /home/jenkins/workspace/Lucene-Solr-6.x-Linux/solr/build/solr-core/test/J0/../../../../../../../../../home/jenkins/workspace/Lucene-Solr-6.x-Linux/solr/build/solr-core/test/J0/temp/solr.handler.TestReqParamsAPI_819FD2FB7BA86F-001/shard-4-001/cores/collection1/data/index
   [junit4]   2> 214090 INFO  (zkCallback-527-thread-2) [    ] o.a.s.c.ElectionContext Canceling election /collections/collection1/leader_elect/shard1/election/95965823928958993-core_node4-n_0000000001
   [junit4]   2> 214090 WARN  (zkCallback-527-thread-2) [    ] o.a.s.c.LeaderElector 
   [junit4]   2> org.apache.zookeeper.KeeperException$SessionExpiredException: KeeperErrorCode = Session expired for /collections/collection1/leader_elect/shard1/election/95965823928958993-core_node4-n_0000000001
   [junit4]   2> 	at org.apache.zookeeper.KeeperException.create(KeeperException.java:127)
   [junit4]   2> 	at org.apache.zookeeper.KeeperException.create(KeeperException.java:51)
   [junit4]   2> 	at org.apache.zookeeper.ZooKeeper.delete(ZooKeeper.java:873)
   [junit4]   2> 	at org.apache.solr.common.cloud.SolrZkClient$2.execute(SolrZkClient.java:244)
   [junit4]   2> 	at org.apache.solr.common.cloud.SolrZkClient$2.execute(SolrZkClient.java:241)
   [junit4]   2> 	at org.apache.solr.common.cloud.ZkCmdExecutor.retryOperation(ZkCmdExecutor.java:60)
   [junit4]   2> 	at org.apache.solr.common.cloud.SolrZkClient.delete(SolrZkClient.java:241)
   [junit4]   2> 	at org.apache.solr.cloud.ElectionContext.cancelElection(ElectionContext.java:86)
   [junit4]   2> 	at org.apache.solr.cloud.ShardLeaderElectionContextBase.cancelElection(ElectionContext.java:143)
   [junit4]   2> 	at org.apache.solr.cloud.ShardLeaderElectionContext.cancelElection(ElectionContext.java:279)
   [junit4]   2> 	at org.apache.solr.cloud.ShardLeaderElectionContext.runLeaderProcess(ElectionContext.java:455)
   [junit4]   2> 	at org.apache.solr.cloud.LeaderElector.runIamLeaderProcess(LeaderElector.java:170)
   [junit4]   2> 	at org.apache.solr.cloud.LeaderElector.checkIfIamLeader(LeaderElector.java:135)
   [junit4]   2> 	at org.apache.solr.cloud.LeaderElector.access$200(LeaderElector.java:56)
   [junit4]   2> 	at org.apache.solr.cloud.LeaderElector$ElectionWatcher.process(LeaderElector.java:348)
   [junit4]   2> 	at org.apache.solr.common.cloud.SolrZkClient$3.lambda$process$0(SolrZkClient.java:266)
   [junit4]   2> 	at java.util.concurrent.Executors$RunnableAdapter.call(java.base@9-ea/Executors.java:514)
   [junit4]   2> 	at java.util.concurrent.FutureTask.run(java.base@9-ea/FutureTask.java:266)
   [junit4]   2> 	at org.apache.solr.common.util.ExecutorUtil$MDCAwareThreadPoolExecutor.lambda$execute$0(ExecutorUtil.java:229)
   [junit4]   2> 	at java.util.concurrent.ThreadPoolExecutor.runWorker(java.base@9-ea/ThreadPoolExecutor.java:1158)
   [junit4]   2> 	at java.util.concurrent.ThreadPoolExecutor$Worker.run(java.base@9-ea/ThreadPoolExecutor.java:632)
   [junit4]   2> 	at java.lang.Thread.run(java.base@9-ea/Thread.java:804)
   [junit4]   2> 214091 INFO  (TEST-TestReqParamsAPI.test-seed#[819FD2FB7BA86F]) [    ] o.e.j.s.ServerConnector Stopped ServerConnector@d59788{HTTP/1.1,[http/1.1]}{127.0.0.1:0}
   [junit4]   2> 214091 INFO  (TEST-TestReqParamsAPI.test-seed#[819FD2FB7BA86F]) [    ] o.e.j.s.h.ContextHandler Stopped o.e.j.s.ServletContextHandler@fef0c5{/,null,UNAVAILABLE}
   [junit4]   2> 214092 INFO  (TEST-TestReqParamsAPI.test-seed#[819FD2FB7BA86F]) [    ] o.a.s.c.ZkTestServer connecting to 127.0.0.1:46240 46240
   [junit4]   2> 234147 INFO  (Thread-601) [    ] o.a.s.c.ZkTestServer connecting to 127.0.0.1:46240 46240
   [junit4]   2> 234148 WARN  (Thread-601) [    ] o.a.s.c.ZkTestServer Watch limit violations: 
   [junit4]   2> Maximum concurrent create/delete watches above limit:
   [junit4]   2> 
   [junit4]   2> 	25	/solr/configs/conf1
   [junit4]   2> 	6	/solr/aliases.json
   [junit4]   2> 	6	/solr/clusterprops.json
   [junit4]   2> 	5	/solr/security.json
   [junit4]   2> 	4	/solr/collections/collection1/state.json
   [junit4]   2> 
   [junit4]   2> Maximum concurrent data watches above limit:
   [junit4]   2> 
   [junit4]   2> 	6	/solr/clusterstate.json
   [junit4]   2> 
   [junit4]   2> Maximum concurrent children watches above limit:
   [junit4]   2> 
   [junit4]   2> 	6	/solr/live_nodes
   [junit4]   2> 	6	/solr/collections
   [junit4]   2> 	4	/solr/overseer/collection-queue-work
   [junit4]   2> 	3	/solr/overseer/queue
   [junit4]   2> 
   [junit4]   2> NOTE: reproduce with: ant test  -Dtestcase=TestReqParamsAPI -Dtests.method=test -Dtests.seed=819FD2FB7BA86F -Dtests.multiplier=3 -Dtests.slow=true -Dtests.locale=sah-RU -Dtests.timezone=America/Iqaluit -Dtests.asserts=true -Dtests.file.encoding=ISO-8859-1
   [junit4] FAILURE 45.5s J0 | TestReqParamsAPI.test <<<
   [junit4]    > Throwable #1: java.lang.AssertionError: Could not get expected value  'CY val' for path 'response/params/y/c' full output: {
   [junit4]    >   "responseHeader":{
   [junit4]    >     "status":0,
   [junit4]    >     "QTime":0},
   [junit4]    >   "response":{
   [junit4]    >     "znodeVersion":0,
   [junit4]    >     "params":{"x":{
   [junit4]    >         "a":"A val",
   [junit4]    >         "b":"B val",
   [junit4]    >         "":{"v":0}}}}},  from server:  http://127.0.0.1:38829/collection1
   [junit4]    > 	at __randomizedtesting.SeedInfo.seed([819FD2FB7BA86F:88D5A0085587C597]:0)
   [junit4]    > 	at org.apache.solr.core.TestSolrConfigHandler.testForResponseElement(TestSolrConfigHandler.java:457)
   [junit4]    > 	at org.apache.solr.handler.TestReqParamsAPI.testReqParams(TestReqParamsAPI.java:160)
   [junit4]    > 	at org.apache.solr.handler.TestReqParamsAPI.test(TestReqParamsAPI.java:62)
   [junit4]    > 	at jdk.internal.reflect.NativeMethodAccessorImpl.invoke0(java.base@9-ea/Native Method)
   [junit4]    > 	at jdk.internal.reflect.NativeMethodAccessorImpl.invoke(java.base@9-ea/NativeMethodAccessorImpl.java:62)
   [junit4]    > 	at jdk.internal.reflect.DelegatingMethodAccessorImpl.invoke(java.base@9-ea/DelegatingMethodAccessorImpl.java:43)
   [junit4]    > 	at org.apache.solr.BaseDistributedSearchTestCase$ShardsRepeatRule$ShardsFixedStatement.callStatement(BaseDistributedSearchTestCase.java:992)
   [junit4]    > 	at org.apache.solr.BaseDistributedSearchTestCase$ShardsRepeatRule$ShardsStatement.evaluate(BaseDistributedSearchTestCase.java:967)
   [junit4]    > 	at java.lang.Thread.run(java.base@9-ea/Thread.java:804)
   [junit4]   2> 234155 INFO  (SUITE-TestReqParamsAPI-seed#[819FD2FB7BA86F]-worker) [    ] o.a.s.SolrTestCaseJ4 ###deleteCore
   [junit4]   2> NOTE: leaving temporary files on disk at: /home/jenkins/workspace/Lucene-Solr-6.x-Linux/solr/build/solr-core/test/J0/temp/solr.handler.TestReqParamsAPI_819FD2FB7BA86F-001
   [junit4]   2> NOTE: test params are: codec=FastDecompressionCompressingStoredFields(storedFieldsFormat=CompressingStoredFieldsFormat(compressionMode=FAST_DECOMPRESSION, chunkSize=6, maxDocsPerChunk=10, blockSize=990), termVectorsFormat=CompressingTermVectorsFormat(compressionMode=FAST_DECOMPRESSION, chunkSize=6, blockSize=990)), sim=ClassicSimilarity, locale=sah-RU, timezone=America/Iqaluit
   [junit4]   2> NOTE: Linux 4.4.0-21-generic i386/Oracle Corporation 9-ea (32-bit)/cpus=12,threads=1,free=31765528,total=218300416
   [junit4]   2> NOTE: All tests run in this JVM: [StandardRequestHandlerTest, DataDrivenBlockJoinTest, DefaultValueUpdateProcessorTest, ResponseHeaderTest, TestNonDefinedSimilarityFactory, TriLevelCompositeIdRoutingTest, TestOnReconnectListenerSupport, TestConfig, CdcrVersionReplicationTest, JSONWriterTest, TestConfigSets, MergeStrategyTest, TestSolrConfigHandlerCloud, TestReqParamsAPI]
   [junit4] Completed [28/599 (1!)] on J0 in 45.47s, 1 test, 1 failure <<< FAILURES!

[...truncated 1866 lines...]
BUILD FAILED
/home/jenkins/workspace/Lucene-Solr-6.x-Linux/build.xml:740: The following error occurred while executing this line:
/home/jenkins/workspace/Lucene-Solr-6.x-Linux/build.xml:684: The following error occurred while executing this line:
/home/jenkins/workspace/Lucene-Solr-6.x-Linux/build.xml:59: The following error occurred while executing this line:
/home/jenkins/workspace/Lucene-Solr-6.x-Linux/solr/build.xml:233: The following error occurred while executing this line:
/home/jenkins/workspace/Lucene-Solr-6.x-Linux/solr/common-build.xml:531: The following error occurred while executing this line:
/home/jenkins/workspace/Lucene-Solr-6.x-Linux/lucene/common-build.xml:1427: The following error occurred while executing this line:
/home/jenkins/workspace/Lucene-Solr-6.x-Linux/lucene/common-build.xml:984: There were test failures: 599 suites (10 ignored), 2441 tests, 1 failure, 117 ignored (71 assumptions) [seed: 819FD2FB7BA86F]

Total time: 73 minutes 37 seconds
Build step 'Invoke Ant' marked build as failure
Archiving artifacts
[WARNINGS] Skipping publisher since build result is FAILURE
Recording test results
Email was triggered for: Failure - Any
Sending email for trigger: Failure - Any