You are viewing a plain text version of this content. The canonical link for it is here.
Posted to builds@solr.apache.org by Apache Jenkins Server <je...@builds.apache.org> on 2026/06/28 13:55:14 UTC

[JENKINS] Solr » Solr-Test-9.x - Build # 11115 - Still Unstable!

Build: https://ci-builds.apache.org/job/Solr/job/Solr-Test-9.x/11115/

4 tests failed.
FAILED:  org.apache.solr.cloud.LeaderElectionIntegrationTest.testSimpleSliceLeaderElection

Error Message:
java.util.concurrent.ExecutionException: java.lang.IllegalStateException: STOPPED

Stack Trace:
java.util.concurrent.ExecutionException: java.lang.IllegalStateException: STOPPED
	at __randomizedtesting.SeedInfo.seed([1101332846D31611:4F35FE6605AC8AF6]:0)
	at java.base/java.util.concurrent.CompletableFuture.reportGet(CompletableFuture.java:395)
	at java.base/java.util.concurrent.CompletableFuture.get(CompletableFuture.java:2028)
	at org.eclipse.jetty.server.Server.doStop(Server.java:490)
	at org.eclipse.jetty.util.component.AbstractLifeCycle.stop(AbstractLifeCycle.java:132)
	at org.apache.solr.embedded.JettySolrRunner.retryOnPortBindFailure(JettySolrRunner.java:598)
	at org.apache.solr.embedded.JettySolrRunner.start(JettySolrRunner.java:538)
	at org.apache.solr.embedded.JettySolrRunner.start(JettySolrRunner.java:509)
	at org.apache.solr.cloud.LeaderElectionIntegrationTest.testSimpleSliceLeaderElection(LeaderElectionIntegrationTest.java:93)
	at java.base/jdk.internal.reflect.NativeMethodAccessorImpl.invoke0(Native Method)
	at java.base/jdk.internal.reflect.NativeMethodAccessorImpl.invoke(NativeMethodAccessorImpl.java:62)
	at java.base/jdk.internal.reflect.DelegatingMethodAccessorImpl.invoke(DelegatingMethodAccessorImpl.java:43)
	at java.base/java.lang.reflect.Method.invoke(Method.java:566)
	at com.carrotsearch.randomizedtesting.RandomizedRunner.invoke(RandomizedRunner.java:1763)
	at com.carrotsearch.randomizedtesting.RandomizedRunner$8.evaluate(RandomizedRunner.java:946)
	at com.carrotsearch.randomizedtesting.RandomizedRunner$9.evaluate(RandomizedRunner.java:982)
	at com.carrotsearch.randomizedtesting.RandomizedRunner$10.evaluate(RandomizedRunner.java:996)
	at com.carrotsearch.randomizedtesting.rules.SystemPropertiesRestoreRule$1.evaluate(SystemPropertiesRestoreRule.java:80)
	at org.junit.rules.RunRules.evaluate(RunRules.java:20)
	at org.apache.lucene.tests.util.TestRuleSetupTeardownChained$1.evaluate(TestRuleSetupTeardownChained.java:48)
	at org.apache.lucene.tests.util.AbstractBeforeAfterRule$1.evaluate(AbstractBeforeAfterRule.java:43)
	at org.apache.lucene.tests.util.TestRuleThreadAndTestName$1.evaluate(TestRuleThreadAndTestName.java:45)
	at org.apache.lucene.tests.util.TestRuleIgnoreAfterMaxFailures$1.evaluate(TestRuleIgnoreAfterMaxFailures.java:60)
	at org.apache.lucene.tests.util.TestRuleMarkFailure$1.evaluate(TestRuleMarkFailure.java:44)
	at org.junit.rules.RunRules.evaluate(RunRules.java:20)
	at com.carrotsearch.randomizedtesting.rules.StatementAdapter.evaluate(StatementAdapter.java:36)
	at com.carrotsearch.randomizedtesting.ThreadLeakControl$StatementRunner.run(ThreadLeakControl.java:390)
	at com.carrotsearch.randomizedtesting.ThreadLeakControl.forkTimeoutingTask(ThreadLeakControl.java:843)
	at com.carrotsearch.randomizedtesting.ThreadLeakControl$3.evaluate(ThreadLeakControl.java:490)
	at com.carrotsearch.randomizedtesting.RandomizedRunner.runSingleTest(RandomizedRunner.java:955)
	at com.carrotsearch.randomizedtesting.RandomizedRunner$5.evaluate(RandomizedRunner.java:840)
	at com.carrotsearch.randomizedtesting.RandomizedRunner$6.evaluate(RandomizedRunner.java:891)
	at com.carrotsearch.randomizedtesting.RandomizedRunner$7.evaluate(RandomizedRunner.java:902)
	at com.carrotsearch.randomizedtesting.rules.StatementAdapter.evaluate(StatementAdapter.java:36)
	at com.carrotsearch.randomizedtesting.rules.StatementAdapter.evaluate(StatementAdapter.java:36)
	at org.apache.lucene.tests.util.AbstractBeforeAfterRule$1.evaluate(AbstractBeforeAfterRule.java:43)
	at org.apache.lucene.tests.util.AbstractBeforeAfterRule$1.evaluate(AbstractBeforeAfterRule.java:43)
	at com.carrotsearch.randomizedtesting.rules.SystemPropertiesRestoreRule$1.evaluate(SystemPropertiesRestoreRule.java:80)
	at org.junit.rules.RunRules.evaluate(RunRules.java:20)
	at org.apache.lucene.tests.util.AbstractBeforeAfterRule$1.evaluate(AbstractBeforeAfterRule.java:43)
	at com.carrotsearch.randomizedtesting.rules.StatementAdapter.evaluate(StatementAdapter.java:36)
	at org.apache.lucene.tests.util.TestRuleStoreClassName$1.evaluate(TestRuleStoreClassName.java:38)
	at com.carrotsearch.randomizedtesting.rules.NoShadowingOrOverridesOnMethodsRule$1.evaluate(NoShadowingOrOverridesOnMethodsRule.java:40)
	at com.carrotsearch.randomizedtesting.rules.NoShadowingOrOverridesOnMethodsRule$1.evaluate(NoShadowingOrOverridesOnMethodsRule.java:40)
	at com.carrotsearch.randomizedtesting.rules.StatementAdapter.evaluate(StatementAdapter.java:36)
	at com.carrotsearch.randomizedtesting.rules.StatementAdapter.evaluate(StatementAdapter.java:36)
	at org.apache.lucene.tests.util.TestRuleAssertionsRequired$1.evaluate(TestRuleAssertionsRequired.java:53)
	at org.apache.lucene.tests.util.AbstractBeforeAfterRule$1.evaluate(AbstractBeforeAfterRule.java:43)
	at org.apache.lucene.tests.util.TestRuleMarkFailure$1.evaluate(TestRuleMarkFailure.java:44)
	at org.apache.lucene.tests.util.TestRuleIgnoreAfterMaxFailures$1.evaluate(TestRuleIgnoreAfterMaxFailures.java:60)
	at org.apache.lucene.tests.util.TestRuleIgnoreTestSuites$1.evaluate(TestRuleIgnoreTestSuites.java:47)
	at org.junit.rules.RunRules.evaluate(RunRules.java:20)
	at com.carrotsearch.randomizedtesting.rules.StatementAdapter.evaluate(StatementAdapter.java:36)
	at com.carrotsearch.randomizedtesting.ThreadLeakControl$StatementRunner.run(ThreadLeakControl.java:390)
	at com.carrotsearch.randomizedtesting.ThreadLeakControl.lambda$forkTimeoutingTask$0(ThreadLeakControl.java:850)
	at java.base/java.lang.Thread.run(Thread.java:829)
Caused by: java.lang.IllegalStateException: STOPPED
	at org.eclipse.jetty.server.handler.ContextHandler.shutdown(ContextHandler.java:773)
	at java.base/java.util.stream.ReferencePipeline$3$1.accept(ReferencePipeline.java:195)
	at java.base/java.util.ArrayList$ArrayListSpliterator.forEachRemaining(ArrayList.java:1655)
	at java.base/java.util.stream.AbstractPipeline.copyInto(AbstractPipeline.java:484)
	at java.base/java.util.stream.AbstractPipeline.wrapAndCopyInto(AbstractPipeline.java:474)
	at java.base/java.util.stream.AbstractPipeline.evaluate(AbstractPipeline.java:550)
	at java.base/java.util.stream.AbstractPipeline.evaluateToArrayNode(AbstractPipeline.java:260)
	at java.base/java.util.stream.ReferencePipeline.toArray(ReferencePipeline.java:517)
	at org.eclipse.jetty.util.component.Graceful.shutdown(Graceful.java:146)
	... 53 more


FAILED:  org.apache.solr.cloud.LeaderElectionIntegrationTest.classMethod

Error Message:
java.lang.Exception: Error shutting down MiniSolrCloudCluster

Stack Trace:
java.lang.Exception: Error shutting down MiniSolrCloudCluster
	at __randomizedtesting.SeedInfo.seed([1101332846D31611]:0)
	at org.apache.solr.cloud.MiniSolrCloudCluster.checkForExceptions(MiniSolrCloudCluster.java:850)
	at org.apache.solr.cloud.MiniSolrCloudCluster.shutdown(MiniSolrCloudCluster.java:752)
	at org.apache.solr.cloud.SolrCloudTestCase.shutdownCluster(SolrCloudTestCase.java:118)
	at java.base/jdk.internal.reflect.NativeMethodAccessorImpl.invoke0(Native Method)
	at java.base/jdk.internal.reflect.NativeMethodAccessorImpl.invoke(NativeMethodAccessorImpl.java:62)
	at java.base/jdk.internal.reflect.DelegatingMethodAccessorImpl.invoke(DelegatingMethodAccessorImpl.java:43)
	at java.base/java.lang.reflect.Method.invoke(Method.java:566)
	at com.carrotsearch.randomizedtesting.RandomizedRunner.invoke(RandomizedRunner.java:1763)
	at com.carrotsearch.randomizedtesting.RandomizedRunner$7.evaluate(RandomizedRunner.java:909)
	at com.carrotsearch.randomizedtesting.rules.StatementAdapter.evaluate(StatementAdapter.java:36)
	at com.carrotsearch.randomizedtesting.rules.StatementAdapter.evaluate(StatementAdapter.java:36)
	at org.apache.lucene.tests.util.AbstractBeforeAfterRule$1.evaluate(AbstractBeforeAfterRule.java:43)
	at org.apache.lucene.tests.util.AbstractBeforeAfterRule$1.evaluate(AbstractBeforeAfterRule.java:43)
	at com.carrotsearch.randomizedtesting.rules.SystemPropertiesRestoreRule$1.evaluate(SystemPropertiesRestoreRule.java:80)
	at org.junit.rules.RunRules.evaluate(RunRules.java:20)
	at org.apache.lucene.tests.util.AbstractBeforeAfterRule$1.evaluate(AbstractBeforeAfterRule.java:43)
	at com.carrotsearch.randomizedtesting.rules.StatementAdapter.evaluate(StatementAdapter.java:36)
	at org.apache.lucene.tests.util.TestRuleStoreClassName$1.evaluate(TestRuleStoreClassName.java:38)
	at com.carrotsearch.randomizedtesting.rules.NoShadowingOrOverridesOnMethodsRule$1.evaluate(NoShadowingOrOverridesOnMethodsRule.java:40)
	at com.carrotsearch.randomizedtesting.rules.NoShadowingOrOverridesOnMethodsRule$1.evaluate(NoShadowingOrOverridesOnMethodsRule.java:40)
	at com.carrotsearch.randomizedtesting.rules.StatementAdapter.evaluate(StatementAdapter.java:36)
	at com.carrotsearch.randomizedtesting.rules.StatementAdapter.evaluate(StatementAdapter.java:36)
	at org.apache.lucene.tests.util.TestRuleAssertionsRequired$1.evaluate(TestRuleAssertionsRequired.java:53)
	at org.apache.lucene.tests.util.AbstractBeforeAfterRule$1.evaluate(AbstractBeforeAfterRule.java:43)
	at org.apache.lucene.tests.util.TestRuleMarkFailure$1.evaluate(TestRuleMarkFailure.java:44)
	at org.apache.lucene.tests.util.TestRuleIgnoreAfterMaxFailures$1.evaluate(TestRuleIgnoreAfterMaxFailures.java:60)
	at org.apache.lucene.tests.util.TestRuleIgnoreTestSuites$1.evaluate(TestRuleIgnoreTestSuites.java:47)
	at org.junit.rules.RunRules.evaluate(RunRules.java:20)
	at com.carrotsearch.randomizedtesting.rules.StatementAdapter.evaluate(StatementAdapter.java:36)
	at com.carrotsearch.randomizedtesting.ThreadLeakControl$StatementRunner.run(ThreadLeakControl.java:390)
	at com.carrotsearch.randomizedtesting.ThreadLeakControl.lambda$forkTimeoutingTask$0(ThreadLeakControl.java:850)
	at java.base/java.lang.Thread.run(Thread.java:829)
	Suppressed: java.util.concurrent.ExecutionException: java.lang.IllegalStateException: STOPPED
		at java.base/java.util.concurrent.CompletableFuture.reportGet(CompletableFuture.java:395)
		at java.base/java.util.concurrent.CompletableFuture.get(CompletableFuture.java:2028)
		at org.eclipse.jetty.server.Server.doStop(Server.java:490)
		at org.eclipse.jetty.util.component.AbstractLifeCycle.stop(AbstractLifeCycle.java:132)
		at org.apache.solr.embedded.JettySolrRunner.stop(JettySolrRunner.java:643)
		at org.apache.solr.cloud.MiniSolrCloudCluster.stopJettySolrRunner(MiniSolrCloudCluster.java:635)
		at org.apache.solr.cloud.MiniSolrCloudCluster.lambda$shutdown$5(MiniSolrCloudCluster.java:744)
		at java.base/java.util.concurrent.FutureTask.run(FutureTask.java:264)
		at org.apache.solr.common.util.ExecutorUtil$MDCAwareThreadPoolExecutor.lambda$execute$0(ExecutorUtil.java:381)
		at java.base/java.util.concurrent.ThreadPoolExecutor.runWorker(ThreadPoolExecutor.java:1128)
		at java.base/java.util.concurrent.ThreadPoolExecutor$Worker.run(ThreadPoolExecutor.java:628)
		... 1 more
	Caused by: java.lang.IllegalStateException: STOPPED
		at org.eclipse.jetty.server.handler.ContextHandler.shutdown(ContextHandler.java:773)
		at java.base/java.util.stream.ReferencePipeline$3$1.accept(ReferencePipeline.java:195)
		at java.base/java.util.ArrayList$ArrayListSpliterator.forEachRemaining(ArrayList.java:1655)
		at java.base/java.util.stream.AbstractPipeline.copyInto(AbstractPipeline.java:484)
		at java.base/java.util.stream.AbstractPipeline.wrapAndCopyInto(AbstractPipeline.java:474)
		at java.base/java.util.stream.AbstractPipeline.evaluate(AbstractPipeline.java:550)
		at java.base/java.util.stream.AbstractPipeline.evaluateToArrayNode(AbstractPipeline.java:260)
		at java.base/java.util.stream.ReferencePipeline.toArray(ReferencePipeline.java:517)
		at org.eclipse.jetty.util.component.Graceful.shutdown(Graceful.java:146)
		... 10 more


FAILED:  org.apache.solr.cloud.LeaderTragicEventTest.classMethod

Error Message:
java.lang.Exception: Error shutting down MiniSolrCloudCluster

Stack Trace:
java.lang.Exception: Error shutting down MiniSolrCloudCluster
	at __randomizedtesting.SeedInfo.seed([1101332846D31611]:0)
	at org.apache.solr.cloud.MiniSolrCloudCluster.checkForExceptions(MiniSolrCloudCluster.java:850)
	at org.apache.solr.cloud.MiniSolrCloudCluster.shutdown(MiniSolrCloudCluster.java:752)
	at org.apache.solr.cloud.SolrCloudTestCase.shutdownCluster(SolrCloudTestCase.java:118)
	at java.base/jdk.internal.reflect.NativeMethodAccessorImpl.invoke0(Native Method)
	at java.base/jdk.internal.reflect.NativeMethodAccessorImpl.invoke(NativeMethodAccessorImpl.java:62)
	at java.base/jdk.internal.reflect.DelegatingMethodAccessorImpl.invoke(DelegatingMethodAccessorImpl.java:43)
	at java.base/java.lang.reflect.Method.invoke(Method.java:566)
	at com.carrotsearch.randomizedtesting.RandomizedRunner.invoke(RandomizedRunner.java:1763)
	at com.carrotsearch.randomizedtesting.RandomizedRunner$7.evaluate(RandomizedRunner.java:909)
	at com.carrotsearch.randomizedtesting.rules.StatementAdapter.evaluate(StatementAdapter.java:36)
	at com.carrotsearch.randomizedtesting.rules.StatementAdapter.evaluate(StatementAdapter.java:36)
	at org.apache.lucene.tests.util.AbstractBeforeAfterRule$1.evaluate(AbstractBeforeAfterRule.java:43)
	at org.apache.lucene.tests.util.AbstractBeforeAfterRule$1.evaluate(AbstractBeforeAfterRule.java:43)
	at com.carrotsearch.randomizedtesting.rules.SystemPropertiesRestoreRule$1.evaluate(SystemPropertiesRestoreRule.java:80)
	at org.junit.rules.RunRules.evaluate(RunRules.java:20)
	at org.apache.lucene.tests.util.AbstractBeforeAfterRule$1.evaluate(AbstractBeforeAfterRule.java:43)
	at com.carrotsearch.randomizedtesting.rules.StatementAdapter.evaluate(StatementAdapter.java:36)
	at org.apache.lucene.tests.util.TestRuleStoreClassName$1.evaluate(TestRuleStoreClassName.java:38)
	at com.carrotsearch.randomizedtesting.rules.NoShadowingOrOverridesOnMethodsRule$1.evaluate(NoShadowingOrOverridesOnMethodsRule.java:40)
	at com.carrotsearch.randomizedtesting.rules.NoShadowingOrOverridesOnMethodsRule$1.evaluate(NoShadowingOrOverridesOnMethodsRule.java:40)
	at com.carrotsearch.randomizedtesting.rules.StatementAdapter.evaluate(StatementAdapter.java:36)
	at com.carrotsearch.randomizedtesting.rules.StatementAdapter.evaluate(StatementAdapter.java:36)
	at org.apache.lucene.tests.util.TestRuleAssertionsRequired$1.evaluate(TestRuleAssertionsRequired.java:53)
	at org.apache.lucene.tests.util.AbstractBeforeAfterRule$1.evaluate(AbstractBeforeAfterRule.java:43)
	at org.apache.lucene.tests.util.TestRuleMarkFailure$1.evaluate(TestRuleMarkFailure.java:44)
	at org.apache.lucene.tests.util.TestRuleIgnoreAfterMaxFailures$1.evaluate(TestRuleIgnoreAfterMaxFailures.java:60)
	at org.apache.lucene.tests.util.TestRuleIgnoreTestSuites$1.evaluate(TestRuleIgnoreTestSuites.java:47)
	at org.junit.rules.RunRules.evaluate(RunRules.java:20)
	at com.carrotsearch.randomizedtesting.rules.StatementAdapter.evaluate(StatementAdapter.java:36)
	at com.carrotsearch.randomizedtesting.ThreadLeakControl$StatementRunner.run(ThreadLeakControl.java:390)
	at com.carrotsearch.randomizedtesting.ThreadLeakControl.lambda$forkTimeoutingTask$0(ThreadLeakControl.java:850)
	at java.base/java.lang.Thread.run(Thread.java:829)
	Suppressed: java.util.concurrent.TimeoutException
		at java.base/java.util.concurrent.CompletableFuture.timedGet(CompletableFuture.java:1892)
		at java.base/java.util.concurrent.CompletableFuture.get(CompletableFuture.java:2027)
		at org.eclipse.jetty.server.Server.doStop(Server.java:490)
		at org.eclipse.jetty.util.component.AbstractLifeCycle.stop(AbstractLifeCycle.java:132)
		at org.apache.solr.embedded.JettySolrRunner.stop(JettySolrRunner.java:643)
		at org.apache.solr.cloud.MiniSolrCloudCluster.stopJettySolrRunner(MiniSolrCloudCluster.java:635)
		at org.apache.solr.cloud.MiniSolrCloudCluster.lambda$shutdown$5(MiniSolrCloudCluster.java:744)
		at java.base/java.util.concurrent.FutureTask.run(FutureTask.java:264)
		at org.apache.solr.common.util.ExecutorUtil$MDCAwareThreadPoolExecutor.lambda$execute$0(ExecutorUtil.java:381)
		at java.base/java.util.concurrent.ThreadPoolExecutor.runWorker(ThreadPoolExecutor.java:1128)
		at java.base/java.util.concurrent.ThreadPoolExecutor$Worker.run(ThreadPoolExecutor.java:628)
		... 1 more


FAILED:  org.apache.solr.cloud.TestRequestForwarding.classMethod

Error Message:
java.lang.AssertionError: ObjectTracker found 1 object(s) that were not released!!! [LBHttp2SolrClient]
org.apache.solr.client.solrj.impl.LBHttp2SolrClient:org.apache.solr.common.util.ObjectReleaseTracker$ObjectTrackerException: org.apache.solr.client.solrj.impl.LBHttp2SolrClient
	at org.apache.solr.common.util.ObjectReleaseTracker.track(ObjectReleaseTracker.java:52)
	at org.apache.solr.client.solrj.impl.LBSolrClient.<init>(LBSolrClient.java:425)
	at org.apache.solr.client.solrj.impl.LBHttp2SolrClient.<init>(LBHttp2SolrClient.java:98)
	at org.apache.solr.client.solrj.impl.LBHttp2SolrClient$Builder.build(LBHttp2SolrClient.java:493)
	at org.apache.solr.client.solrj.impl.CloudHttp2SolrClient.<init>(CloudHttp2SolrClient.java:76)
	at org.apache.solr.client.solrj.impl.CloudHttp2SolrClient$Builder.build(CloudHttp2SolrClient.java:480)
	at org.apache.solr.cloud.ZkController.getSolrCloudManager(ZkController.java:923)
	at org.apache.solr.cloud.Overseer.getSolrCloudManager(Overseer.java:948)
	at org.apache.solr.cloud.api.collections.OverseerCollectionMessageHandler.<init>(OverseerCollectionMessageHandler.java:107)
	at org.apache.solr.cloud.OverseerCollectionConfigSetProcessor.getOverseerMessageHandlerSelector(OverseerCollectionConfigSetProcessor.java:101)
	at org.apache.solr.cloud.OverseerCollectionConfigSetProcessor.<init>(OverseerCollectionConfigSetProcessor.java:77)
	at org.apache.solr.cloud.OverseerCollectionConfigSetProcessor.<init>(OverseerCollectionConfigSetProcessor.java:45)
	at org.apache.solr.cloud.Overseer.start(Overseer.java:770)
	at org.apache.solr.cloud.OverseerElectionContext.runLeaderProcess(OverseerElectionContext.java:76)
	at org.apache.solr.cloud.LeaderElector.runIamLeaderProcess(LeaderElector.java:171)
	at org.apache.solr.cloud.LeaderElector.checkIfIamLeader(LeaderElector.java:131)
	at org.apache.solr.cloud.LeaderElector$ElectionWatcher.process(LeaderElector.java:351)
	at org.apache.solr.common.cloud.SolrZkClient$ProcessWatchWithExecutor.lambda$process$1(SolrZkClient.java:1099)
	at org.apache.solr.common.util.ExecutorUtil$MDCAwareThreadPoolExecutor.lambda$execute$0(ExecutorUtil.java:381)
	at java.base/java.util.concurrent.ThreadPoolExecutor.runWorker(ThreadPoolExecutor.java:1128)
	at java.base/java.util.concurrent.ThreadPoolExecutor$Worker.run(ThreadPoolExecutor.java:628)
	at java.base/java.lang.Thread.run(Thread.java:829)
Caused by: java.lang.Exception: Submitter stack trace
	at org.apache.solr.common.util.ExecutorUtil$MDCAwareThreadPoolExecutor.execute(ExecutorUtil.java:348)
	at org.apache.solr.common.cloud.SolrZkClient$ProcessWatchWithExecutor.process(SolrZkClient.java:1096)
	at org.apache.zookeeper.ClientCnxn$EventThread.processEvent(ClientCnxn.java:566)
	at org.apache.zookeeper.ClientCnxn$EventThread.run(ClientCnxn.java:541)

 expected null, but was:<ObjectTracker found 1 object(s) that were not released!!! [LBHttp2SolrClient]
org.apache.solr.client.solrj.impl.LBHttp2SolrClient:org.apache.solr.common.util.ObjectReleaseTracker$ObjectTrackerException: org.apache.solr.client.solrj.impl.LBHttp2SolrClient
	at org.apache.solr.common.util.ObjectReleaseTracker.track(ObjectReleaseTracker.java:52)
	at org.apache.solr.client.solrj.impl.LBSolrClient.<init>(LBSolrClient.java:425)
	at org.apache.solr.client.solrj.impl.LBHttp2SolrClient.<init>(LBHttp2SolrClient.java:98)
	at org.apache.solr.client.solrj.impl.LBHttp2SolrClient$Builder.build(LBHttp2SolrClient.java:493)
	at org.apache.solr.client.solrj.impl.CloudHttp2SolrClient.<init>(CloudHttp2SolrClient.java:76)
	at org.apache.solr.client.solrj.impl.CloudHttp2SolrClient$Builder.build(CloudHttp2SolrClient.java:480)
	at org.apache.solr.cloud.ZkController.getSolrCloudManager(ZkController.java:923)
	at org.apache.solr.cloud.Overseer.getSolrCloudManager(Overseer.java:948)
	at org.apache.solr.cloud.api.collections.OverseerCollectionMessageHandler.<init>(OverseerCollectionMessageHandler.java:107)
	at org.apache.solr.cloud.OverseerCollectionConfigSetProcessor.getOverseerMessageHandlerSelector(OverseerCollectionConfigSetProcessor.java:101)
	at org.apache.solr.cloud.OverseerCollectionConfigSetProcessor.<init>(OverseerCollectionConfigSetProcessor.java:77)
	at org.apache.solr.cloud.OverseerCollectionConfigSetProcessor.<init>(OverseerCollectionConfigSetProcessor.java:45)
	at org.apache.solr.cloud.Overseer.start(Overseer.java:770)
	at org.apache.solr.cloud.OverseerElectionContext.runLeaderProcess(OverseerElectionContext.java:76)
	at org.apache.solr.cloud.LeaderElector.runIamLeaderProcess(LeaderElector.java:171)
	at org.apache.solr.cloud.LeaderElector.checkIfIamLeader(LeaderElector.java:131)
	at org.apache.solr.cloud.LeaderElector$ElectionWatcher.process(LeaderElector.java:351)
	at org.apache.solr.common.cloud.SolrZkClient$ProcessWatchWithExecutor.lambda$process$1(SolrZkClient.java:1099)
	at org.apache.solr.common.util.ExecutorUtil$MDCAwareThreadPoolExecutor.lambda$execute$0(ExecutorUtil.java:381)
	at java.base/java.util.concurrent.ThreadPoolExecutor.runWorker(ThreadPoolExecutor.java:1128)
	at java.base/java.util.concurrent.ThreadPoolExecutor$Worker.run(ThreadPoolExecutor.java:628)
	at java.base/java.lang.Thread.run(Thread.java:829)
Caused by: java.lang.Exception: Submitter stack trace
	at org.apache.solr.common.util.ExecutorUtil$MDCAwareThreadPoolExecutor.execute(ExecutorUtil.java:348)
	at org.apache.solr.common.cloud.SolrZkClient$ProcessWatchWithExecutor.process(SolrZkClient.java:1096)
	at org.apache.zookeeper.ClientCnxn$EventThread.processEvent(ClientCnxn.java:566)
	at org.apache.zookeeper.ClientCnxn$EventThread.run(ClientCnxn.java:541)

>

Stack Trace:
java.lang.AssertionError: ObjectTracker found 1 object(s) that were not released!!! [LBHttp2SolrClient]
org.apache.solr.client.solrj.impl.LBHttp2SolrClient:org.apache.solr.common.util.ObjectReleaseTracker$ObjectTrackerException: org.apache.solr.client.solrj.impl.LBHttp2SolrClient
	at org.apache.solr.common.util.ObjectReleaseTracker.track(ObjectReleaseTracker.java:52)
	at org.apache.solr.client.solrj.impl.LBSolrClient.<init>(LBSolrClient.java:425)
	at org.apache.solr.client.solrj.impl.LBHttp2SolrClient.<init>(LBHttp2SolrClient.java:98)
	at org.apache.solr.client.solrj.impl.LBHttp2SolrClient$Builder.build(LBHttp2SolrClient.java:493)
	at org.apache.solr.client.solrj.impl.CloudHttp2SolrClient.<init>(CloudHttp2SolrClient.java:76)
	at org.apache.solr.client.solrj.impl.CloudHttp2SolrClient$Builder.build(CloudHttp2SolrClient.java:480)
	at org.apache.solr.cloud.ZkController.getSolrCloudManager(ZkController.java:923)
	at org.apache.solr.cloud.Overseer.getSolrCloudManager(Overseer.java:948)
	at org.apache.solr.cloud.api.collections.OverseerCollectionMessageHandler.<init>(OverseerCollectionMessageHandler.java:107)
	at org.apache.solr.cloud.OverseerCollectionConfigSetProcessor.getOverseerMessageHandlerSelector(OverseerCollectionConfigSetProcessor.java:101)
	at org.apache.solr.cloud.OverseerCollectionConfigSetProcessor.<init>(OverseerCollectionConfigSetProcessor.java:77)
	at org.apache.solr.cloud.OverseerCollectionConfigSetProcessor.<init>(OverseerCollectionConfigSetProcessor.java:45)
	at org.apache.solr.cloud.Overseer.start(Overseer.java:770)
	at org.apache.solr.cloud.OverseerElectionContext.runLeaderProcess(OverseerElectionContext.java:76)
	at org.apache.solr.cloud.LeaderElector.runIamLeaderProcess(LeaderElector.java:171)
	at org.apache.solr.cloud.LeaderElector.checkIfIamLeader(LeaderElector.java:131)
	at org.apache.solr.cloud.LeaderElector$ElectionWatcher.process(LeaderElector.java:351)
	at org.apache.solr.common.cloud.SolrZkClient$ProcessWatchWithExecutor.lambda$process$1(SolrZkClient.java:1099)
	at org.apache.solr.common.util.ExecutorUtil$MDCAwareThreadPoolExecutor.lambda$execute$0(ExecutorUtil.java:381)
	at java.base/java.util.concurrent.ThreadPoolExecutor.runWorker(ThreadPoolExecutor.java:1128)
	at java.base/java.util.concurrent.ThreadPoolExecutor$Worker.run(ThreadPoolExecutor.java:628)
	at java.base/java.lang.Thread.run(Thread.java:829)
Caused by: java.lang.Exception: Submitter stack trace
	at org.apache.solr.common.util.ExecutorUtil$MDCAwareThreadPoolExecutor.execute(ExecutorUtil.java:348)
	at org.apache.solr.common.cloud.SolrZkClient$ProcessWatchWithExecutor.process(SolrZkClient.java:1096)
	at org.apache.zookeeper.ClientCnxn$EventThread.processEvent(ClientCnxn.java:566)
	at org.apache.zookeeper.ClientCnxn$EventThread.run(ClientCnxn.java:541)

 expected null, but was:<ObjectTracker found 1 object(s) that were not released!!! [LBHttp2SolrClient]
org.apache.solr.client.solrj.impl.LBHttp2SolrClient:org.apache.solr.common.util.ObjectReleaseTracker$ObjectTrackerException: org.apache.solr.client.solrj.impl.LBHttp2SolrClient
	at org.apache.solr.common.util.ObjectReleaseTracker.track(ObjectReleaseTracker.java:52)
	at org.apache.solr.client.solrj.impl.LBSolrClient.<init>(LBSolrClient.java:425)
	at org.apache.solr.client.solrj.impl.LBHttp2SolrClient.<init>(LBHttp2SolrClient.java:98)
	at org.apache.solr.client.solrj.impl.LBHttp2SolrClient$Builder.build(LBHttp2SolrClient.java:493)
	at org.apache.solr.client.solrj.impl.CloudHttp2SolrClient.<init>(CloudHttp2SolrClient.java:76)
	at org.apache.solr.client.solrj.impl.CloudHttp2SolrClient$Builder.build(CloudHttp2SolrClient.java:480)
	at org.apache.solr.cloud.ZkController.getSolrCloudManager(ZkController.java:923)
	at org.apache.solr.cloud.Overseer.getSolrCloudManager(Overseer.java:948)
	at org.apache.solr.cloud.api.collections.OverseerCollectionMessageHandler.<init>(OverseerCollectionMessageHandler.java:107)
	at org.apache.solr.cloud.OverseerCollectionConfigSetProcessor.getOverseerMessageHandlerSelector(OverseerCollectionConfigSetProcessor.java:101)
	at org.apache.solr.cloud.OverseerCollectionConfigSetProcessor.<init>(OverseerCollectionConfigSetProcessor.java:77)
	at org.apache.solr.cloud.OverseerCollectionConfigSetProcessor.<init>(OverseerCollectionConfigSetProcessor.java:45)
	at org.apache.solr.cloud.Overseer.start(Overseer.java:770)
	at org.apache.solr.cloud.OverseerElectionContext.runLeaderProcess(OverseerElectionContext.java:76)
	at org.apache.solr.cloud.LeaderElector.runIamLeaderProcess(LeaderElector.java:171)
	at org.apache.solr.cloud.LeaderElector.checkIfIamLeader(LeaderElector.java:131)
	at org.apache.solr.cloud.LeaderElector$ElectionWatcher.process(LeaderElector.java:351)
	at org.apache.solr.common.cloud.SolrZkClient$ProcessWatchWithExecutor.lambda$process$1(SolrZkClient.java:1099)
	at org.apache.solr.common.util.ExecutorUtil$MDCAwareThreadPoolExecutor.lambda$execute$0(ExecutorUtil.java:381)
	at java.base/java.util.concurrent.ThreadPoolExecutor.runWorker(ThreadPoolExecutor.java:1128)
	at java.base/java.util.concurrent.ThreadPoolExecutor$Worker.run(ThreadPoolExecutor.java:628)
	at java.base/java.lang.Thread.run(Thread.java:829)
Caused by: java.lang.Exception: Submitter stack trace
	at org.apache.solr.common.util.ExecutorUtil$MDCAwareThreadPoolExecutor.execute(ExecutorUtil.java:348)
	at org.apache.solr.common.cloud.SolrZkClient$ProcessWatchWithExecutor.process(SolrZkClient.java:1096)
	at org.apache.zookeeper.ClientCnxn$EventThread.processEvent(ClientCnxn.java:566)
	at org.apache.zookeeper.ClientCnxn$EventThread.run(ClientCnxn.java:541)

>
	at __randomizedtesting.SeedInfo.seed([1101332846D31611]:0)
	at org.junit.Assert.fail(Assert.java:89)
	at org.junit.Assert.failNotNull(Assert.java:756)
	at org.junit.Assert.assertNull(Assert.java:738)
	at org.apache.solr.SolrTestCase$1.afterIfSuccessful(SolrTestCase.java:106)
	at com.carrotsearch.randomizedtesting.rules.TestRuleAdapter$1.afterIfSuccessful(TestRuleAdapter.java:36)
	at com.carrotsearch.randomizedtesting.rules.StatementAdapter.evaluate(StatementAdapter.java:37)
	at com.carrotsearch.randomizedtesting.rules.StatementAdapter.evaluate(StatementAdapter.java:36)
	at org.apache.lucene.tests.util.AbstractBeforeAfterRule$1.evaluate(AbstractBeforeAfterRule.java:43)
	at org.apache.lucene.tests.util.AbstractBeforeAfterRule$1.evaluate(AbstractBeforeAfterRule.java:43)
	at com.carrotsearch.randomizedtesting.rules.SystemPropertiesRestoreRule$1.evaluate(SystemPropertiesRestoreRule.java:80)
	at org.junit.rules.RunRules.evaluate(RunRules.java:20)
	at org.apache.lucene.tests.util.AbstractBeforeAfterRule$1.evaluate(AbstractBeforeAfterRule.java:43)
	at com.carrotsearch.randomizedtesting.rules.StatementAdapter.evaluate(StatementAdapter.java:36)
	at org.apache.lucene.tests.util.TestRuleStoreClassName$1.evaluate(TestRuleStoreClassName.java:38)
	at com.carrotsearch.randomizedtesting.rules.NoShadowingOrOverridesOnMethodsRule$1.evaluate(NoShadowingOrOverridesOnMethodsRule.java:40)
	at com.carrotsearch.randomizedtesting.rules.NoShadowingOrOverridesOnMethodsRule$1.evaluate(NoShadowingOrOverridesOnMethodsRule.java:40)
	at com.carrotsearch.randomizedtesting.rules.StatementAdapter.evaluate(StatementAdapter.java:36)
	at com.carrotsearch.randomizedtesting.rules.StatementAdapter.evaluate(StatementAdapter.java:36)
	at org.apache.lucene.tests.util.TestRuleAssertionsRequired$1.evaluate(TestRuleAssertionsRequired.java:53)
	at org.apache.lucene.tests.util.AbstractBeforeAfterRule$1.evaluate(AbstractBeforeAfterRule.java:43)
	at org.apache.lucene.tests.util.TestRuleMarkFailure$1.evaluate(TestRuleMarkFailure.java:44)
	at org.apache.lucene.tests.util.TestRuleIgnoreAfterMaxFailures$1.evaluate(TestRuleIgnoreAfterMaxFailures.java:60)
	at org.apache.lucene.tests.util.TestRuleIgnoreTestSuites$1.evaluate(TestRuleIgnoreTestSuites.java:47)
	at org.junit.rules.RunRules.evaluate(RunRules.java:20)
	at com.carrotsearch.randomizedtesting.rules.StatementAdapter.evaluate(StatementAdapter.java:36)
	at com.carrotsearch.randomizedtesting.ThreadLeakControl$StatementRunner.run(ThreadLeakControl.java:390)
	at com.carrotsearch.randomizedtesting.ThreadLeakControl.lambda$forkTimeoutingTask$0(ThreadLeakControl.java:850)
	at java.base/java.lang.Thread.run(Thread.java:829)




Build Log:
[...truncated 2977 lines...]
ERROR: The following test(s) have failed:
  - org.apache.solr.cloud.LeaderElectionIntegrationTest.testSimpleSliceLeaderElection (:solr:core)
    Test history: https://develocity.apache.org/scans/tests?search.rootProjectNames=solr-root&tests.container=org.apache.solr.cloud.LeaderElectionIntegrationTest&tests.test=testSimpleSliceLeaderElection http://fucit.org/solr-jenkins-reports/history-trend-of-recent-failures.html#series/org.apache.solr.cloud.LeaderElectionIntegrationTest.testSimpleSliceLeaderElection
    Test output: /home/jenkins/jenkins-agent/workspace/Solr/Solr-Test-9.x/solr/core/build/test-results/test/outputs/OUTPUT-org.apache.solr.cloud.LeaderElectionIntegrationTest.txt
    Reproduce with: ./gradlew :solr:core:test --tests "org.apache.solr.cloud.LeaderElectionIntegrationTest.testSimpleSliceLeaderElection" -Ptests.haltonfailure=false "-Ptests.jvmargs=-XX:TieredStopAtLevel=1 -XX:+UseParallelGC -XX:ActiveProcessorCount=1 -XX:ReservedCodeCacheSize=120m" -Ptests.seed=1101332846D31611 -Ptests.multiplier=2 -Ptests.useSecurityManager=true -Ptests.badapples=false -Ptests.file.encoding=US-ASCII

  - org.apache.solr.cloud.LeaderElectionIntegrationTest (:solr:core)
    Test history: https://develocity.apache.org/scans/tests?search.rootProjectNames=solr-root&tests.container=org.apache.solr.cloud.LeaderElectionIntegrationTest
    Test output: /home/jenkins/jenkins-agent/workspace/Solr/Solr-Test-9.x/solr/core/build/test-results/test/outputs/OUTPUT-org.apache.solr.cloud.LeaderElectionIntegrationTest.txt
    Reproduce with: ./gradlew :solr:core:test --tests "org.apache.solr.cloud.LeaderElectionIntegrationTest" -Ptests.haltonfailure=false "-Ptests.jvmargs=-XX:TieredStopAtLevel=1 -XX:+UseParallelGC -XX:ActiveProcessorCount=1 -XX:ReservedCodeCacheSize=120m" -Ptests.seed=1101332846D31611 -Ptests.multiplier=2 -Ptests.useSecurityManager=true -Ptests.badapples=false -Ptests.file.encoding=US-ASCII

  - org.apache.solr.cloud.LeaderTragicEventTest (:solr:core)
    Test history: https://develocity.apache.org/scans/tests?search.rootProjectNames=solr-root&tests.container=org.apache.solr.cloud.LeaderTragicEventTest
    Test output: /home/jenkins/jenkins-agent/workspace/Solr/Solr-Test-9.x/solr/core/build/test-results/test/outputs/OUTPUT-org.apache.solr.cloud.LeaderTragicEventTest.txt
    Reproduce with: ./gradlew :solr:core:test --tests "org.apache.solr.cloud.LeaderTragicEventTest" -Ptests.haltonfailure=false "-Ptests.jvmargs=-XX:TieredStopAtLevel=1 -XX:+UseParallelGC -XX:ActiveProcessorCount=1 -XX:ReservedCodeCacheSize=120m" -Ptests.seed=1101332846D31611 -Ptests.multiplier=2 -Ptests.useSecurityManager=true -Ptests.badapples=false -Ptests.file.encoding=US-ASCII

  - org.apache.solr.cloud.TestRequestForwarding (:solr:core)
    Test history: https://develocity.apache.org/scans/tests?search.rootProjectNames=solr-root&tests.container=org.apache.solr.cloud.TestRequestForwarding
    Test output: /home/jenkins/jenkins-agent/workspace/Solr/Solr-Test-9.x/solr/core/build/test-results/test/outputs/OUTPUT-org.apache.solr.cloud.TestRequestForwarding.txt
    Reproduce with: ./gradlew :solr:core:test --tests "org.apache.solr.cloud.TestRequestForwarding" -Ptests.haltonfailure=false "-Ptests.jvmargs=-XX:TieredStopAtLevel=1 -XX:+UseParallelGC -XX:ActiveProcessorCount=1 -XX:ReservedCodeCacheSize=120m" -Ptests.seed=1101332846D31611 -Ptests.multiplier=2 -Ptests.useSecurityManager=true -Ptests.badapples=false -Ptests.file.encoding=US-ASCII


Deprecated Gradle features were used in this build, making it incompatible with Gradle 9.0.

You can use '--warning-mode all' to show the individual deprecation warnings and determine if they come from your own scripts or plugins.

For more on this, please refer to https://docs.gradle.org/8.10/userguide/command_line_interface.html#sec:command_line_warnings in the Gradle documentation.

BUILD SUCCESSFUL in 46m 53s
167 actionable tasks: 167 executed

Publishing build scan...
https://develocity.apache.org/s/47wuifmnzn7uu

Build step 'Invoke Gradle script' changed build result to SUCCESS
Archiving artifacts
‘**/*.events’ doesn’t match anything: ‘**’ exists but not ‘**/*.events’
No artifacts found that match the file pattern "**/*.events,heapdumps/**,**/hs_err_pid*". Configuration error?
Recording test results
[Checks API] No suitable checks publisher found.
Build step 'Publish JUnit test result report' changed build result to UNSTABLE
Email was triggered for: Unstable (Test Failures)
Sending email for trigger: Unstable (Test Failures)