You are viewing a plain text version of this content. The canonical link for it is here.
Posted to builds@beam.apache.org by Apache Jenkins Server <je...@builds.apache.org> on 2023/12/13 01:56:38 UTC

Build failed in Jenkins: beam_PostCommit_Python39 #2645

See <https://ci-beam.apache.org/job/beam_PostCommit_Python39/2645/display/redirect>

Changes:


------------------------------------------
[...truncated 12.86 MB...]
Exception in thread read_state:
Traceback (most recent call last):
  File "/usr/lib/python3.9/threading.py", line 973, in _bootstrap_inner
ERROR:apache_beam.runners.worker.data_plane:Failed to read inputs in the data plane.
Traceback (most recent call last):
  File "<https://ci-beam.apache.org/job/beam_PostCommit_Python39/ws/src/sdks/python/apache_beam/runners/worker/data_plane.py",> line 669, in _read_inputs
    for elements in elements_iterator:
  File "<https://ci-beam.apache.org/job/beam_PostCommit_Python39/ws/src/build/gradleenv/2022703443/lib/python3.9/site-packages/grpc/_channel.py",> line 540, in __next__
    return self._next()
  File "<https://ci-beam.apache.org/job/beam_PostCommit_Python39/ws/src/build/gradleenv/2022703443/lib/python3.9/site-packages/grpc/_channel.py",> line 966, in _next
    raise self
grpc._channel._MultiThreadedRendezvous: <_MultiThreadedRendezvous of RPC that terminated with:
	status = StatusCode.UNAVAILABLE
	details = "Socket closed"
	debug_error_string = "UNKNOWN:Error received from peer ipv6:%5B::1%5D:36225 {grpc_message:"Socket closed", grpc_status:14, created_time:"2023-12-13T00:40:27.911827555+00:00"}"
>
Exception in thread read_grpc_client_inputs:
Traceback (most recent call last):
  File "/usr/lib/python3.9/threading.py", line 973, in _bootstrap_inner
    self.run()
  File "/usr/lib/python3.9/threading.py", line 910, in run
    self.run()
    self.run()
  File "/usr/lib/python3.9/threading.py", line 910, in run
  File "/usr/lib/python3.9/threading.py", line 910, in run
    self._target(*self._args, **self._kwargs)
  File "<https://ci-beam.apache.org/job/beam_PostCommit_Python39/ws/src/sdks/python/apache_beam/runners/worker/sdk_worker.py",> line 1042, in pull_responses
    self._target(*self._args, **self._kwargs)
    self._target(*self._args, **self._kwargs)
  File "<https://ci-beam.apache.org/job/beam_PostCommit_Python39/ws/src/sdks/python/apache_beam/runners/worker/sdk_worker.py",> line 265, in run
  File "<https://ci-beam.apache.org/job/beam_PostCommit_Python39/ws/src/sdks/python/apache_beam/runners/worker/data_plane.py",> line 686, in <lambda>
    for work_request in self._control_stub.Control(get_responses()):
  File "<https://ci-beam.apache.org/job/beam_PostCommit_Python39/ws/src/build/gradleenv/2022703443/lib/python3.9/site-packages/grpc/_channel.py",> line 540, in __next__
    for response in responses:
    return self._next()
  File "<https://ci-beam.apache.org/job/beam_PostCommit_Python39/ws/src/build/gradleenv/2022703443/lib/python3.9/site-packages/grpc/_channel.py",> line 966, in _next
  File "<https://ci-beam.apache.org/job/beam_PostCommit_Python39/ws/src/build/gradleenv/2022703443/lib/python3.9/site-packages/grpc/_channel.py",> line 540, in __next__
    raise self
grpc._channel._MultiThreadedRendezvous: <_MultiThreadedRendezvous of RPC that terminated with:
	status = StatusCode.UNAVAILABLE
	details = "Socket closed"
	debug_error_string = "UNKNOWN:Error received from peer ipv6:%5B::1%5D:37159 {created_time:"2023-12-13T00:40:27.911868268+00:00", grpc_status:14, grpc_message:"Socket closed"}"
>
    target=lambda: self._read_inputs(elements_iterator),
  File "<https://ci-beam.apache.org/job/beam_PostCommit_Python39/ws/src/sdks/python/apache_beam/runners/worker/data_plane.py",> line 669, in _read_inputs
    return self._next()
  File "<https://ci-beam.apache.org/job/beam_PostCommit_Python39/ws/src/build/gradleenv/2022703443/lib/python3.9/site-packages/grpc/_channel.py",> line 966, in _next
    for elements in elements_iterator:
  File "<https://ci-beam.apache.org/job/beam_PostCommit_Python39/ws/src/build/gradleenv/2022703443/lib/python3.9/site-packages/grpc/_channel.py",> line 540, in __next__
    raise self
    return self._next()
grpc._channel._MultiThreadedRendezvous: <_MultiThreadedRendezvous of RPC that terminated with:
	status = StatusCode.UNAVAILABLE
	details = "Socket closed"
	debug_error_string = "UNKNOWN:Error received from peer ipv6:%5B::1%5D:36985 {created_time:"2023-12-13T00:40:27.911837786+00:00", grpc_status:14, grpc_message:"Socket closed"}"
>  File "<https://ci-beam.apache.org/job/beam_PostCommit_Python39/ws/src/build/gradleenv/2022703443/lib/python3.9/site-packages/grpc/_channel.py",> line 966, in _next

    raise self
grpc._channel._MultiThreadedRendezvous: <_MultiThreadedRendezvous of RPC that terminated with:
	status = StatusCode.UNAVAILABLE
	details = "Socket closed"
	debug_error_string = "UNKNOWN:Error received from peer ipv6:%5B::1%5D:36225 {grpc_message:"Socket closed", grpc_status:14, created_time:"2023-12-13T00:40:27.911827555+00:00"}"
>

> Task :sdks:python:test-suites:dataflow:py39:postCommitIT

[gw6] PASSED apache_beam/io/gcp/bigquery_write_it_test.py::BigQueryWriteIntegrationTests::test_big_query_write_new_types 
apache_beam/io/gcp/bigquery_write_it_test.py::BigQueryWriteIntegrationTests::test_big_query_write_schema_autodetect 
[gw6] SKIPPED apache_beam/io/gcp/bigquery_write_it_test.py::BigQueryWriteIntegrationTests::test_big_query_write_schema_autodetect 
apache_beam/io/gcp/bigquery_write_it_test.py::BigQueryWriteIntegrationTests::test_big_query_write_without_schema 
[gw1] PASSED apache_beam/ml/inference/sklearn_inference_it_test.py::SklearnInference::test_sklearn_mnist_classification_large_model 
apache_beam/ml/inference/sklearn_inference_it_test.py::SklearnInference::test_sklearn_regression 
[gw7] PASSED apache_beam/io/gcp/big_query_query_to_table_it_test.py::BigQueryQueryToTableIT::test_big_query_standard_sql 
apache_beam/examples/dataframe/taxiride_it_test.py::TaxirideIT::test_aggregation 
[gw0] PASSED apache_beam/io/gcp/bigquery_read_it_test.py::ReadTests::test_table_schema_retrieve_with_direct_read 
apache_beam/io/gcp/bigquery_read_it_test.py::ReadUsingStorageApiTests::test_iobase_source 
[gw3] PASSED apache_beam/dataframe/io_it_test.py::ReadUsingReadGbqTests::test_ReadGbq_with_computation 
apache_beam/io/gcp/bigquery_io_read_it_test.py::BigqueryIOReadIT::test_bigquery_read_1M_python 
[gw2] PASSED apache_beam/io/gcp/bigquery_json_it_test.py::BigQueryJsonIT::test_streaming_inserts 
apache_beam/examples/wordcount_it_test.py::WordCountIT::test_wordcount_impersonation_it 
[gw6] PASSED apache_beam/io/gcp/bigquery_write_it_test.py::BigQueryWriteIntegrationTests::test_big_query_write_without_schema 
apache_beam/examples/fastavro_it_test.py::FastavroIT::test_avro_it 
[gw4] PASSED apache_beam/io/gcp/pubsub_integration_test.py::PubSubIntegrationTest::test_streaming_data_only 
apache_beam/io/gcp/pubsub_integration_test.py::PubSubIntegrationTest::test_streaming_with_attributes 
[gw5] PASSED apache_beam/io/gcp/bigquery_test.py::PubSubBigQueryIT::test_file_loads 
apache_beam/io/gcp/bigquery_test.py::PubSubBigQueryIT::test_streaming_inserts 
[gw1] PASSED apache_beam/ml/inference/sklearn_inference_it_test.py::SklearnInference::test_sklearn_regression 
apache_beam/ml/gcp/cloud_dlp_it_test.py::CloudDLPIT::test_deidentification 
[gw0] PASSED apache_beam/io/gcp/bigquery_read_it_test.py::ReadUsingStorageApiTests::test_iobase_source 
apache_beam/io/gcp/bigquery_read_it_test.py::ReadUsingStorageApiTests::test_iobase_source_with_column_selection 
[gw3] PASSED apache_beam/io/gcp/bigquery_io_read_it_test.py::BigqueryIOReadIT::test_bigquery_read_1M_python 
apache_beam/io/gcp/bigquery_io_read_it_test.py::BigqueryIOReadIT::test_bigquery_read_custom_1M_python 
[gw2] PASSED apache_beam/examples/wordcount_it_test.py::WordCountIT::test_wordcount_impersonation_it 
apache_beam/examples/wordcount_it_test.py::WordCountIT::test_wordcount_it 
[gw1] PASSED apache_beam/ml/gcp/cloud_dlp_it_test.py::CloudDLPIT::test_deidentification 
apache_beam/ml/gcp/cloud_dlp_it_test.py::CloudDLPIT::test_inspection 
[gw7] PASSED apache_beam/examples/dataframe/taxiride_it_test.py::TaxirideIT::test_aggregation 
apache_beam/examples/dataframe/taxiride_it_test.py::TaxirideIT::test_enrich 
[gw0] PASSED apache_beam/io/gcp/bigquery_read_it_test.py::ReadUsingStorageApiTests::test_iobase_source_with_column_selection 
apache_beam/io/gcp/bigquery_read_it_test.py::ReadUsingStorageApiTests::test_iobase_source_with_column_selection_and_row_restriction 
[gw3] PASSED apache_beam/io/gcp/bigquery_io_read_it_test.py::BigqueryIOReadIT::test_bigquery_read_custom_1M_python 
apache_beam/examples/complete/autocomplete_test.py::AutocompleteTest::test_autocomplete_it 
[gw2] PASSED apache_beam/examples/wordcount_it_test.py::WordCountIT::test_wordcount_it 
apache_beam/examples/complete/game/game_stats_it_test.py::GameStatsIT::test_game_stats_it 
[gw4] PASSED apache_beam/io/gcp/pubsub_integration_test.py::PubSubIntegrationTest::test_streaming_with_attributes 
apache_beam/io/gcp/healthcare/dicomio_integration_test.py::DICOMIoIntegrationTest::test_dicom_search_instances 
[gw1] PASSED apache_beam/ml/gcp/cloud_dlp_it_test.py::CloudDLPIT::test_inspection 
apache_beam/examples/complete/game/user_score_it_test.py::UserScoreIT::test_user_score_it 
[gw6] PASSED apache_beam/examples/fastavro_it_test.py::FastavroIT::test_avro_it 
apache_beam/examples/streaming_wordcount_debugging_it_test.py::StreamingWordcountDebuggingIT::test_streaming_wordcount_debugging_it 
[gw6] SKIPPED apache_beam/examples/streaming_wordcount_debugging_it_test.py::StreamingWordcountDebuggingIT::test_streaming_wordcount_debugging_it 
apache_beam/examples/complete/game/hourly_team_score_it_test.py::HourlyTeamScoreIT::test_hourly_team_score_it 
[gw0] PASSED apache_beam/io/gcp/bigquery_read_it_test.py::ReadUsingStorageApiTests::test_iobase_source_with_column_selection_and_row_restriction 
apache_beam/io/gcp/bigquery_read_it_test.py::ReadUsingStorageApiTests::test_iobase_source_with_column_selection_and_row_restriction_rows 
[gw3] PASSED apache_beam/examples/complete/autocomplete_test.py::AutocompleteTest::test_autocomplete_it 
apache_beam/examples/complete/juliaset/juliaset/juliaset_test_it.py::JuliaSetTestIT::test_run_example_with_setup_file 
[gw4] PASSED apache_beam/io/gcp/healthcare/dicomio_integration_test.py::DICOMIoIntegrationTest::test_dicom_search_instances 
apache_beam/io/gcp/healthcare/dicomio_integration_test.py::DICOMIoIntegrationTest::test_dicom_store_instance_from_gcs <https://ci-beam.apache.org/job/beam_PostCommit_Python39/ws/src/build/gradleenv/-1734967050/bin/python3.9>: No module named build
warning: sdist: standard file not found: should have one of README, README.rst, README.txt, README.md

warning: check: missing required meta-data: url

warning: check: missing meta-data: either (author and author_email) or (maintainer and maintainer_email) should be supplied


[gw5] PASSED apache_beam/io/gcp/bigquery_test.py::PubSubBigQueryIT::test_streaming_inserts 
apache_beam/io/gcp/bigquery_test.py::BigQueryFileLoadsIntegrationTests::test_avro_file_load 
[gw0] PASSED apache_beam/io/gcp/bigquery_read_it_test.py::ReadUsingStorageApiTests::test_iobase_source_with_column_selection_and_row_restriction_rows 
apache_beam/io/gcp/bigquery_read_it_test.py::ReadUsingStorageApiTests::test_iobase_source_with_native_datetime 
[gw4] PASSED apache_beam/io/gcp/healthcare/dicomio_integration_test.py::DICOMIoIntegrationTest::test_dicom_store_instance_from_gcs 
apache_beam/io/parquetio_it_test.py::TestParquetIT::test_parquetio_it 
[gw1] PASSED apache_beam/examples/complete/game/user_score_it_test.py::UserScoreIT::test_user_score_it 
apache_beam/examples/cookbook/datastore_wordcount_it_test.py::DatastoreWordCountIT::test_datastore_wordcount_it 
[gw3] PASSED apache_beam/examples/complete/juliaset/juliaset/juliaset_test_it.py::JuliaSetTestIT::test_run_example_with_setup_file 
apache_beam/examples/inference/tfx_bsl/tfx_bsl_inference_it_test.py::TFXRunInferenceTests::test_tfx_run_inference_mobilenetv2 
[gw3] SKIPPED apache_beam/examples/inference/tfx_bsl/tfx_bsl_inference_it_test.py::TFXRunInferenceTests::test_tfx_run_inference_mobilenetv2 
apache_beam/ml/gcp/visionml_test_it.py::VisionMlTestIT::test_text_detection_with_language_hint 
[gw5] PASSED apache_beam/io/gcp/bigquery_test.py::BigQueryFileLoadsIntegrationTests::test_avro_file_load 
apache_beam/examples/complete/game/leader_board_it_test.py::LeaderBoardIT::test_leader_board_it 
[gw6] PASSED apache_beam/examples/complete/game/hourly_team_score_it_test.py::HourlyTeamScoreIT::test_hourly_team_score_it 
apache_beam/ml/gcp/naturallanguageml_test_it.py::NaturalLanguageMlTestIT::test_analyzing_syntax 
[gw6] SKIPPED apache_beam/ml/gcp/naturallanguageml_test_it.py::NaturalLanguageMlTestIT::test_analyzing_syntax 
apache_beam/ml/gcp/videointelligenceml_test_it.py::VideoIntelligenceMlTestIT::test_label_detection_with_video_context 
[gw6] SKIPPED apache_beam/ml/gcp/videointelligenceml_test_it.py::VideoIntelligenceMlTestIT::test_label_detection_with_video_context 
[gw2] PASSED apache_beam/examples/complete/game/game_stats_it_test.py::GameStatsIT::test_game_stats_it 
apache_beam/examples/cookbook/bigquery_tornadoes_it_test.py::BigqueryTornadoesIT::test_bigquery_tornadoes_it 
[gw0] PASSED apache_beam/io/gcp/bigquery_read_it_test.py::ReadUsingStorageApiTests::test_iobase_source_with_native_datetime 
apache_beam/io/gcp/bigquery_read_it_test.py::ReadUsingStorageApiTests::test_iobase_source_with_query 
[gw7] PASSED apache_beam/examples/dataframe/taxiride_it_test.py::TaxirideIT::test_enrich 
apache_beam/examples/streaming_wordcount_it_test.py::StreamingWordCountIT::test_streaming_wordcount_it 
[gw4] PASSED apache_beam/io/parquetio_it_test.py::TestParquetIT::test_parquetio_it 
apache_beam/ml/inference/base_test.py::RunInferenceBaseTest::test_run_inference_with_side_inputin_streaming 
[gw4] SKIPPED apache_beam/ml/inference/base_test.py::RunInferenceBaseTest::test_run_inference_with_side_inputin_streaming 
apache_beam/runners/dataflow/dataflow_exercise_metrics_pipeline_test.py::ExerciseMetricsPipelineTest::test_metrics_it 
[gw4] SKIPPED apache_beam/runners/dataflow/dataflow_exercise_metrics_pipeline_test.py::ExerciseMetricsPipelineTest::test_metrics_it 
[gw3] PASSED apache_beam/ml/gcp/visionml_test_it.py::VisionMlTestIT::test_text_detection_with_language_hint 
apache_beam/transforms/periodicsequence_it_test.py::PeriodicSequenceIT::test_periodicsequence_outputs_valid_watermarks_it 
[gw3] SKIPPED apache_beam/transforms/periodicsequence_it_test.py::PeriodicSequenceIT::test_periodicsequence_outputs_valid_watermarks_it 
[gw1] PASSED apache_beam/examples/cookbook/datastore_wordcount_it_test.py::DatastoreWordCountIT::test_datastore_wordcount_it 
apache_beam/io/gcp/datastore/v1new/datastore_write_it_test.py::DatastoreWriteIT::test_datastore_write_limit 
[gw2] PASSED apache_beam/examples/cookbook/bigquery_tornadoes_it_test.py::BigqueryTornadoesIT::test_bigquery_tornadoes_it 
apache_beam/io/fileio_test.py::MatchIntegrationTest::test_transform_on_gcs 
[gw0] PASSED apache_beam/io/gcp/bigquery_read_it_test.py::ReadUsingStorageApiTests::test_iobase_source_with_query 
apache_beam/io/gcp/bigquery_read_it_test.py::ReadUsingStorageApiTests::test_iobase_source_with_query_and_filters 
[gw2] PASSED apache_beam/io/fileio_test.py::MatchIntegrationTest::test_transform_on_gcs 
[gw0] PASSED apache_beam/io/gcp/bigquery_read_it_test.py::ReadUsingStorageApiTests::test_iobase_source_with_query_and_filters 
apache_beam/io/gcp/bigquery_read_it_test.py::ReadUsingStorageApiTests::test_iobase_source_with_row_restriction 
[gw5] PASSED apache_beam/examples/complete/game/leader_board_it_test.py::LeaderBoardIT::test_leader_board_it 
apache_beam/ml/inference/onnx_inference_it_test.py::OnnxInference::test_onnx_run_inference_roberta_sentiment_classification 
[gw5] SKIPPED apache_beam/ml/inference/onnx_inference_it_test.py::OnnxInference::test_onnx_run_inference_roberta_sentiment_classification 
[gw7] PASSED apache_beam/examples/streaming_wordcount_it_test.py::StreamingWordCountIT::test_streaming_wordcount_it 
apache_beam/examples/dataframe/flight_delays_it_test.py::FlightDelaysTest::test_flight_delays 
[gw0] PASSED apache_beam/io/gcp/bigquery_read_it_test.py::ReadUsingStorageApiTests::test_iobase_source_with_row_restriction 
apache_beam/io/gcp/bigquery_read_it_test.py::ReadUsingStorageApiTests::test_iobase_source_with_very_selective_filters 
[gw7] PASSED apache_beam/examples/dataframe/flight_delays_it_test.py::FlightDelaysTest::test_flight_delays 
[gw0] PASSED apache_beam/io/gcp/bigquery_read_it_test.py::ReadUsingStorageApiTests::test_iobase_source_with_very_selective_filters 
apache_beam/io/gcp/bigquery_read_it_test.py::ReadNewTypesTests::test_iobase_source 
[gw0] PASSED apache_beam/io/gcp/bigquery_read_it_test.py::ReadNewTypesTests::test_iobase_source 
apache_beam/io/gcp/bigquery_read_it_test.py::ReadNewTypesTests::test_native_source 
[gw1] PASSED apache_beam/io/gcp/datastore/v1new/datastore_write_it_test.py::DatastoreWriteIT::test_datastore_write_limit 
apache_beam/transforms/external_it_test.py::ExternalTransformIT::test_job_python_from_python_it 
[gw0] PASSED apache_beam/io/gcp/bigquery_read_it_test.py::ReadNewTypesTests::test_native_source 
apache_beam/io/gcp/bigquery_read_it_test.py::ReadAllBQTests::test_read_queries 
[gw1] PASSED apache_beam/transforms/external_it_test.py::ExternalTransformIT::test_job_python_from_python_it 
[gw0] PASSED apache_beam/io/gcp/bigquery_read_it_test.py::ReadAllBQTests::test_read_queries 
apache_beam/io/gcp/bigquery_read_it_test.py::ReadInteractiveRunnerTests::test_read_in_interactive_runner 
[gw0] PASSED apache_beam/io/gcp/bigquery_read_it_test.py::ReadInteractiveRunnerTests::test_read_in_interactive_runner 

=============================== warnings summary ===============================
apache_beam/io/gcp/bigquery.py:2603
  <https://ci-beam.apache.org/job/beam_PostCommit_Python39/ws/src/sdks/python/apache_beam/io/gcp/bigquery.py>:2603: DeprecationWarning: invalid escape sequence \#
    """Read data from BigQuery.

apache_beam/io/gcp/bigquery_read_it_test.py::ReadTests::test_native_source
  <https://ci-beam.apache.org/job/beam_PostCommit_Python39/ws/src/sdks/python/apache_beam/io/gcp/bigquery_read_it_test.py>:170: BeamDeprecationWarning: BigQuerySource is deprecated since 2.25.0. Use ReadFromBigQuery instead.
    beam.io.BigQuerySource(query=self.query, use_standard_sql=True)))

apache_beam/io/gcp/bigquery_test.py::PubSubBigQueryIT::test_file_loads
apache_beam/io/gcp/bigquery_test.py::PubSubBigQueryIT::test_streaming_inserts
apache_beam/examples/complete/game/hourly_team_score_it_test.py::HourlyTeamScoreIT::test_hourly_team_score_it
apache_beam/examples/complete/game/game_stats_it_test.py::GameStatsIT::test_game_stats_it
apache_beam/examples/complete/game/leader_board_it_test.py::LeaderBoardIT::test_leader_board_it
  <https://ci-beam.apache.org/job/beam_PostCommit_Python39/ws/src/sdks/python/apache_beam/io/gcp/tests/utils.py>:63: PendingDeprecationWarning: Client.dataset is deprecated and will be removed in a future version. Use a string like 'my_project.my_dataset' or a cloud.google.bigquery.DatasetReference object, instead.
    dataset_ref = client.dataset(unique_dataset_name, project=project)

apache_beam/examples/cookbook/bigquery_tornadoes_it_test.py::BigqueryTornadoesIT::test_bigquery_tornadoes_it
  <https://ci-beam.apache.org/job/beam_PostCommit_Python39/ws/src/sdks/python/apache_beam/io/gcp/tests/utils.py>:100: PendingDeprecationWarning: Client.dataset is deprecated and will be removed in a future version. Use a string like 'my_project.my_dataset' or a cloud.google.bigquery.DatasetReference object, instead.
    table_ref = client.dataset(dataset_id).table(table_id)

apache_beam/examples/dataframe/flight_delays_it_test.py::FlightDelaysTest::test_flight_delays
  <https://ci-beam.apache.org/job/beam_PostCommit_Python39/ws/src/sdks/python/apache_beam/examples/dataframe/flight_delays.py>:47: FutureWarning: The default value of numeric_only in DataFrame.mean is deprecated. In a future version, it will default to False. In addition, specifying 'numeric_only=None' is deprecated. Select only valid columns or specify the value of numeric_only to silence this warning.
    return airline_df[at_top_airports].mean()

apache_beam/io/gcp/bigquery_read_it_test.py::ReadNewTypesTests::test_native_source
  <https://ci-beam.apache.org/job/beam_PostCommit_Python39/ws/src/sdks/python/apache_beam/io/gcp/bigquery_read_it_test.py>:706: BeamDeprecationWarning: BigQuerySource is deprecated since 2.25.0. Use ReadFromBigQuery instead.
    beam.io.BigQuerySource(query=self.query, use_standard_sql=True)))

-- Docs: https://docs.pytest.org/en/stable/how-to/capture-warnings.html
- generated xml file: <https://ci-beam.apache.org/job/beam_PostCommit_Python39/ws/src/sdks/python/pytest_postCommitIT-df-py39.xml> -
=========== 83 passed, 49 skipped, 10 warnings in 5924.72s (1:38:44) ===========

FAILURE: Build failed with an exception.

* Where:
Script '<https://ci-beam.apache.org/job/beam_PostCommit_Python39/ws/src/sdks/python/test-suites/portable/common.gradle'> line: 326

* What went wrong:
Execution failed for task ':sdks:python:test-suites:portable:py39:postCommitPy39IT'.
> Process 'command 'sh'' finished with non-zero exit value 1

* Try:
> Run with --stacktrace option to get the stack trace.
> Run with --info or --debug option to get more log output.
> Get more help at https://help.gradle.org.

Deprecated Gradle features were used in this build, making it incompatible with Gradle 9.0.

You can use '--warning-mode all' to show the individual deprecation warnings and determine if they come from your own scripts or plugins.

For more on this, please refer to https://docs.gradle.org/8.4/userguide/command_line_interface.html#sec:command_line_warnings in the Gradle documentation.

BUILD FAILED in 1h 45m 6s
222 actionable tasks: 157 executed, 61 from cache, 4 up-to-date

Publishing build scan...
https://ge.apache.org/s/jwukgsdhpnbt6

Build step 'Invoke Gradle script' changed build result to FAILURE
Build step 'Invoke Gradle script' marked build as failure

---------------------------------------------------------------------
To unsubscribe, e-mail: builds-unsubscribe@beam.apache.org
For additional commands, e-mail: builds-help@beam.apache.org


Jenkins build is back to normal : beam_PostCommit_Python39 #2649

Posted by Apache Jenkins Server <je...@builds.apache.org>.
See <https://ci-beam.apache.org/job/beam_PostCommit_Python39/2649/display/redirect>


---------------------------------------------------------------------
To unsubscribe, e-mail: builds-unsubscribe@beam.apache.org
For additional commands, e-mail: builds-help@beam.apache.org


Build failed in Jenkins: beam_PostCommit_Python39 #2648

Posted by Apache Jenkins Server <je...@builds.apache.org>.
See <https://ci-beam.apache.org/job/beam_PostCommit_Python39/2648/display/redirect>

Changes:


------------------------------------------
[...truncated 9.78 MB...]
}
message: "Closing all cached grpc data channels."
log_location: "/usr/local/lib/python3.9/site-packages/apache_beam/runners/worker/data_plane.py:820"
thread: "MainThread"

INFO:root:severity: INFO
timestamp {
  seconds: 1702492778
  nanos: 307618856
}
message: "Closing all cached gRPC state handlers."
log_location: "/usr/local/lib/python3.9/site-packages/apache_beam/runners/worker/sdk_worker.py:918"
thread: "MainThread"

INFO:root:severity: INFO
timestamp {
  seconds: 1702492778
  nanos: 307920932
}
message: "Done consuming work."
log_location: "/usr/local/lib/python3.9/site-packages/apache_beam/runners/worker/sdk_worker.py:290"
thread: "MainThread"

INFO:root:severity: INFO
timestamp {
  seconds: 1702492778
  nanos: 308009386
}
message: "Python sdk harness exiting."
log_location: "/usr/local/lib/python3.9/site-packages/apache_beam/runners/worker/sdk_worker_main.py:213"
thread: "MainThread"

9b3f9831d5f6f11462728bf9e7843b41c5de1e66ebb4adc66de70a1585e16499
INFO:apache_beam.runners.portability.local_job_service:Completed job in 22.389211177825928 seconds with state DONE.
INFO:root:Completed job in 22.389211177825928 seconds with state DONE.
INFO:apache_beam.runners.portability.portable_runner:Job state changed to DONE

> Task :sdks:python:test-suites:portable:py39:portableWordCountSparkRunnerBatch
INFO:apache_beam.runners.worker.worker_pool_main:Listening for workers at localhost:42727
INFO:apache_beam.runners.portability.fn_api_runner.translations:==================== <function pack_combiners at 0x7ff64815f0d0> ====================
INFO:apache_beam.runners.portability.fn_api_runner.translations:==================== <function lift_combiners at 0x7ff64815f160> ====================
INFO:apache_beam.runners.portability.fn_api_runner.translations:==================== <function sort_stages at 0x7ff64815f8b0> ====================
INFO:apache_beam.utils.subprocess_server:Starting service with ('java' '-jar' '<https://ci-beam.apache.org/job/beam_PostCommit_Python39/ws/src/runners/spark/3/job-server/build/libs/beam-runners-spark-3-job-server-2.53.0-SNAPSHOT.jar'> '--spark-master-url' 'local[4]' '--artifacts-dir' '/tmp/beam-tempk7j6ltpn/artifactsupa8a480' '--job-port' '56545' '--artifact-port' '0' '--expansion-port' '0')
INFO:apache_beam.utils.subprocess_server:23/12/13 18:39:46 WARN software.amazon.awssdk.regions.internal.util.EC2MetadataUtils: Unable to retrieve the requested metadata.
INFO:apache_beam.utils.subprocess_server:23/12/13 18:39:47 INFO org.apache.beam.runners.jobsubmission.JobServerDriver: ArtifactStagingService started on localhost:38399
INFO:apache_beam.utils.subprocess_server:23/12/13 18:39:47 INFO org.apache.beam.runners.jobsubmission.JobServerDriver: Java ExpansionService started on localhost:44861
WARNING:root:Waiting for grpc channel to be ready at localhost:56545.
INFO:apache_beam.utils.subprocess_server:23/12/13 18:39:47 INFO org.apache.beam.runners.jobsubmission.JobServerDriver: JobService started on localhost:56545
INFO:apache_beam.utils.subprocess_server:23/12/13 18:39:47 INFO org.apache.beam.runners.jobsubmission.JobServerDriver: Job server now running, terminate with Ctrl+C
INFO:apache_beam.utils.subprocess_server:23/12/13 18:39:48 INFO org.apache.beam.runners.fnexecution.artifact.ArtifactStagingService: Staging artifacts for job_3406ef08-d2d2-4d13-92a6-86ee5175536c.
INFO:apache_beam.utils.subprocess_server:23/12/13 18:39:48 INFO org.apache.beam.runners.fnexecution.artifact.ArtifactStagingService: Resolving artifacts for job_3406ef08-d2d2-4d13-92a6-86ee5175536c.0:ref_Environment_default_environment_1.
INFO:apache_beam.utils.subprocess_server:23/12/13 18:39:48 INFO org.apache.beam.runners.fnexecution.artifact.ArtifactStagingService: Getting 1 artifacts for job_3406ef08-d2d2-4d13-92a6-86ee5175536c.null.
INFO:apache_beam.utils.subprocess_server:23/12/13 18:39:48 INFO org.apache.beam.runners.fnexecution.artifact.ArtifactStagingService: Artifacts fully staged for job_3406ef08-d2d2-4d13-92a6-86ee5175536c.
INFO:apache_beam.utils.subprocess_server:23/12/13 18:39:49 INFO org.apache.beam.runners.spark.SparkJobInvoker: Invoking job BeamApp-jenkins-1213183949-1f2493f3_14a658ec-27c6-4892-8dc6-76e08d246782
INFO:apache_beam.utils.subprocess_server:23/12/13 18:39:49 INFO org.apache.beam.runners.jobsubmission.JobInvocation: Starting job invocation BeamApp-jenkins-1213183949-1f2493f3_14a658ec-27c6-4892-8dc6-76e08d246782
INFO:apache_beam.runners.portability.portable_runner:Environment "LOOPBACK" has started a component necessary for the execution. Be sure to run the pipeline using
  with Pipeline() as p:
    p.apply(..)
This ensures that the pipeline finishes before this program exits.
INFO:apache_beam.runners.portability.portable_runner:Job state changed to STOPPED
INFO:apache_beam.runners.portability.portable_runner:Job state changed to STARTING
INFO:apache_beam.runners.portability.portable_runner:Job state changed to RUNNING
INFO:apache_beam.utils.subprocess_server:23/12/13 18:39:49 INFO org.apache.beam.runners.spark.translation.SparkContextFactory: Creating a brand new Spark Context.
INFO:apache_beam.utils.subprocess_server:23/12/13 18:39:50 WARN org.apache.hadoop.util.NativeCodeLoader: Unable to load native-hadoop library for your platform... using builtin-java classes where applicable
INFO:apache_beam.utils.subprocess_server:23/12/13 18:39:51 INFO org.sparkproject.jetty.util.log: Logging initialized @9140ms to org.sparkproject.jetty.util.log.Slf4jLog
INFO:apache_beam.utils.subprocess_server:23/12/13 18:39:51 INFO org.sparkproject.jetty.server.Server: jetty-9.4.44.v20210927; built: 2021-09-27T23:02:44.612Z; git: 8da83308eeca865e495e53ef315a249d63ba9332; jvm 1.8.0_392-8u392-ga-1~20.04-b08
INFO:apache_beam.utils.subprocess_server:23/12/13 18:39:51 INFO org.sparkproject.jetty.server.Server: Started @9320ms
INFO:apache_beam.utils.subprocess_server:23/12/13 18:39:52 INFO org.sparkproject.jetty.server.AbstractConnector: Started ServerConnector@334cc0c2{HTTP/1.1, (http/1.1)}{127.0.0.1:4040}
INFO:apache_beam.utils.subprocess_server:23/12/13 18:39:52 INFO org.sparkproject.jetty.server.handler.ContextHandler: Started o.s.j.s.ServletContextHandler@4fff6ffd{/jobs,null,AVAILABLE,@Spark}
INFO:apache_beam.utils.subprocess_server:23/12/13 18:39:52 INFO org.sparkproject.jetty.server.handler.ContextHandler: Started o.s.j.s.ServletContextHandler@33ab4001{/jobs/json,null,AVAILABLE,@Spark}
INFO:apache_beam.utils.subprocess_server:23/12/13 18:39:52 INFO org.sparkproject.jetty.server.handler.ContextHandler: Started o.s.j.s.ServletContextHandler@758ddbee{/jobs/job,null,AVAILABLE,@Spark}
INFO:apache_beam.utils.subprocess_server:23/12/13 18:39:52 INFO org.sparkproject.jetty.server.handler.ContextHandler: Started o.s.j.s.ServletContextHandler@149c0d46{/jobs/job/json,null,AVAILABLE,@Spark}
INFO:apache_beam.utils.subprocess_server:23/12/13 18:39:52 INFO org.sparkproject.jetty.server.handler.ContextHandler: Started o.s.j.s.ServletContextHandler@add8e3f{/stages,null,AVAILABLE,@Spark}
INFO:apache_beam.utils.subprocess_server:23/12/13 18:39:52 INFO org.sparkproject.jetty.server.handler.ContextHandler: Started o.s.j.s.ServletContextHandler@5b3f233{/stages/json,null,AVAILABLE,@Spark}
INFO:apache_beam.utils.subprocess_server:23/12/13 18:39:52 INFO org.sparkproject.jetty.server.handler.ContextHandler: Started o.s.j.s.ServletContextHandler@43b8bb84{/stages/stage,null,AVAILABLE,@Spark}
INFO:apache_beam.utils.subprocess_server:23/12/13 18:39:52 INFO org.sparkproject.jetty.server.handler.ContextHandler: Started o.s.j.s.ServletContextHandler@11ff6cb6{/stages/stage/json,null,AVAILABLE,@Spark}
INFO:apache_beam.utils.subprocess_server:23/12/13 18:39:52 INFO org.sparkproject.jetty.server.handler.ContextHandler: Started o.s.j.s.ServletContextHandler@49666fc3{/stages/pool,null,AVAILABLE,@Spark}
INFO:apache_beam.utils.subprocess_server:23/12/13 18:39:52 INFO org.sparkproject.jetty.server.handler.ContextHandler: Started o.s.j.s.ServletContextHandler@58fa604f{/stages/pool/json,null,AVAILABLE,@Spark}
INFO:apache_beam.utils.subprocess_server:23/12/13 18:39:52 INFO org.sparkproject.jetty.server.handler.ContextHandler: Started o.s.j.s.ServletContextHandler@4d267df{/storage,null,AVAILABLE,@Spark}
INFO:apache_beam.utils.subprocess_server:23/12/13 18:39:52 INFO org.sparkproject.jetty.server.handler.ContextHandler: Started o.s.j.s.ServletContextHandler@6ccb8281{/storage/json,null,AVAILABLE,@Spark}
INFO:apache_beam.utils.subprocess_server:23/12/13 18:39:52 INFO org.sparkproject.jetty.server.handler.ContextHandler: Started o.s.j.s.ServletContextHandler@5430ccd{/storage/rdd,null,AVAILABLE,@Spark}
INFO:apache_beam.utils.subprocess_server:23/12/13 18:39:52 INFO org.sparkproject.jetty.server.handler.ContextHandler: Started o.s.j.s.ServletContextHandler@1141e20c{/storage/rdd/json,null,AVAILABLE,@Spark}
INFO:apache_beam.utils.subprocess_server:23/12/13 18:39:52 INFO org.sparkproject.jetty.server.handler.ContextHandler: Started o.s.j.s.ServletContextHandler@5d7ec272{/environment,null,AVAILABLE,@Spark}
INFO:apache_beam.utils.subprocess_server:23/12/13 18:39:52 INFO org.sparkproject.jetty.server.handler.ContextHandler: Started o.s.j.s.ServletContextHandler@17d28ff1{/environment/json,null,AVAILABLE,@Spark}
INFO:apache_beam.utils.subprocess_server:23/12/13 18:39:52 INFO org.sparkproject.jetty.server.handler.ContextHandler: Started o.s.j.s.ServletContextHandler@4878b59c{/executors,null,AVAILABLE,@Spark}
INFO:apache_beam.utils.subprocess_server:23/12/13 18:39:52 INFO org.sparkproject.jetty.server.handler.ContextHandler: Started o.s.j.s.ServletContextHandler@2842c979{/executors/json,null,AVAILABLE,@Spark}
INFO:apache_beam.utils.subprocess_server:23/12/13 18:39:52 INFO org.sparkproject.jetty.server.handler.ContextHandler: Started o.s.j.s.ServletContextHandler@32048c56{/executors/threadDump,null,AVAILABLE,@Spark}
INFO:apache_beam.utils.subprocess_server:23/12/13 18:39:52 INFO org.sparkproject.jetty.server.handler.ContextHandler: Started o.s.j.s.ServletContextHandler@44a0a038{/executors/threadDump/json,null,AVAILABLE,@Spark}
INFO:apache_beam.utils.subprocess_server:23/12/13 18:39:52 INFO org.sparkproject.jetty.server.handler.ContextHandler: Started o.s.j.s.ServletContextHandler@5894477{/static,null,AVAILABLE,@Spark}
INFO:apache_beam.utils.subprocess_server:23/12/13 18:39:52 INFO org.sparkproject.jetty.server.handler.ContextHandler: Started o.s.j.s.ServletContextHandler@be7b04{/,null,AVAILABLE,@Spark}
INFO:apache_beam.utils.subprocess_server:23/12/13 18:39:52 INFO org.sparkproject.jetty.server.handler.ContextHandler: Started o.s.j.s.ServletContextHandler@36be865f{/api,null,AVAILABLE,@Spark}
INFO:apache_beam.utils.subprocess_server:23/12/13 18:39:52 INFO org.sparkproject.jetty.server.handler.ContextHandler: Started o.s.j.s.ServletContextHandler@401313f0{/jobs/job/kill,null,AVAILABLE,@Spark}
INFO:apache_beam.utils.subprocess_server:23/12/13 18:39:52 INFO org.sparkproject.jetty.server.handler.ContextHandler: Started o.s.j.s.ServletContextHandler@4bfa8cd7{/stages/stage/kill,null,AVAILABLE,@Spark}
INFO:apache_beam.utils.subprocess_server:23/12/13 18:39:52 INFO org.sparkproject.jetty.server.handler.ContextHandler: Started o.s.j.s.ServletContextHandler@3e115c16{/metrics/json,null,AVAILABLE,@Spark}
INFO:apache_beam.utils.subprocess_server:23/12/13 18:39:52 INFO org.apache.beam.runners.spark.metrics.MetricsAccumulator: Instantiated metrics accumulator: MetricQueryResults()
INFO:apache_beam.utils.subprocess_server:23/12/13 18:39:52 WARN software.amazon.awssdk.regions.internal.util.EC2MetadataUtils: Unable to retrieve the requested metadata.
INFO:apache_beam.utils.subprocess_server:23/12/13 18:39:52 INFO org.apache.beam.runners.spark.SparkPipelineRunner: Running job BeamApp-jenkins-1213183949-1f2493f3_14a658ec-27c6-4892-8dc6-76e08d246782 on Spark master local[4]
INFO:apache_beam.runners.worker.statecache:Creating state cache with size 104857600
INFO:apache_beam.runners.worker.sdk_worker:Creating insecure control channel for localhost:39051.
INFO:apache_beam.runners.worker.sdk_worker:Control channel established.
INFO:apache_beam.runners.worker.sdk_worker:Initializing SDKHarness with unbounded number of workers.
INFO:apache_beam.utils.subprocess_server:23/12/13 18:39:54 INFO org.apache.beam.runners.fnexecution.control.FnApiControlClientPoolService: Beam Fn Control client connected with id 1-1
INFO:apache_beam.utils.subprocess_server:23/12/13 18:39:54 INFO org.apache.beam.runners.fnexecution.control.FnApiControlClientPoolService: getProcessBundleDescriptor request with id 1-2
INFO:apache_beam.runners.worker.sdk_worker:Creating insecure state channel for localhost:39381.
INFO:apache_beam.runners.worker.sdk_worker:State channel established.
INFO:apache_beam.runners.worker.data_plane:Creating client data channel for localhost:42147
INFO:apache_beam.utils.subprocess_server:23/12/13 18:39:54 INFO org.apache.beam.runners.fnexecution.data.GrpcDataService: Beam Fn Data client connected.
INFO:apache_beam.utils.subprocess_server:23/12/13 18:39:54 INFO org.apache.beam.runners.fnexecution.control.FnApiControlClientPoolService: getProcessBundleDescriptor request with id 1-3
INFO:apache_beam.utils.subprocess_server:23/12/13 18:39:54 INFO org.apache.beam.runners.fnexecution.control.FnApiControlClientPoolService: getProcessBundleDescriptor request with id 1-4
INFO:apache_beam.utils.subprocess_server:23/12/13 18:39:54 INFO org.apache.beam.runners.fnexecution.control.FnApiControlClientPoolService: getProcessBundleDescriptor request with id 1-5
INFO:apache_beam.utils.subprocess_server:23/12/13 18:39:55 INFO org.apache.beam.runners.fnexecution.control.FnApiControlClientPoolService: getProcessBundleDescriptor request with id 1-7
INFO:apache_beam.utils.subprocess_server:23/12/13 18:39:55 INFO org.apache.beam.runners.fnexecution.control.FnApiControlClientPoolService: getProcessBundleDescriptor request with id 1-9
INFO:apache_beam.utils.subprocess_server:23/12/13 18:39:55 INFO org.apache.beam.runners.fnexecution.control.FnApiControlClientPoolService: getProcessBundleDescriptor request with id 1-6
INFO:apache_beam.utils.subprocess_server:23/12/13 18:39:55 INFO org.apache.beam.runners.fnexecution.control.FnApiControlClientPoolService: getProcessBundleDescriptor request with id 1-8
INFO:apache_beam.utils.subprocess_server:23/12/13 18:39:55 INFO org.apache.beam.runners.fnexecution.control.FnApiControlClientPoolService: getProcessBundleDescriptor request with id 1-10
INFO:apache_beam.utils.subprocess_server:23/12/13 18:39:55 INFO org.apache.beam.runners.fnexecution.control.FnApiControlClientPoolService: getProcessBundleDescriptor request with id 1-11
INFO:apache_beam.utils.subprocess_server:23/12/13 18:39:55 INFO org.apache.beam.runners.fnexecution.control.FnApiControlClientPoolService: getProcessBundleDescriptor request with id 1-12
INFO:apache_beam.utils.subprocess_server:23/12/13 18:39:55 INFO org.apache.beam.runners.fnexecution.control.FnApiControlClientPoolService: getProcessBundleDescriptor request with id 1-13
INFO:apache_beam.utils.subprocess_server:23/12/13 18:39:55 INFO org.apache.beam.runners.fnexecution.control.FnApiControlClientPoolService: getProcessBundleDescriptor request with id 1-14
INFO:apache_beam.utils.subprocess_server:23/12/13 18:39:55 INFO org.apache.beam.runners.fnexecution.control.FnApiControlClientPoolService: getProcessBundleDescriptor request with id 1-15
INFO:apache_beam.utils.subprocess_server:23/12/13 18:39:55 INFO org.apache.beam.runners.spark.SparkPipelineRunner: Job BeamApp-jenkins-1213183949-1f2493f3_14a658ec-27c6-4892-8dc6-76e08d246782: Pipeline translated successfully. Computing outputs
INFO:apache_beam.utils.subprocess_server:23/12/13 18:39:55 INFO org.apache.beam.runners.fnexecution.control.FnApiControlClientPoolService: getProcessBundleDescriptor request with id 1-16
INFO:apache_beam.io.filebasedsink:Starting finalize_write threads with num_shards: 4 (skipped: 0), batches: 4, num_threads: 4
INFO:apache_beam.io.filebasedsink:Renamed 4 shards in 0.01 seconds.
INFO:apache_beam.utils.subprocess_server:23/12/13 18:39:55 INFO org.apache.beam.runners.spark.SparkPipelineRunner: Job BeamApp-jenkins-1213183949-1f2493f3_14a658ec-27c6-4892-8dc6-76e08d246782 finished.
INFO:apache_beam.utils.subprocess_server:23/12/13 18:39:55 INFO org.sparkproject.jetty.server.AbstractConnector: Stopped Spark@334cc0c2{HTTP/1.1, (http/1.1)}{127.0.0.1:4040}
INFO:apache_beam.runners.portability.portable_runner:Job state changed to DONE
Exception in thread run_worker_1-1:
Traceback (most recent call last):
  File "/usr/lib/python3.9/threading.py", line 973, in _bootstrap_inner
Exception in thread read_state:
Traceback (most recent call last):
  File "/usr/lib/python3.9/threading.py", line 973, in _bootstrap_inner
    self.run()
    self.run()
  File "/usr/lib/python3.9/threading.py", line 910, in run
  File "/usr/lib/python3.9/threading.py", line 910, in run
    self._target(*self._args, **self._kwargs)
  File "<https://ci-beam.apache.org/job/beam_PostCommit_Python39/ws/src/sdks/python/apache_beam/runners/worker/sdk_worker.py",> line 265, in run
    self._target(*self._args, **self._kwargs)
    for work_request in self._control_stub.Control(get_responses()):
  File "<https://ci-beam.apache.org/job/beam_PostCommit_Python39/ws/src/sdks/python/apache_beam/runners/worker/sdk_worker.py",> line 1049, in pull_responses
  File "<https://ci-beam.apache.org/job/beam_PostCommit_Python39/ws/src/build/gradleenv/2022703443/lib/python3.9/site-packages/grpc/_channel.py",> line 540, in __next__
    for response in responses:
  File "<https://ci-beam.apache.org/job/beam_PostCommit_Python39/ws/src/build/gradleenv/2022703443/lib/python3.9/site-packages/grpc/_channel.py",> line 540, in __next__
    return self._next()
  File "<https://ci-beam.apache.org/job/beam_PostCommit_Python39/ws/src/build/gradleenv/2022703443/lib/python3.9/site-packages/grpc/_channel.py",> line 966, in _next
    return self._next()
  File "<https://ci-beam.apache.org/job/beam_PostCommit_Python39/ws/src/build/gradleenv/2022703443/lib/python3.9/site-packages/grpc/_channel.py",> line 966, in _next
    raise self
    raise self
grpc._channel._MultiThreadedRendezvous: <_MultiThreadedRendezvous of RPC that terminated with:
	status = StatusCode.UNAVAILABLE
	details = "Socket closed"
	debug_error_string = "UNKNOWN:Error received from peer ipv6:%5B::1%5D:39381 {grpc_message:"Socket closed", grpc_status:14, created_time:"2023-12-13T18:39:56.29220979+00:00"}"
>grpc._channel._MultiThreadedRendezvous: <_MultiThreadedRendezvous of RPC that terminated with:
	status = StatusCode.UNAVAILABLE
	details = "Socket closed"
	debug_error_string = "UNKNOWN:Error received from peer ipv6:%5B::1%5D:39051 {created_time:"2023-12-13T18:39:56.292229502+00:00", grpc_status:14, grpc_message:"Socket closed"}"
>ERROR:apache_beam.runners.worker.data_plane:Failed to read inputs in the data plane.
Traceback (most recent call last):
  File "<https://ci-beam.apache.org/job/beam_PostCommit_Python39/ws/src/sdks/python/apache_beam/runners/worker/data_plane.py",> line 669, in _read_inputs
    for elements in elements_iterator:
  File "<https://ci-beam.apache.org/job/beam_PostCommit_Python39/ws/src/build/gradleenv/2022703443/lib/python3.9/site-packages/grpc/_channel.py",> line 540, in __next__
    return self._next()
  File "<https://ci-beam.apache.org/job/beam_PostCommit_Python39/ws/src/build/gradleenv/2022703443/lib/python3.9/site-packages/grpc/_channel.py",> line 966, in _next
    raise self
grpc._channel._MultiThreadedRendezvous: <_MultiThreadedRendezvous of RPC that terminated with:
	status = StatusCode.UNAVAILABLE
	details = "Socket closed"
	debug_error_string = "UNKNOWN:Error received from peer ipv6:%5B::1%5D:42147 {grpc_message:"Socket closed", grpc_status:14, created_time:"2023-12-13T18:39:56.292131311+00:00"}"
>


Exception in thread read_grpc_client_inputs:
Traceback (most recent call last):
  File "/usr/lib/python3.9/threading.py", line 973, in _bootstrap_inner
    self.run()
  File "/usr/lib/python3.9/threading.py", line 910, in run
    self._target(*self._args, **self._kwargs)
  File "<https://ci-beam.apache.org/job/beam_PostCommit_Python39/ws/src/sdks/python/apache_beam/runners/worker/data_plane.py",> line 686, in <lambda>
    target=lambda: self._read_inputs(elements_iterator),
  File "<https://ci-beam.apache.org/job/beam_PostCommit_Python39/ws/src/sdks/python/apache_beam/runners/worker/data_plane.py",> line 669, in _read_inputs
    for elements in elements_iterator:
  File "<https://ci-beam.apache.org/job/beam_PostCommit_Python39/ws/src/build/gradleenv/2022703443/lib/python3.9/site-packages/grpc/_channel.py",> line 540, in __next__
    return self._next()
  File "<https://ci-beam.apache.org/job/beam_PostCommit_Python39/ws/src/build/gradleenv/2022703443/lib/python3.9/site-packages/grpc/_channel.py",> line 966, in _next
    raise self
grpc._channel._MultiThreadedRendezvous: <_MultiThreadedRendezvous of RPC that terminated with:
	status = StatusCode.UNAVAILABLE
	details = "Socket closed"
	debug_error_string = "UNKNOWN:Error received from peer ipv6:%5B::1%5D:42147 {grpc_message:"Socket closed", grpc_status:14, created_time:"2023-12-13T18:39:56.292131311+00:00"}"
>

> Task :sdks:python:test-suites:dataflow:py39:postCommitIT
<https://ci-beam.apache.org/job/beam_PostCommit_Python39/ws/src/build/gradleenv/-1734967050/bin/python3.9>: No module named build
warning: sdist: standard file not found: should have one of README, README.rst, README.txt, README.md

warning: check: missing required meta-data: url

warning: check: missing meta-data: either (author and author_email) or (maintainer and maintainer_email) should be supplied


FAILURE: Build completed with 2 failures.

1: Task failed with an exception.
-----------
* Where:
Script '<https://ci-beam.apache.org/job/beam_PostCommit_Python39/ws/src/sdks/python/test-suites/portable/common.gradle'> line: 326

* What went wrong:
Execution failed for task ':sdks:python:test-suites:portable:py39:postCommitPy39IT'.
> Process 'command 'sh'' finished with non-zero exit value 1

* Try:
> Run with --stacktrace option to get the stack trace.
> Run with --info or --debug option to get more log output.
> Get more help at https://help.gradle.org.
==============================================================================

2: Task failed with an exception.
-----------
* Where:
Script '<https://ci-beam.apache.org/job/beam_PostCommit_Python39/ws/src/sdks/python/test-suites/direct/common.gradle'> line: 52

* What went wrong:
Execution failed for task ':sdks:python:test-suites:direct:py39:postCommitIT'.
> Process 'command 'sh'' finished with non-zero exit value 1

* Try:
> Run with --stacktrace option to get the stack trace.
> Run with --info or --debug option to get more log output.
> Get more help at https://help.gradle.org.
==============================================================================

Deprecated Gradle features were used in this build, making it incompatible with Gradle 9.0.

You can use '--warning-mode all' to show the individual deprecation warnings and determine if they come from your own scripts or plugins.

For more on this, please refer to https://docs.gradle.org/8.4/userguide/command_line_interface.html#sec:command_line_warnings in the Gradle documentation.

BUILD FAILED in 1h 44m 57s
222 actionable tasks: 162 executed, 56 from cache, 4 up-to-date

Publishing build scan...
https://ge.apache.org/s/akbczbw2erbs2

Build step 'Invoke Gradle script' changed build result to FAILURE
Build step 'Invoke Gradle script' marked build as failure

---------------------------------------------------------------------
To unsubscribe, e-mail: builds-unsubscribe@beam.apache.org
For additional commands, e-mail: builds-help@beam.apache.org


Build failed in Jenkins: beam_PostCommit_Python39 #2647

Posted by Apache Jenkins Server <je...@builds.apache.org>.
See <https://ci-beam.apache.org/job/beam_PostCommit_Python39/2647/display/redirect>

Changes:


------------------------------------------
[...truncated 13.12 MB...]
Traceback (most recent call last):
  File "/usr/lib/python3.9/threading.py", line 973, in _bootstrap_inner
    self.run()
  File "/usr/lib/python3.9/threading.py", line 910, in run
Exception in thread read_state:
Traceback (most recent call last):
  File "/usr/lib/python3.9/threading.py", line 973, in _bootstrap_inner
    self._target(*self._args, **self._kwargs)
  File "<https://ci-beam.apache.org/job/beam_PostCommit_Python39/ws/src/sdks/python/apache_beam/runners/worker/sdk_worker.py",> line 265, in run
    self.run()
  File "/usr/lib/python3.9/threading.py", line 910, in run
    for work_request in self._control_stub.Control(get_responses()):
  File "<https://ci-beam.apache.org/job/beam_PostCommit_Python39/ws/src/build/gradleenv/2022703443/lib/python3.9/site-packages/grpc/_channel.py",> line 540, in __next__
    self._target(*self._args, **self._kwargs)
  File "<https://ci-beam.apache.org/job/beam_PostCommit_Python39/ws/src/sdks/python/apache_beam/runners/worker/sdk_worker.py",> line 1042, in pull_responses
    for response in responses:
  File "<https://ci-beam.apache.org/job/beam_PostCommit_Python39/ws/src/build/gradleenv/2022703443/lib/python3.9/site-packages/grpc/_channel.py",> line 540, in __next__
    return self._next()
  File "<https://ci-beam.apache.org/job/beam_PostCommit_Python39/ws/src/build/gradleenv/2022703443/lib/python3.9/site-packages/grpc/_channel.py",> line 966, in _next
    return self._next()
ERROR:apache_beam.runners.worker.data_plane:Failed to read inputs in the data plane.
Traceback (most recent call last):
  File "<https://ci-beam.apache.org/job/beam_PostCommit_Python39/ws/src/sdks/python/apache_beam/runners/worker/data_plane.py",> line 669, in _read_inputs
    for elements in elements_iterator:
  File "<https://ci-beam.apache.org/job/beam_PostCommit_Python39/ws/src/build/gradleenv/2022703443/lib/python3.9/site-packages/grpc/_channel.py",> line 540, in __next__
    return self._next()
  File "<https://ci-beam.apache.org/job/beam_PostCommit_Python39/ws/src/build/gradleenv/2022703443/lib/python3.9/site-packages/grpc/_channel.py",> line 966, in _next
    raise self
grpc._channel._MultiThreadedRendezvous: <_MultiThreadedRendezvous of RPC that terminated with:
	status = StatusCode.UNAVAILABLE
	details = "Socket closed"
	debug_error_string = "UNKNOWN:Error received from peer ipv6:%5B::1%5D:44509 {grpc_message:"Socket closed", grpc_status:14, created_time:"2023-12-13T12:42:52.205273295+00:00"}"
>
  File "<https://ci-beam.apache.org/job/beam_PostCommit_Python39/ws/src/build/gradleenv/2022703443/lib/python3.9/site-packages/grpc/_channel.py",> line 966, in _next
    raise self
grpc._channel._MultiThreadedRendezvous: <_MultiThreadedRendezvous of RPC that terminated with:
	status = StatusCode.UNAVAILABLE
	details = "Socket closed"
	debug_error_string = "UNKNOWN:Error received from peer ipv6:%5B::1%5D:34627 {grpc_message:"Socket closed", grpc_status:14, created_time:"2023-12-13T12:42:52.205318696+00:00"}"
>
    raise self
Exception in thread read_grpc_client_inputs:
grpc._channel._MultiThreadedRendezvous: <_MultiThreadedRendezvous of RPC that terminated with:
	status = StatusCode.UNAVAILABLE
	details = "recvmsg:Connection reset by peer"
	debug_error_string = "UNKNOWN:Error received from peer ipv6:%5B::1%5D:38205 {created_time:"2023-12-13T12:42:52.205304116+00:00", grpc_status:14, grpc_message:"recvmsg:Connection reset by peer"}"
>
Traceback (most recent call last):
  File "/usr/lib/python3.9/threading.py", line 973, in _bootstrap_inner
    self.run()
  File "/usr/lib/python3.9/threading.py", line 910, in run
    self._target(*self._args, **self._kwargs)
  File "<https://ci-beam.apache.org/job/beam_PostCommit_Python39/ws/src/sdks/python/apache_beam/runners/worker/data_plane.py",> line 686, in <lambda>
    target=lambda: self._read_inputs(elements_iterator),
  File "<https://ci-beam.apache.org/job/beam_PostCommit_Python39/ws/src/sdks/python/apache_beam/runners/worker/data_plane.py",> line 669, in _read_inputs
    for elements in elements_iterator:
  File "<https://ci-beam.apache.org/job/beam_PostCommit_Python39/ws/src/build/gradleenv/2022703443/lib/python3.9/site-packages/grpc/_channel.py",> line 540, in __next__
    return self._next()
  File "<https://ci-beam.apache.org/job/beam_PostCommit_Python39/ws/src/build/gradleenv/2022703443/lib/python3.9/site-packages/grpc/_channel.py",> line 966, in _next
    raise self
grpc._channel._MultiThreadedRendezvous: <_MultiThreadedRendezvous of RPC that terminated with:
	status = StatusCode.UNAVAILABLE
	details = "Socket closed"
	debug_error_string = "UNKNOWN:Error received from peer ipv6:%5B::1%5D:44509 {grpc_message:"Socket closed", grpc_status:14, created_time:"2023-12-13T12:42:52.205273295+00:00"}"
>

> Task :sdks:python:test-suites:dataflow:py39:postCommitIT

[gw6] PASSED apache_beam/io/gcp/big_query_query_to_table_it_test.py::BigQueryQueryToTableIT::test_big_query_standard_sql 
apache_beam/examples/dataframe/taxiride_it_test.py::TaxirideIT::test_aggregation 
[gw0] PASSED apache_beam/ml/inference/sklearn_inference_it_test.py::SklearnInference::test_sklearn_mnist_classification_large_model 
apache_beam/ml/inference/sklearn_inference_it_test.py::SklearnInference::test_sklearn_regression 
[gw2] PASSED apache_beam/io/gcp/bigquery_io_read_it_test.py::BigqueryIOReadIT::test_bigquery_read_custom_1M_python 
apache_beam/io/gcp/gcsio_integration_test.py::GcsIOIntegrationTest::test_batch_copy_and_delete 
[gw2] PASSED apache_beam/io/gcp/gcsio_integration_test.py::GcsIOIntegrationTest::test_batch_copy_and_delete 
apache_beam/io/gcp/gcsio_integration_test.py::GcsIOIntegrationTest::test_copy 
[gw2] PASSED apache_beam/io/gcp/gcsio_integration_test.py::GcsIOIntegrationTest::test_copy 
apache_beam/examples/streaming_wordcount_debugging_it_test.py::StreamingWordcountDebuggingIT::test_streaming_wordcount_debugging_it 
[gw2] SKIPPED apache_beam/examples/streaming_wordcount_debugging_it_test.py::StreamingWordcountDebuggingIT::test_streaming_wordcount_debugging_it 
apache_beam/examples/streaming_wordcount_it_test.py::StreamingWordCountIT::test_streaming_wordcount_it 
[gw1] PASSED apache_beam/dataframe/io_it_test.py::ReadUsingReadGbqTests::test_ReadGbq_with_computation 
apache_beam/io/gcp/pubsub_integration_test.py::PubSubIntegrationTest::test_streaming_data_only 
[gw7] PASSED apache_beam/io/gcp/bigquery_json_it_test.py::BigQueryJsonIT::test_streaming_inserts 
apache_beam/examples/wordcount_it_test.py::WordCountIT::test_wordcount_impersonation_it 
[gw5] PASSED apache_beam/io/gcp/bigquery_read_it_test.py::ReadTests::test_table_schema_retrieve_with_direct_read 
apache_beam/io/gcp/bigquery_read_it_test.py::ReadUsingStorageApiTests::test_iobase_source 
[gw4] PASSED apache_beam/io/gcp/bigquery_write_it_test.py::BigQueryWriteIntegrationTests::test_big_query_write_without_schema 
apache_beam/ml/gcp/cloud_dlp_it_test.py::CloudDLPIT::test_deidentification 
[gw3] PASSED apache_beam/io/gcp/bigquery_test.py::PubSubBigQueryIT::test_file_loads 
apache_beam/io/gcp/bigquery_test.py::PubSubBigQueryIT::test_streaming_inserts 
[gw0] PASSED apache_beam/ml/inference/sklearn_inference_it_test.py::SklearnInference::test_sklearn_regression 
apache_beam/io/gcp/healthcare/dicomio_integration_test.py::DICOMIoIntegrationTest::test_dicom_search_instances 
[gw6] PASSED apache_beam/examples/dataframe/taxiride_it_test.py::TaxirideIT::test_aggregation 
apache_beam/examples/dataframe/taxiride_it_test.py::TaxirideIT::test_enrich 
[gw7] PASSED apache_beam/examples/wordcount_it_test.py::WordCountIT::test_wordcount_impersonation_it 
apache_beam/examples/wordcount_it_test.py::WordCountIT::test_wordcount_it 
[gw5] PASSED apache_beam/io/gcp/bigquery_read_it_test.py::ReadUsingStorageApiTests::test_iobase_source 
apache_beam/io/gcp/bigquery_read_it_test.py::ReadUsingStorageApiTests::test_iobase_source_with_column_selection 
[gw0] PASSED apache_beam/io/gcp/healthcare/dicomio_integration_test.py::DICOMIoIntegrationTest::test_dicom_search_instances 
apache_beam/io/gcp/healthcare/dicomio_integration_test.py::DICOMIoIntegrationTest::test_dicom_store_instance_from_gcs 
[gw4] PASSED apache_beam/ml/gcp/cloud_dlp_it_test.py::CloudDLPIT::test_deidentification 
apache_beam/ml/gcp/cloud_dlp_it_test.py::CloudDLPIT::test_inspection 
[gw7] PASSED apache_beam/examples/wordcount_it_test.py::WordCountIT::test_wordcount_it 
apache_beam/examples/complete/game/leader_board_it_test.py::LeaderBoardIT::test_leader_board_it 
[gw5] PASSED apache_beam/io/gcp/bigquery_read_it_test.py::ReadUsingStorageApiTests::test_iobase_source_with_column_selection 
apache_beam/io/gcp/bigquery_read_it_test.py::ReadUsingStorageApiTests::test_iobase_source_with_column_selection_and_row_restriction 
[gw1] PASSED apache_beam/io/gcp/pubsub_integration_test.py::PubSubIntegrationTest::test_streaming_data_only 
apache_beam/io/gcp/pubsub_integration_test.py::PubSubIntegrationTest::test_streaming_with_attributes 
[gw4] PASSED apache_beam/ml/gcp/cloud_dlp_it_test.py::CloudDLPIT::test_inspection 
apache_beam/examples/complete/game/user_score_it_test.py::UserScoreIT::test_user_score_it 
[gw0] PASSED apache_beam/io/gcp/healthcare/dicomio_integration_test.py::DICOMIoIntegrationTest::test_dicom_store_instance_from_gcs 
apache_beam/examples/cookbook/bigquery_tornadoes_it_test.py::BigqueryTornadoesIT::test_bigquery_tornadoes_it 
[gw2] PASSED apache_beam/examples/streaming_wordcount_it_test.py::StreamingWordCountIT::test_streaming_wordcount_it 
apache_beam/examples/complete/autocomplete_test.py::AutocompleteTest::test_autocomplete_it 
[gw5] PASSED apache_beam/io/gcp/bigquery_read_it_test.py::ReadUsingStorageApiTests::test_iobase_source_with_column_selection_and_row_restriction 
apache_beam/io/gcp/bigquery_read_it_test.py::ReadUsingStorageApiTests::test_iobase_source_with_column_selection_and_row_restriction_rows 
[gw0] PASSED apache_beam/examples/cookbook/bigquery_tornadoes_it_test.py::BigqueryTornadoesIT::test_bigquery_tornadoes_it 
apache_beam/examples/inference/tfx_bsl/tfx_bsl_inference_it_test.py::TFXRunInferenceTests::test_tfx_run_inference_mobilenetv2 
[gw0] SKIPPED apache_beam/examples/inference/tfx_bsl/tfx_bsl_inference_it_test.py::TFXRunInferenceTests::test_tfx_run_inference_mobilenetv2 
apache_beam/ml/gcp/videointelligenceml_test_it.py::VideoIntelligenceMlTestIT::test_label_detection_with_video_context 
[gw0] SKIPPED apache_beam/ml/gcp/videointelligenceml_test_it.py::VideoIntelligenceMlTestIT::test_label_detection_with_video_context 
apache_beam/ml/inference/base_test.py::RunInferenceBaseTest::test_run_inference_with_side_inputin_streaming 
[gw0] SKIPPED apache_beam/ml/inference/base_test.py::RunInferenceBaseTest::test_run_inference_with_side_inputin_streaming 
apache_beam/ml/inference/onnx_inference_it_test.py::OnnxInference::test_onnx_run_inference_roberta_sentiment_classification 
[gw0] SKIPPED apache_beam/ml/inference/onnx_inference_it_test.py::OnnxInference::test_onnx_run_inference_roberta_sentiment_classification 
apache_beam/runners/dataflow/dataflow_exercise_metrics_pipeline_test.py::ExerciseMetricsPipelineTest::test_metrics_it 
[gw0] SKIPPED apache_beam/runners/dataflow/dataflow_exercise_metrics_pipeline_test.py::ExerciseMetricsPipelineTest::test_metrics_it 
apache_beam/transforms/external_it_test.py::ExternalTransformIT::test_job_python_from_python_it 
[gw2] PASSED apache_beam/examples/complete/autocomplete_test.py::AutocompleteTest::test_autocomplete_it 
apache_beam/examples/complete/game/game_stats_it_test.py::GameStatsIT::test_game_stats_it 
[gw3] PASSED apache_beam/io/gcp/bigquery_test.py::PubSubBigQueryIT::test_streaming_inserts 
apache_beam/io/gcp/bigquery_test.py::BigQueryFileLoadsIntegrationTests::test_avro_file_load 
[gw5] PASSED apache_beam/io/gcp/bigquery_read_it_test.py::ReadUsingStorageApiTests::test_iobase_source_with_column_selection_and_row_restriction_rows 
apache_beam/io/gcp/bigquery_read_it_test.py::ReadUsingStorageApiTests::test_iobase_source_with_native_datetime 
[gw0] PASSED apache_beam/transforms/external_it_test.py::ExternalTransformIT::test_job_python_from_python_it 
apache_beam/transforms/periodicsequence_it_test.py::PeriodicSequenceIT::test_periodicsequence_outputs_valid_watermarks_it 
[gw0] SKIPPED apache_beam/transforms/periodicsequence_it_test.py::PeriodicSequenceIT::test_periodicsequence_outputs_valid_watermarks_it 
[gw1] PASSED apache_beam/io/gcp/pubsub_integration_test.py::PubSubIntegrationTest::test_streaming_with_attributes 
apache_beam/examples/complete/game/hourly_team_score_it_test.py::HourlyTeamScoreIT::test_hourly_team_score_it 
[gw7] PASSED apache_beam/examples/complete/game/leader_board_it_test.py::LeaderBoardIT::test_leader_board_it 
apache_beam/examples/dataframe/flight_delays_it_test.py::FlightDelaysTest::test_flight_delays 
[gw4] PASSED apache_beam/examples/complete/game/user_score_it_test.py::UserScoreIT::test_user_score_it 
apache_beam/io/fileio_test.py::MatchIntegrationTest::test_transform_on_gcs 
[gw6] PASSED apache_beam/examples/dataframe/taxiride_it_test.py::TaxirideIT::test_enrich 
apache_beam/examples/fastavro_it_test.py::FastavroIT::test_avro_it 
[gw5] PASSED apache_beam/io/gcp/bigquery_read_it_test.py::ReadUsingStorageApiTests::test_iobase_source_with_native_datetime 
apache_beam/io/gcp/bigquery_read_it_test.py::ReadUsingStorageApiTests::test_iobase_source_with_query 
[gw7] PASSED apache_beam/examples/dataframe/flight_delays_it_test.py::FlightDelaysTest::test_flight_delays 
apache_beam/io/parquetio_it_test.py::TestParquetIT::test_parquetio_it 
[gw4] PASSED apache_beam/io/fileio_test.py::MatchIntegrationTest::test_transform_on_gcs 
apache_beam/ml/gcp/naturallanguageml_test_it.py::NaturalLanguageMlTestIT::test_analyzing_syntax 
[gw4] SKIPPED apache_beam/ml/gcp/naturallanguageml_test_it.py::NaturalLanguageMlTestIT::test_analyzing_syntax 
[gw3] PASSED apache_beam/io/gcp/bigquery_test.py::BigQueryFileLoadsIntegrationTests::test_avro_file_load 
apache_beam/examples/complete/juliaset/juliaset/juliaset_test_it.py::JuliaSetTestIT::test_run_example_with_setup_file <https://ci-beam.apache.org/job/beam_PostCommit_Python39/ws/src/build/gradleenv/-1734967050/bin/python3.9>: No module named build
warning: sdist: standard file not found: should have one of README, README.rst, README.txt, README.md

warning: check: missing required meta-data: url

warning: check: missing meta-data: either (author and author_email) or (maintainer and maintainer_email) should be supplied


[gw5] PASSED apache_beam/io/gcp/bigquery_read_it_test.py::ReadUsingStorageApiTests::test_iobase_source_with_query 
apache_beam/io/gcp/bigquery_read_it_test.py::ReadUsingStorageApiTests::test_iobase_source_with_query_and_filters 
[gw2] PASSED apache_beam/examples/complete/game/game_stats_it_test.py::GameStatsIT::test_game_stats_it 
apache_beam/ml/gcp/visionml_test_it.py::VisionMlTestIT::test_text_detection_with_language_hint 
[gw7] PASSED apache_beam/io/parquetio_it_test.py::TestParquetIT::test_parquetio_it 
[gw1] PASSED apache_beam/examples/complete/game/hourly_team_score_it_test.py::HourlyTeamScoreIT::test_hourly_team_score_it 
apache_beam/io/gcp/datastore/v1new/datastore_write_it_test.py::DatastoreWriteIT::test_datastore_write_limit 
[gw5] PASSED apache_beam/io/gcp/bigquery_read_it_test.py::ReadUsingStorageApiTests::test_iobase_source_with_query_and_filters 
apache_beam/io/gcp/bigquery_read_it_test.py::ReadUsingStorageApiTests::test_iobase_source_with_row_restriction 
[gw2] PASSED apache_beam/ml/gcp/visionml_test_it.py::VisionMlTestIT::test_text_detection_with_language_hint 
[gw3] PASSED apache_beam/examples/complete/juliaset/juliaset/juliaset_test_it.py::JuliaSetTestIT::test_run_example_with_setup_file 
[gw6] PASSED apache_beam/examples/fastavro_it_test.py::FastavroIT::test_avro_it 
apache_beam/examples/cookbook/datastore_wordcount_it_test.py::DatastoreWordCountIT::test_datastore_wordcount_it 
[gw5] PASSED apache_beam/io/gcp/bigquery_read_it_test.py::ReadUsingStorageApiTests::test_iobase_source_with_row_restriction 
apache_beam/io/gcp/bigquery_read_it_test.py::ReadUsingStorageApiTests::test_iobase_source_with_very_selective_filters 
[gw6] PASSED apache_beam/examples/cookbook/datastore_wordcount_it_test.py::DatastoreWordCountIT::test_datastore_wordcount_it 
[gw5] PASSED apache_beam/io/gcp/bigquery_read_it_test.py::ReadUsingStorageApiTests::test_iobase_source_with_very_selective_filters 
apache_beam/io/gcp/bigquery_read_it_test.py::ReadNewTypesTests::test_iobase_source 
[gw5] PASSED apache_beam/io/gcp/bigquery_read_it_test.py::ReadNewTypesTests::test_iobase_source 
apache_beam/io/gcp/bigquery_read_it_test.py::ReadNewTypesTests::test_native_source 
[gw5] PASSED apache_beam/io/gcp/bigquery_read_it_test.py::ReadNewTypesTests::test_native_source 
apache_beam/io/gcp/bigquery_read_it_test.py::ReadAllBQTests::test_read_queries 
[gw1] PASSED apache_beam/io/gcp/datastore/v1new/datastore_write_it_test.py::DatastoreWriteIT::test_datastore_write_limit 
[gw5] PASSED apache_beam/io/gcp/bigquery_read_it_test.py::ReadAllBQTests::test_read_queries 
apache_beam/io/gcp/bigquery_read_it_test.py::ReadInteractiveRunnerTests::test_read_in_interactive_runner 
[gw5] PASSED apache_beam/io/gcp/bigquery_read_it_test.py::ReadInteractiveRunnerTests::test_read_in_interactive_runner 

=============================== warnings summary ===============================
apache_beam/io/gcp/bigquery.py:2603
  <https://ci-beam.apache.org/job/beam_PostCommit_Python39/ws/src/sdks/python/apache_beam/io/gcp/bigquery.py>:2603: DeprecationWarning: invalid escape sequence \#
    """Read data from BigQuery.

apache_beam/io/gcp/bigquery_read_it_test.py::ReadTests::test_native_source
  <https://ci-beam.apache.org/job/beam_PostCommit_Python39/ws/src/sdks/python/apache_beam/io/gcp/bigquery_read_it_test.py>:170: BeamDeprecationWarning: BigQuerySource is deprecated since 2.25.0. Use ReadFromBigQuery instead.
    beam.io.BigQuerySource(query=self.query, use_standard_sql=True)))

apache_beam/io/gcp/bigquery_test.py::PubSubBigQueryIT::test_file_loads
apache_beam/io/gcp/bigquery_test.py::PubSubBigQueryIT::test_streaming_inserts
apache_beam/examples/complete/game/leader_board_it_test.py::LeaderBoardIT::test_leader_board_it
apache_beam/examples/complete/game/game_stats_it_test.py::GameStatsIT::test_game_stats_it
apache_beam/examples/complete/game/hourly_team_score_it_test.py::HourlyTeamScoreIT::test_hourly_team_score_it
  <https://ci-beam.apache.org/job/beam_PostCommit_Python39/ws/src/sdks/python/apache_beam/io/gcp/tests/utils.py>:63: PendingDeprecationWarning: Client.dataset is deprecated and will be removed in a future version. Use a string like 'my_project.my_dataset' or a cloud.google.bigquery.DatasetReference object, instead.
    dataset_ref = client.dataset(unique_dataset_name, project=project)

apache_beam/examples/cookbook/bigquery_tornadoes_it_test.py::BigqueryTornadoesIT::test_bigquery_tornadoes_it
  <https://ci-beam.apache.org/job/beam_PostCommit_Python39/ws/src/sdks/python/apache_beam/io/gcp/tests/utils.py>:100: PendingDeprecationWarning: Client.dataset is deprecated and will be removed in a future version. Use a string like 'my_project.my_dataset' or a cloud.google.bigquery.DatasetReference object, instead.
    table_ref = client.dataset(dataset_id).table(table_id)

apache_beam/examples/dataframe/flight_delays_it_test.py::FlightDelaysTest::test_flight_delays
  <https://ci-beam.apache.org/job/beam_PostCommit_Python39/ws/src/sdks/python/apache_beam/examples/dataframe/flight_delays.py>:47: FutureWarning: The default value of numeric_only in DataFrame.mean is deprecated. In a future version, it will default to False. In addition, specifying 'numeric_only=None' is deprecated. Select only valid columns or specify the value of numeric_only to silence this warning.
    return airline_df[at_top_airports].mean()

apache_beam/io/gcp/bigquery_read_it_test.py::ReadNewTypesTests::test_native_source
  <https://ci-beam.apache.org/job/beam_PostCommit_Python39/ws/src/sdks/python/apache_beam/io/gcp/bigquery_read_it_test.py>:706: BeamDeprecationWarning: BigQuerySource is deprecated since 2.25.0. Use ReadFromBigQuery instead.
    beam.io.BigQuerySource(query=self.query, use_standard_sql=True)))

-- Docs: https://docs.pytest.org/en/stable/how-to/capture-warnings.html
- generated xml file: <https://ci-beam.apache.org/job/beam_PostCommit_Python39/ws/src/sdks/python/pytest_postCommitIT-df-py39.xml> -
=========== 83 passed, 49 skipped, 10 warnings in 5926.54s (1:38:46) ===========

FAILURE: Build failed with an exception.

* Where:
Script '<https://ci-beam.apache.org/job/beam_PostCommit_Python39/ws/src/sdks/python/test-suites/portable/common.gradle'> line: 326

* What went wrong:
Execution failed for task ':sdks:python:test-suites:portable:py39:postCommitPy39IT'.
> Process 'command 'sh'' finished with non-zero exit value 1

* Try:
> Run with --stacktrace option to get the stack trace.
> Run with --info or --debug option to get more log output.
> Get more help at https://help.gradle.org.

Deprecated Gradle features were used in this build, making it incompatible with Gradle 9.0.

You can use '--warning-mode all' to show the individual deprecation warnings and determine if they come from your own scripts or plugins.

For more on this, please refer to https://docs.gradle.org/8.4/userguide/command_line_interface.html#sec:command_line_warnings in the Gradle documentation.

BUILD FAILED in 1h 45m 15s
222 actionable tasks: 157 executed, 61 from cache, 4 up-to-date

Publishing build scan...
https://ge.apache.org/s/khxzxga3dz46e

Build step 'Invoke Gradle script' changed build result to FAILURE
Build step 'Invoke Gradle script' marked build as failure

---------------------------------------------------------------------
To unsubscribe, e-mail: builds-unsubscribe@beam.apache.org
For additional commands, e-mail: builds-help@beam.apache.org


Build failed in Jenkins: beam_PostCommit_Python39 #2646

Posted by Apache Jenkins Server <je...@builds.apache.org>.
See <https://ci-beam.apache.org/job/beam_PostCommit_Python39/2646/display/redirect?page=changes>

Changes:

[noreply] fix: optimize segment reader (#29694)


------------------------------------------
[...truncated 13.13 MB...]
ERROR:apache_beam.runners.worker.data_plane:Failed to read inputs in the data plane.
Traceback (most recent call last):
  File "<https://ci-beam.apache.org/job/beam_PostCommit_Python39/ws/src/sdks/python/apache_beam/runners/worker/data_plane.py",> line 669, in _read_inputs
    for elements in elements_iterator:
  File "<https://ci-beam.apache.org/job/beam_PostCommit_Python39/ws/src/build/gradleenv/2022703443/lib/python3.9/site-packages/grpc/_channel.py",> line 540, in __next__
    return self._next()
  File "<https://ci-beam.apache.org/job/beam_PostCommit_Python39/ws/src/build/gradleenv/2022703443/lib/python3.9/site-packages/grpc/_channel.py",> line 966, in _next
    raise self
grpc._channel._MultiThreadedRendezvous: <_MultiThreadedRendezvous of RPC that terminated with:
	status = StatusCode.UNAVAILABLE
	details = "recvmsg:Connection reset by peer"
	debug_error_string = "UNKNOWN:Error received from peer ipv6:%5B::1%5D:41331 {created_time:"2023-12-13T06:41:32.243812715+00:00", grpc_status:14, grpc_message:"recvmsg:Connection reset by peer"}"
>
    raise self
grpc._channel._MultiThreadedRendezvous: <_MultiThreadedRendezvous of RPC that terminated with:
	status = StatusCode.UNAVAILABLE
	details = "recvmsg:Connection reset by peer"
	debug_error_string = "UNKNOWN:Error received from peer ipv6:%5B::1%5D:35967 {created_time:"2023-12-13T06:41:32.24383832+00:00", grpc_status:14, grpc_message:"recvmsg:Connection reset by peer"}"
>
grpc._channel._MultiThreadedRendezvous: <_MultiThreadedRendezvous of RPC that terminated with:
	status = StatusCode.UNAVAILABLE
	details = "Socket closed"
	debug_error_string = "UNKNOWN:Error received from peer ipv6:%5B::1%5D:36823 {created_time:"2023-12-13T06:41:32.243839283+00:00", grpc_status:14, grpc_message:"Socket closed"}"
>
Exception in thread read_grpc_client_inputs:
Traceback (most recent call last):
  File "/usr/lib/python3.9/threading.py", line 973, in _bootstrap_inner
    self.run()
  File "/usr/lib/python3.9/threading.py", line 910, in run
    self._target(*self._args, **self._kwargs)
  File "<https://ci-beam.apache.org/job/beam_PostCommit_Python39/ws/src/sdks/python/apache_beam/runners/worker/data_plane.py",> line 686, in <lambda>
    target=lambda: self._read_inputs(elements_iterator),
  File "<https://ci-beam.apache.org/job/beam_PostCommit_Python39/ws/src/sdks/python/apache_beam/runners/worker/data_plane.py",> line 669, in _read_inputs
    for elements in elements_iterator:
  File "<https://ci-beam.apache.org/job/beam_PostCommit_Python39/ws/src/build/gradleenv/2022703443/lib/python3.9/site-packages/grpc/_channel.py",> line 540, in __next__
    return self._next()
  File "<https://ci-beam.apache.org/job/beam_PostCommit_Python39/ws/src/build/gradleenv/2022703443/lib/python3.9/site-packages/grpc/_channel.py",> line 966, in _next
    raise self
grpc._channel._MultiThreadedRendezvous: <_MultiThreadedRendezvous of RPC that terminated with:
	status = StatusCode.UNAVAILABLE
	details = "recvmsg:Connection reset by peer"
	debug_error_string = "UNKNOWN:Error received from peer ipv6:%5B::1%5D:41331 {created_time:"2023-12-13T06:41:32.243812715+00:00", grpc_status:14, grpc_message:"recvmsg:Connection reset by peer"}"
>

> Task :sdks:python:test-suites:dataflow:py39:postCommitIT

[gw0] PASSED apache_beam/io/gcp/bigquery_write_it_test.py::BigQueryWriteIntegrationTests::test_big_query_write_new_types 
apache_beam/io/gcp/bigquery_write_it_test.py::BigQueryWriteIntegrationTests::test_big_query_write_schema_autodetect 
[gw0] SKIPPED apache_beam/io/gcp/bigquery_write_it_test.py::BigQueryWriteIntegrationTests::test_big_query_write_schema_autodetect 
apache_beam/io/gcp/bigquery_write_it_test.py::BigQueryWriteIntegrationTests::test_big_query_write_without_schema 
[gw3] PASSED apache_beam/io/gcp/bigquery_read_it_test.py::ReadTests::test_table_schema_retrieve_specifying_only_table 
apache_beam/io/gcp/bigquery_read_it_test.py::ReadTests::test_table_schema_retrieve_with_direct_read 
[gw6] PASSED apache_beam/ml/inference/sklearn_inference_it_test.py::SklearnInference::test_sklearn_mnist_classification_large_model 
apache_beam/ml/inference/sklearn_inference_it_test.py::SklearnInference::test_sklearn_regression 
[gw7] PASSED apache_beam/io/gcp/big_query_query_to_table_it_test.py::BigQueryQueryToTableIT::test_big_query_standard_sql 
apache_beam/examples/dataframe/taxiride_it_test.py::TaxirideIT::test_aggregation 
[gw1] PASSED apache_beam/dataframe/io_it_test.py::ReadUsingReadGbqTests::test_ReadGbq_with_computation 
apache_beam/io/gcp/bigquery_io_read_it_test.py::BigqueryIOReadIT::test_bigquery_read_1M_python 
[gw4] PASSED apache_beam/io/gcp/pubsub_integration_test.py::PubSubIntegrationTest::test_streaming_data_only 
apache_beam/io/gcp/pubsub_integration_test.py::PubSubIntegrationTest::test_streaming_with_attributes 
[gw5] PASSED apache_beam/io/gcp/bigquery_json_it_test.py::BigQueryJsonIT::test_streaming_inserts 
apache_beam/examples/wordcount_it_test.py::WordCountIT::test_wordcount_impersonation_it 
[gw0] PASSED apache_beam/io/gcp/bigquery_write_it_test.py::BigQueryWriteIntegrationTests::test_big_query_write_without_schema 
apache_beam/examples/fastavro_it_test.py::FastavroIT::test_avro_it 
[gw3] PASSED apache_beam/io/gcp/bigquery_read_it_test.py::ReadTests::test_table_schema_retrieve_with_direct_read 
apache_beam/io/gcp/bigquery_read_it_test.py::ReadUsingStorageApiTests::test_iobase_source 
[gw6] PASSED apache_beam/ml/inference/sklearn_inference_it_test.py::SklearnInference::test_sklearn_regression 
apache_beam/ml/gcp/cloud_dlp_it_test.py::CloudDLPIT::test_deidentification 
[gw2] PASSED apache_beam/io/gcp/bigquery_test.py::PubSubBigQueryIT::test_file_loads 
apache_beam/io/gcp/bigquery_test.py::PubSubBigQueryIT::test_streaming_inserts 
[gw7] PASSED apache_beam/examples/dataframe/taxiride_it_test.py::TaxirideIT::test_aggregation 
apache_beam/examples/dataframe/taxiride_it_test.py::TaxirideIT::test_enrich 
[gw1] PASSED apache_beam/io/gcp/bigquery_io_read_it_test.py::BigqueryIOReadIT::test_bigquery_read_1M_python 
apache_beam/io/gcp/bigquery_io_read_it_test.py::BigqueryIOReadIT::test_bigquery_read_custom_1M_python 
[gw6] PASSED apache_beam/ml/gcp/cloud_dlp_it_test.py::CloudDLPIT::test_deidentification 
apache_beam/ml/gcp/cloud_dlp_it_test.py::CloudDLPIT::test_inspection 
[gw3] PASSED apache_beam/io/gcp/bigquery_read_it_test.py::ReadUsingStorageApiTests::test_iobase_source 
apache_beam/io/gcp/bigquery_read_it_test.py::ReadUsingStorageApiTests::test_iobase_source_with_column_selection 
[gw5] PASSED apache_beam/examples/wordcount_it_test.py::WordCountIT::test_wordcount_impersonation_it 
apache_beam/examples/wordcount_it_test.py::WordCountIT::test_wordcount_it 
[gw1] PASSED apache_beam/io/gcp/bigquery_io_read_it_test.py::BigqueryIOReadIT::test_bigquery_read_custom_1M_python 
apache_beam/examples/complete/autocomplete_test.py::AutocompleteTest::test_autocomplete_it 
[gw6] PASSED apache_beam/ml/gcp/cloud_dlp_it_test.py::CloudDLPIT::test_inspection 
apache_beam/examples/complete/game/leader_board_it_test.py::LeaderBoardIT::test_leader_board_it 
[gw3] PASSED apache_beam/io/gcp/bigquery_read_it_test.py::ReadUsingStorageApiTests::test_iobase_source_with_column_selection 
apache_beam/io/gcp/bigquery_read_it_test.py::ReadUsingStorageApiTests::test_iobase_source_with_column_selection_and_row_restriction 
[gw5] PASSED apache_beam/examples/wordcount_it_test.py::WordCountIT::test_wordcount_it 
apache_beam/examples/complete/game/game_stats_it_test.py::GameStatsIT::test_game_stats_it 
[gw4] PASSED apache_beam/io/gcp/pubsub_integration_test.py::PubSubIntegrationTest::test_streaming_with_attributes 
apache_beam/io/gcp/healthcare/dicomio_integration_test.py::DICOMIoIntegrationTest::test_dicom_search_instances 
[gw0] PASSED apache_beam/examples/fastavro_it_test.py::FastavroIT::test_avro_it 
apache_beam/examples/streaming_wordcount_debugging_it_test.py::StreamingWordcountDebuggingIT::test_streaming_wordcount_debugging_it 
[gw0] SKIPPED apache_beam/examples/streaming_wordcount_debugging_it_test.py::StreamingWordcountDebuggingIT::test_streaming_wordcount_debugging_it 
apache_beam/examples/complete/game/hourly_team_score_it_test.py::HourlyTeamScoreIT::test_hourly_team_score_it 
[gw1] PASSED apache_beam/examples/complete/autocomplete_test.py::AutocompleteTest::test_autocomplete_it 
apache_beam/examples/cookbook/bigquery_tornadoes_it_test.py::BigqueryTornadoesIT::test_bigquery_tornadoes_it 
[gw3] PASSED apache_beam/io/gcp/bigquery_read_it_test.py::ReadUsingStorageApiTests::test_iobase_source_with_column_selection_and_row_restriction 
apache_beam/io/gcp/bigquery_read_it_test.py::ReadUsingStorageApiTests::test_iobase_source_with_column_selection_and_row_restriction_rows 
[gw4] PASSED apache_beam/io/gcp/healthcare/dicomio_integration_test.py::DICOMIoIntegrationTest::test_dicom_search_instances 
apache_beam/io/gcp/healthcare/dicomio_integration_test.py::DICOMIoIntegrationTest::test_dicom_store_instance_from_gcs 
[gw2] PASSED apache_beam/io/gcp/bigquery_test.py::PubSubBigQueryIT::test_streaming_inserts 
apache_beam/io/gcp/bigquery_test.py::BigQueryFileLoadsIntegrationTests::test_avro_file_load 
[gw1] PASSED apache_beam/examples/cookbook/bigquery_tornadoes_it_test.py::BigqueryTornadoesIT::test_bigquery_tornadoes_it 
apache_beam/examples/inference/tfx_bsl/tfx_bsl_inference_it_test.py::TFXRunInferenceTests::test_tfx_run_inference_mobilenetv2 
[gw1] SKIPPED apache_beam/examples/inference/tfx_bsl/tfx_bsl_inference_it_test.py::TFXRunInferenceTests::test_tfx_run_inference_mobilenetv2 
apache_beam/ml/gcp/visionml_test_it.py::VisionMlTestIT::test_text_detection_with_language_hint 
[gw3] PASSED apache_beam/io/gcp/bigquery_read_it_test.py::ReadUsingStorageApiTests::test_iobase_source_with_column_selection_and_row_restriction_rows 
apache_beam/io/gcp/bigquery_read_it_test.py::ReadUsingStorageApiTests::test_iobase_source_with_native_datetime 
[gw4] PASSED apache_beam/io/gcp/healthcare/dicomio_integration_test.py::DICOMIoIntegrationTest::test_dicom_store_instance_from_gcs 
apache_beam/io/gcp/datastore/v1new/datastore_write_it_test.py::DatastoreWriteIT::test_datastore_write_limit 
[gw6] PASSED apache_beam/examples/complete/game/leader_board_it_test.py::LeaderBoardIT::test_leader_board_it 
apache_beam/examples/cookbook/datastore_wordcount_it_test.py::DatastoreWordCountIT::test_datastore_wordcount_it 
[gw7] PASSED apache_beam/examples/dataframe/taxiride_it_test.py::TaxirideIT::test_enrich 
apache_beam/examples/streaming_wordcount_it_test.py::StreamingWordCountIT::test_streaming_wordcount_it 
[gw2] PASSED apache_beam/io/gcp/bigquery_test.py::BigQueryFileLoadsIntegrationTests::test_avro_file_load 
apache_beam/examples/complete/game/user_score_it_test.py::UserScoreIT::test_user_score_it 
[gw3] PASSED apache_beam/io/gcp/bigquery_read_it_test.py::ReadUsingStorageApiTests::test_iobase_source_with_native_datetime 
apache_beam/io/gcp/bigquery_read_it_test.py::ReadUsingStorageApiTests::test_iobase_source_with_query 
[gw1] PASSED apache_beam/ml/gcp/visionml_test_it.py::VisionMlTestIT::test_text_detection_with_language_hint 
apache_beam/runners/dataflow/dataflow_exercise_metrics_pipeline_test.py::ExerciseMetricsPipelineTest::test_metrics_it 
[gw1] SKIPPED apache_beam/runners/dataflow/dataflow_exercise_metrics_pipeline_test.py::ExerciseMetricsPipelineTest::test_metrics_it 
apache_beam/transforms/external_it_test.py::ExternalTransformIT::test_job_python_from_python_it 
[gw0] PASSED apache_beam/examples/complete/game/hourly_team_score_it_test.py::HourlyTeamScoreIT::test_hourly_team_score_it 
apache_beam/ml/gcp/naturallanguageml_test_it.py::NaturalLanguageMlTestIT::test_analyzing_syntax 
[gw0] SKIPPED apache_beam/ml/gcp/naturallanguageml_test_it.py::NaturalLanguageMlTestIT::test_analyzing_syntax 
apache_beam/ml/gcp/videointelligenceml_test_it.py::VideoIntelligenceMlTestIT::test_label_detection_with_video_context 
[gw0] SKIPPED apache_beam/ml/gcp/videointelligenceml_test_it.py::VideoIntelligenceMlTestIT::test_label_detection_with_video_context 
[gw5] PASSED apache_beam/examples/complete/game/game_stats_it_test.py::GameStatsIT::test_game_stats_it 
apache_beam/examples/dataframe/flight_delays_it_test.py::FlightDelaysTest::test_flight_delays 
[gw6] PASSED apache_beam/examples/cookbook/datastore_wordcount_it_test.py::DatastoreWordCountIT::test_datastore_wordcount_it 
apache_beam/io/fileio_test.py::MatchIntegrationTest::test_transform_on_gcs 
[gw3] PASSED apache_beam/io/gcp/bigquery_read_it_test.py::ReadUsingStorageApiTests::test_iobase_source_with_query 
apache_beam/io/gcp/bigquery_read_it_test.py::ReadUsingStorageApiTests::test_iobase_source_with_query_and_filters 
[gw1] PASSED apache_beam/transforms/external_it_test.py::ExternalTransformIT::test_job_python_from_python_it 
[gw5] PASSED apache_beam/examples/dataframe/flight_delays_it_test.py::FlightDelaysTest::test_flight_delays 
apache_beam/io/parquetio_it_test.py::TestParquetIT::test_parquetio_it 
[gw6] PASSED apache_beam/io/fileio_test.py::MatchIntegrationTest::test_transform_on_gcs 
[gw3] PASSED apache_beam/io/gcp/bigquery_read_it_test.py::ReadUsingStorageApiTests::test_iobase_source_with_query_and_filters 
apache_beam/io/gcp/bigquery_read_it_test.py::ReadUsingStorageApiTests::test_iobase_source_with_row_restriction 
[gw7] PASSED apache_beam/examples/streaming_wordcount_it_test.py::StreamingWordCountIT::test_streaming_wordcount_it 
apache_beam/examples/complete/juliaset/juliaset/juliaset_test_it.py::JuliaSetTestIT::test_run_example_with_setup_file <https://ci-beam.apache.org/job/beam_PostCommit_Python39/ws/src/build/gradleenv/-1734967050/bin/python3.9>: No module named build
warning: sdist: standard file not found: should have one of README, README.rst, README.txt, README.md

warning: check: missing required meta-data: url

warning: check: missing meta-data: either (author and author_email) or (maintainer and maintainer_email) should be supplied


[gw5] PASSED apache_beam/io/parquetio_it_test.py::TestParquetIT::test_parquetio_it 
[gw2] PASSED apache_beam/examples/complete/game/user_score_it_test.py::UserScoreIT::test_user_score_it 
apache_beam/ml/inference/onnx_inference_it_test.py::OnnxInference::test_onnx_run_inference_roberta_sentiment_classification 
[gw2] SKIPPED apache_beam/ml/inference/onnx_inference_it_test.py::OnnxInference::test_onnx_run_inference_roberta_sentiment_classification 
[gw3] PASSED apache_beam/io/gcp/bigquery_read_it_test.py::ReadUsingStorageApiTests::test_iobase_source_with_row_restriction 
apache_beam/io/gcp/bigquery_read_it_test.py::ReadUsingStorageApiTests::test_iobase_source_with_very_selective_filters 
[gw7] PASSED apache_beam/examples/complete/juliaset/juliaset/juliaset_test_it.py::JuliaSetTestIT::test_run_example_with_setup_file 
[gw3] PASSED apache_beam/io/gcp/bigquery_read_it_test.py::ReadUsingStorageApiTests::test_iobase_source_with_very_selective_filters 
apache_beam/io/gcp/bigquery_read_it_test.py::ReadNewTypesTests::test_iobase_source 
[gw4] PASSED apache_beam/io/gcp/datastore/v1new/datastore_write_it_test.py::DatastoreWriteIT::test_datastore_write_limit 
apache_beam/ml/inference/base_test.py::RunInferenceBaseTest::test_run_inference_with_side_inputin_streaming 
[gw4] SKIPPED apache_beam/ml/inference/base_test.py::RunInferenceBaseTest::test_run_inference_with_side_inputin_streaming 
apache_beam/transforms/periodicsequence_it_test.py::PeriodicSequenceIT::test_periodicsequence_outputs_valid_watermarks_it 
[gw4] SKIPPED apache_beam/transforms/periodicsequence_it_test.py::PeriodicSequenceIT::test_periodicsequence_outputs_valid_watermarks_it 
[gw3] PASSED apache_beam/io/gcp/bigquery_read_it_test.py::ReadNewTypesTests::test_iobase_source 
apache_beam/io/gcp/bigquery_read_it_test.py::ReadNewTypesTests::test_native_source 
[gw3] PASSED apache_beam/io/gcp/bigquery_read_it_test.py::ReadNewTypesTests::test_native_source 
apache_beam/io/gcp/bigquery_read_it_test.py::ReadAllBQTests::test_read_queries 
[gw3] PASSED apache_beam/io/gcp/bigquery_read_it_test.py::ReadAllBQTests::test_read_queries 
apache_beam/io/gcp/bigquery_read_it_test.py::ReadInteractiveRunnerTests::test_read_in_interactive_runner 
[gw3] PASSED apache_beam/io/gcp/bigquery_read_it_test.py::ReadInteractiveRunnerTests::test_read_in_interactive_runner 

=============================== warnings summary ===============================
apache_beam/io/gcp/bigquery.py:2603
  <https://ci-beam.apache.org/job/beam_PostCommit_Python39/ws/src/sdks/python/apache_beam/io/gcp/bigquery.py>:2603: DeprecationWarning: invalid escape sequence \#
    """Read data from BigQuery.

apache_beam/io/gcp/bigquery_read_it_test.py::ReadTests::test_native_source
  <https://ci-beam.apache.org/job/beam_PostCommit_Python39/ws/src/sdks/python/apache_beam/io/gcp/bigquery_read_it_test.py>:170: BeamDeprecationWarning: BigQuerySource is deprecated since 2.25.0. Use ReadFromBigQuery instead.
    beam.io.BigQuerySource(query=self.query, use_standard_sql=True)))

apache_beam/io/gcp/bigquery_test.py::PubSubBigQueryIT::test_file_loads
apache_beam/io/gcp/bigquery_test.py::PubSubBigQueryIT::test_streaming_inserts
apache_beam/examples/complete/game/leader_board_it_test.py::LeaderBoardIT::test_leader_board_it
apache_beam/examples/complete/game/hourly_team_score_it_test.py::HourlyTeamScoreIT::test_hourly_team_score_it
apache_beam/examples/complete/game/game_stats_it_test.py::GameStatsIT::test_game_stats_it
  <https://ci-beam.apache.org/job/beam_PostCommit_Python39/ws/src/sdks/python/apache_beam/io/gcp/tests/utils.py>:63: PendingDeprecationWarning: Client.dataset is deprecated and will be removed in a future version. Use a string like 'my_project.my_dataset' or a cloud.google.bigquery.DatasetReference object, instead.
    dataset_ref = client.dataset(unique_dataset_name, project=project)

apache_beam/examples/cookbook/bigquery_tornadoes_it_test.py::BigqueryTornadoesIT::test_bigquery_tornadoes_it
  <https://ci-beam.apache.org/job/beam_PostCommit_Python39/ws/src/sdks/python/apache_beam/io/gcp/tests/utils.py>:100: PendingDeprecationWarning: Client.dataset is deprecated and will be removed in a future version. Use a string like 'my_project.my_dataset' or a cloud.google.bigquery.DatasetReference object, instead.
    table_ref = client.dataset(dataset_id).table(table_id)

apache_beam/examples/dataframe/flight_delays_it_test.py::FlightDelaysTest::test_flight_delays
  <https://ci-beam.apache.org/job/beam_PostCommit_Python39/ws/src/sdks/python/apache_beam/examples/dataframe/flight_delays.py>:47: FutureWarning: The default value of numeric_only in DataFrame.mean is deprecated. In a future version, it will default to False. In addition, specifying 'numeric_only=None' is deprecated. Select only valid columns or specify the value of numeric_only to silence this warning.
    return airline_df[at_top_airports].mean()

apache_beam/io/gcp/bigquery_read_it_test.py::ReadNewTypesTests::test_native_source
  <https://ci-beam.apache.org/job/beam_PostCommit_Python39/ws/src/sdks/python/apache_beam/io/gcp/bigquery_read_it_test.py>:706: BeamDeprecationWarning: BigQuerySource is deprecated since 2.25.0. Use ReadFromBigQuery instead.
    beam.io.BigQuerySource(query=self.query, use_standard_sql=True)))

-- Docs: https://docs.pytest.org/en/stable/how-to/capture-warnings.html
- generated xml file: <https://ci-beam.apache.org/job/beam_PostCommit_Python39/ws/src/sdks/python/pytest_postCommitIT-df-py39.xml> -
=========== 83 passed, 49 skipped, 10 warnings in 5876.68s (1:37:56) ===========

FAILURE: Build completed with 2 failures.

1: Task failed with an exception.
-----------
* Where:
Script '<https://ci-beam.apache.org/job/beam_PostCommit_Python39/ws/src/sdks/python/test-suites/portable/common.gradle'> line: 326

* What went wrong:
Execution failed for task ':sdks:python:test-suites:portable:py39:postCommitPy39IT'.
> Process 'command 'sh'' finished with non-zero exit value 1

* Try:
> Run with --stacktrace option to get the stack trace.
> Run with --info or --debug option to get more log output.
> Get more help at https://help.gradle.org.
==============================================================================

2: Task failed with an exception.
-----------
* Where:
Script '<https://ci-beam.apache.org/job/beam_PostCommit_Python39/ws/src/sdks/python/test-suites/direct/common.gradle'> line: 52

* What went wrong:
Execution failed for task ':sdks:python:test-suites:direct:py39:postCommitIT'.
> Process 'command 'sh'' finished with non-zero exit value 1

* Try:
> Run with --stacktrace option to get the stack trace.
> Run with --info or --debug option to get more log output.
> Get more help at https://help.gradle.org.
==============================================================================

Deprecated Gradle features were used in this build, making it incompatible with Gradle 9.0.

You can use '--warning-mode all' to show the individual deprecation warnings and determine if they come from your own scripts or plugins.

For more on this, please refer to https://docs.gradle.org/8.4/userguide/command_line_interface.html#sec:command_line_warnings in the Gradle documentation.

BUILD FAILED in 1h 44m 19s
222 actionable tasks: 157 executed, 61 from cache, 4 up-to-date

Publishing build scan...
https://ge.apache.org/s/hm35h22zjantq

Build step 'Invoke Gradle script' changed build result to FAILURE
Build step 'Invoke Gradle script' marked build as failure

---------------------------------------------------------------------
To unsubscribe, e-mail: builds-unsubscribe@beam.apache.org
For additional commands, e-mail: builds-help@beam.apache.org