You are viewing a plain text version of this content. The canonical link for it is here.
Posted to notifications@ant.apache.org by Apache Jenkins Server <je...@builds.apache.org> on 2018/04/05 06:16:13 UTC
Build failed in Jenkins: Ant-Build-Matrix-master-Linux » xenial,JDK 1.8 (latest) #1176
See <https://builds.apache.org/job/Ant-Build-Matrix-master-Linux/OS=xenial,jdk=JDK%201.8%20(latest)/1176/display/redirect?page=changes>
Changes:
[gintas] Tidy up the code
------------------------------------------
Started by upstream project "Ant-Build-Matrix-master-Linux" build number 1176
originally caused by:
Started by an SCM change
[EnvInject] - Loading node environment variables.
Building remotely on H15 (Hadoop xenial) in workspace <https://builds.apache.org/job/Ant-Build-Matrix-master-Linux/OS=xenial,jdk=JDK%201.8%20(latest)/ws/>
> git rev-parse --is-inside-work-tree # timeout=10
Fetching changes from the remote Git repository
> git config remote.origin.url https://git-wip-us.apache.org/repos/asf/ant.git # timeout=10
Cleaning workspace
> git rev-parse --verify HEAD # timeout=10
Resetting working tree
> git reset --hard # timeout=10
> git clean -fdx # timeout=10
Fetching upstream changes from https://git-wip-us.apache.org/repos/asf/ant.git
> git --version # timeout=10
> git fetch --tags --progress https://git-wip-us.apache.org/repos/asf/ant.git +refs/heads/*:refs/remotes/origin/*
Checking out Revision 66d7986c3ad41040528a118052c4ef5b2e65ef89 (refs/remotes/origin/master)
> git config core.sparsecheckout # timeout=10
> git checkout -f 66d7986c3ad41040528a118052c4ef5b2e65ef89
Commit message: "Tidy up the code"
> git rev-list --no-walk 845c2c5b393951d3e1828d992feff50a65d02772 # timeout=10
[EnvInject] - Executing scripts and injecting environment variables after the SCM step.
[EnvInject] - Injecting as environment variables the properties content
LANG=en_US.utf8
[EnvInject] - Variables injected successfully.
[JDK 1.8 (latest)] $ /home/jenkins/tools/ant/latest/bin/ant -file launch-build.xml "-Djdk=JDK 1.8 (latest)" -DOS=xenial -Djenkins=t
Buildfile: <https://builds.apache.org/job/Ant-Build-Matrix-master-Linux/OS=xenial,jdk=JDK%201.8%20(latest)/ws/launch-build.xml>
launch:
[echo] Launching <https://builds.apache.org/job/Ant-Build-Matrix-master-Linux/OS=xenial,jdk=JDK%201.8%20(latest)/ws/build.sh> allclean test -Dignore.tests.failed=true -Doptional.jars.whenmanifestonly=skip -Djenkins=t
[exec] ... Bootstrapping Ant Distribution
[exec] ... Compiling Ant Classes
[exec] Note: Some input files use or override a deprecated API.
[exec] Note: Recompile with -Xlint:deprecation for details.
[exec] ... Copying Required Files
[exec] ... Building Ant Distribution
[exec] Buildfile: <https://builds.apache.org/job/Ant-Build-Matrix-master-Linux/OS=xenial,jdk=JDK%201.8%20(latest)/ws/build.xml>
[exec]
[exec] bootstrap:
[exec]
[exec] check-optional-packages:
[exec]
[exec] prepare:
[exec]
[exec] build:
[exec] Created dir: <https://builds.apache.org/job/Ant-Build-Matrix-master-Linux/OS=xenial,jdk=JDK%201.8%20(latest)/ws/build/lib>
[exec] Compiling 270 source files to <https://builds.apache.org/job/Ant-Build-Matrix-master-Linux/OS=xenial,jdk=JDK%201.8%20(latest)/ws/build/classes>
[exec] Note: Some input files use or override a deprecated API.
[exec] Note: Recompile with -Xlint:deprecation for details.
[exec] Copying 6 files to <https://builds.apache.org/job/Ant-Build-Matrix-master-Linux/OS=xenial,jdk=JDK%201.8%20(latest)/ws/build/classes>
[exec] Copying 2 files to <https://builds.apache.org/job/Ant-Build-Matrix-master-Linux/OS=xenial,jdk=JDK%201.8%20(latest)/ws/build/classes>
[exec] Copying 4 files to <https://builds.apache.org/job/Ant-Build-Matrix-master-Linux/OS=xenial,jdk=JDK%201.8%20(latest)/ws/build/classes/org/apache/tools/ant/taskdefs/optional/junit/xsl>
[exec]
[exec] jars:
[exec] Copying 2 files to <https://builds.apache.org/job/Ant-Build-Matrix-master-Linux/OS=xenial,jdk=JDK%201.8%20(latest)/ws/build>
[exec] Building jar: <https://builds.apache.org/job/Ant-Build-Matrix-master-Linux/OS=xenial,jdk=JDK%201.8%20(latest)/ws/build/lib/ant-launcher.jar>
[exec] Building jar: <https://builds.apache.org/job/Ant-Build-Matrix-master-Linux/OS=xenial,jdk=JDK%201.8%20(latest)/ws/build/lib/ant.jar>
[exec] Building jar: <https://builds.apache.org/job/Ant-Build-Matrix-master-Linux/OS=xenial,jdk=JDK%201.8%20(latest)/ws/build/lib/ant-bootstrap.jar>
[exec] Building jar: <https://builds.apache.org/job/Ant-Build-Matrix-master-Linux/OS=xenial,jdk=JDK%201.8%20(latest)/ws/build/lib/ant-apache-resolver.jar>
[exec] Building jar: <https://builds.apache.org/job/Ant-Build-Matrix-master-Linux/OS=xenial,jdk=JDK%201.8%20(latest)/ws/build/lib/ant-junit.jar>
[exec] Building jar: <https://builds.apache.org/job/Ant-Build-Matrix-master-Linux/OS=xenial,jdk=JDK%201.8%20(latest)/ws/build/lib/ant-junit4.jar>
[exec] Building jar: <https://builds.apache.org/job/Ant-Build-Matrix-master-Linux/OS=xenial,jdk=JDK%201.8%20(latest)/ws/build/lib/ant-junitlauncher.jar>
[exec] Building jar: <https://builds.apache.org/job/Ant-Build-Matrix-master-Linux/OS=xenial,jdk=JDK%201.8%20(latest)/ws/build/lib/ant-apache-regexp.jar>
[exec] Building jar: <https://builds.apache.org/job/Ant-Build-Matrix-master-Linux/OS=xenial,jdk=JDK%201.8%20(latest)/ws/build/lib/ant-apache-oro.jar>
[exec] Building jar: <https://builds.apache.org/job/Ant-Build-Matrix-master-Linux/OS=xenial,jdk=JDK%201.8%20(latest)/ws/build/lib/ant-apache-bcel.jar>
[exec] Building jar: <https://builds.apache.org/job/Ant-Build-Matrix-master-Linux/OS=xenial,jdk=JDK%201.8%20(latest)/ws/build/lib/ant-apache-log4j.jar>
[exec] Building jar: <https://builds.apache.org/job/Ant-Build-Matrix-master-Linux/OS=xenial,jdk=JDK%201.8%20(latest)/ws/build/lib/ant-commons-logging.jar>
[exec] Building jar: <https://builds.apache.org/job/Ant-Build-Matrix-master-Linux/OS=xenial,jdk=JDK%201.8%20(latest)/ws/build/lib/ant-apache-bsf.jar>
[exec] Building jar: <https://builds.apache.org/job/Ant-Build-Matrix-master-Linux/OS=xenial,jdk=JDK%201.8%20(latest)/ws/build/lib/ant-javamail.jar>
[exec] Building jar: <https://builds.apache.org/job/Ant-Build-Matrix-master-Linux/OS=xenial,jdk=JDK%201.8%20(latest)/ws/build/lib/ant-netrexx.jar>
[exec] Building jar: <https://builds.apache.org/job/Ant-Build-Matrix-master-Linux/OS=xenial,jdk=JDK%201.8%20(latest)/ws/build/lib/ant-commons-net.jar>
[exec] Building jar: <https://builds.apache.org/job/Ant-Build-Matrix-master-Linux/OS=xenial,jdk=JDK%201.8%20(latest)/ws/build/lib/ant-antlr.jar>
[exec] Building jar: <https://builds.apache.org/job/Ant-Build-Matrix-master-Linux/OS=xenial,jdk=JDK%201.8%20(latest)/ws/build/lib/ant-jmf.jar>
[exec] Building jar: <https://builds.apache.org/job/Ant-Build-Matrix-master-Linux/OS=xenial,jdk=JDK%201.8%20(latest)/ws/build/lib/ant-jai.jar>
[exec] Building jar: <https://builds.apache.org/job/Ant-Build-Matrix-master-Linux/OS=xenial,jdk=JDK%201.8%20(latest)/ws/build/lib/ant-swing.jar>
[exec] Building jar: <https://builds.apache.org/job/Ant-Build-Matrix-master-Linux/OS=xenial,jdk=JDK%201.8%20(latest)/ws/build/lib/ant-jsch.jar>
[exec] Building jar: <https://builds.apache.org/job/Ant-Build-Matrix-master-Linux/OS=xenial,jdk=JDK%201.8%20(latest)/ws/build/lib/ant-jdepend.jar>
[exec] Building jar: <https://builds.apache.org/job/Ant-Build-Matrix-master-Linux/OS=xenial,jdk=JDK%201.8%20(latest)/ws/build/lib/ant-apache-xalan2.jar>
[exec] Building jar: <https://builds.apache.org/job/Ant-Build-Matrix-master-Linux/OS=xenial,jdk=JDK%201.8%20(latest)/ws/build/lib/ant-xz.jar>
[exec]
[exec] compile-tests:
[exec] Created dir: <https://builds.apache.org/job/Ant-Build-Matrix-master-Linux/OS=xenial,jdk=JDK%201.8%20(latest)/ws/build/testcases>
[exec] Compiling 314 source files to <https://builds.apache.org/job/Ant-Build-Matrix-master-Linux/OS=xenial,jdk=JDK%201.8%20(latest)/ws/build/testcases>
[exec] Note: Some input files use or override a deprecated API.
[exec] Note: Recompile with -Xlint:deprecation for details.
[exec] Building jar: <https://builds.apache.org/job/Ant-Build-Matrix-master-Linux/OS=xenial,jdk=JDK%201.8%20(latest)/ws/build/testcases/org/apache/tools/ant/taskdefs/test2-antlib.jar>
[exec]
[exec] test-jar:
[exec] Building jar: <https://builds.apache.org/job/Ant-Build-Matrix-master-Linux/OS=xenial,jdk=JDK%201.8%20(latest)/ws/build/lib/ant-testutil.jar>
[exec]
[exec] dist-lite:
[exec] Created dir: <https://builds.apache.org/job/Ant-Build-Matrix-master-Linux/OS=xenial,jdk=JDK%201.8%20(latest)/ws/bootstrap>
[exec] Created dir: <https://builds.apache.org/job/Ant-Build-Matrix-master-Linux/OS=xenial,jdk=JDK%201.8%20(latest)/ws/bootstrap/bin>
[exec] Created dir: <https://builds.apache.org/job/Ant-Build-Matrix-master-Linux/OS=xenial,jdk=JDK%201.8%20(latest)/ws/bootstrap/lib>
[exec] Copying 24 files to <https://builds.apache.org/job/Ant-Build-Matrix-master-Linux/OS=xenial,jdk=JDK%201.8%20(latest)/ws/bootstrap/lib>
[exec] Copying 13 files to <https://builds.apache.org/job/Ant-Build-Matrix-master-Linux/OS=xenial,jdk=JDK%201.8%20(latest)/ws/bootstrap/bin>
[exec]
[exec] BUILD SUCCESSFUL
[exec] Total time: 8 seconds
[exec] ... Cleaning Up Build Directories
[exec] ... Done Bootstrapping Ant Distribution
[exec] java.lang.NoClassDefFoundError: org/apache/tools/ant/util/FileUtils
[exec] at org.apache.tools.ant.launch.Locator.getLocationURLs(Locator.java:479)
[exec] at org.apache.tools.ant.launch.Locator.getLocationURLs(Locator.java:458)
[exec] at org.apache.tools.ant.launch.Launcher.addPath(Launcher.java:147)
[exec] at org.apache.tools.ant.launch.Launcher.getLibPathURLs(Launcher.java:327)
[exec] at org.apache.tools.ant.launch.Launcher.run(Launcher.java:251)
[exec] at org.apache.tools.ant.launch.Launcher.main(Launcher.java:101)
[exec] Caused by: java.lang.ClassNotFoundException: org.apache.tools.ant.util.FileUtils
[exec] at java.net.URLClassLoader.findClass(URLClassLoader.java:381)
[exec] at java.lang.ClassLoader.loadClass(ClassLoader.java:424)
[exec] at sun.misc.Launcher$AppClassLoader.loadClass(Launcher.java:338)
[exec] at java.lang.ClassLoader.loadClass(ClassLoader.java:357)
[exec] ... 6 more
BUILD FAILED
<https://builds.apache.org/job/Ant-Build-Matrix-master-Linux/OS=xenial,jdk=JDK%201.8%20(latest)/ws/launch-build.xml>:40: exec returned: 2
Total time: 16 seconds
Build step 'Invoke Ant' marked build as failure
Recording test results
ERROR: Step ?Publish JUnit test result report? failed: No test report files were found. Configuration error?
Build failed in Jenkins: Ant-Build-Matrix-master-Linux » xenial,JDK 1.8 (latest) #1177
Posted by Apache Jenkins Server <je...@builds.apache.org>.
See <https://builds.apache.org/job/Ant-Build-Matrix-master-Linux/OS=xenial,jdk=JDK%201.8%20(latest)/1177/display/redirect?page=changes>
Changes:
[bodewig] bring back comment
------------------------------------------
Started by upstream project "Ant-Build-Matrix-master-Linux" build number 1177
originally caused by:
Started by an SCM change
[EnvInject] - Loading node environment variables.
Building remotely on H15 (Hadoop xenial) in workspace <https://builds.apache.org/job/Ant-Build-Matrix-master-Linux/OS=xenial,jdk=JDK%201.8%20(latest)/ws/>
> git rev-parse --is-inside-work-tree # timeout=10
Fetching changes from the remote Git repository
> git config remote.origin.url https://git-wip-us.apache.org/repos/asf/ant.git # timeout=10
Cleaning workspace
> git rev-parse --verify HEAD # timeout=10
Resetting working tree
> git reset --hard # timeout=10
> git clean -fdx # timeout=10
Fetching upstream changes from https://git-wip-us.apache.org/repos/asf/ant.git
> git --version # timeout=10
> git fetch --tags --progress https://git-wip-us.apache.org/repos/asf/ant.git +refs/heads/*:refs/remotes/origin/*
Checking out Revision 42810a6cb5943af20f557297aa74e61f48ac3a7b (refs/remotes/origin/master)
> git config core.sparsecheckout # timeout=10
> git checkout -f 42810a6cb5943af20f557297aa74e61f48ac3a7b
Commit message: "bring back comment"
> git rev-list --no-walk 66d7986c3ad41040528a118052c4ef5b2e65ef89 # timeout=10
[EnvInject] - Executing scripts and injecting environment variables after the SCM step.
[EnvInject] - Injecting as environment variables the properties content
LANG=en_US.utf8
[EnvInject] - Variables injected successfully.
[JDK 1.8 (latest)] $ /home/jenkins/tools/ant/latest/bin/ant -file launch-build.xml "-Djdk=JDK 1.8 (latest)" -DOS=xenial -Djenkins=t
Buildfile: <https://builds.apache.org/job/Ant-Build-Matrix-master-Linux/OS=xenial,jdk=JDK%201.8%20(latest)/ws/launch-build.xml>
launch:
[echo] Launching <https://builds.apache.org/job/Ant-Build-Matrix-master-Linux/OS=xenial,jdk=JDK%201.8%20(latest)/ws/build.sh> allclean test -Dignore.tests.failed=true -Doptional.jars.whenmanifestonly=skip -Djenkins=t
[exec] ... Bootstrapping Ant Distribution
[exec] ... Compiling Ant Classes
[exec] ... Copying Required Files
[exec] ... Building Ant Distribution
[exec] Note: Some input files use or override a deprecated API.
[exec] Note: Recompile with -Xlint:deprecation for details.
[exec] Buildfile: <https://builds.apache.org/job/Ant-Build-Matrix-master-Linux/OS=xenial,jdk=JDK%201.8%20(latest)/ws/build.xml>
[exec]
[exec] bootstrap:
[exec]
[exec] check-optional-packages:
[exec]
[exec] prepare:
[exec]
[exec] build:
[exec] Created dir: <https://builds.apache.org/job/Ant-Build-Matrix-master-Linux/OS=xenial,jdk=JDK%201.8%20(latest)/ws/build/lib>
[exec] Compiling 270 source files to <https://builds.apache.org/job/Ant-Build-Matrix-master-Linux/OS=xenial,jdk=JDK%201.8%20(latest)/ws/build/classes>
[exec] Note: Some input files use or override a deprecated API.
[exec] Note: Recompile with -Xlint:deprecation for details.
[exec] Copying 6 files to <https://builds.apache.org/job/Ant-Build-Matrix-master-Linux/OS=xenial,jdk=JDK%201.8%20(latest)/ws/build/classes>
[exec] Copying 2 files to <https://builds.apache.org/job/Ant-Build-Matrix-master-Linux/OS=xenial,jdk=JDK%201.8%20(latest)/ws/build/classes>
[exec] Copying 4 files to <https://builds.apache.org/job/Ant-Build-Matrix-master-Linux/OS=xenial,jdk=JDK%201.8%20(latest)/ws/build/classes/org/apache/tools/ant/taskdefs/optional/junit/xsl>
[exec]
[exec] jars:
[exec] Copying 2 files to <https://builds.apache.org/job/Ant-Build-Matrix-master-Linux/OS=xenial,jdk=JDK%201.8%20(latest)/ws/build>
[exec] Building jar: <https://builds.apache.org/job/Ant-Build-Matrix-master-Linux/OS=xenial,jdk=JDK%201.8%20(latest)/ws/build/lib/ant-launcher.jar>
[exec] Building jar: <https://builds.apache.org/job/Ant-Build-Matrix-master-Linux/OS=xenial,jdk=JDK%201.8%20(latest)/ws/build/lib/ant.jar>
[exec] Building jar: <https://builds.apache.org/job/Ant-Build-Matrix-master-Linux/OS=xenial,jdk=JDK%201.8%20(latest)/ws/build/lib/ant-bootstrap.jar>
[exec] Building jar: <https://builds.apache.org/job/Ant-Build-Matrix-master-Linux/OS=xenial,jdk=JDK%201.8%20(latest)/ws/build/lib/ant-apache-resolver.jar>
[exec] Building jar: <https://builds.apache.org/job/Ant-Build-Matrix-master-Linux/OS=xenial,jdk=JDK%201.8%20(latest)/ws/build/lib/ant-junit.jar>
[exec] Building jar: <https://builds.apache.org/job/Ant-Build-Matrix-master-Linux/OS=xenial,jdk=JDK%201.8%20(latest)/ws/build/lib/ant-junit4.jar>
[exec] Building jar: <https://builds.apache.org/job/Ant-Build-Matrix-master-Linux/OS=xenial,jdk=JDK%201.8%20(latest)/ws/build/lib/ant-junitlauncher.jar>
[exec] Building jar: <https://builds.apache.org/job/Ant-Build-Matrix-master-Linux/OS=xenial,jdk=JDK%201.8%20(latest)/ws/build/lib/ant-apache-regexp.jar>
[exec] Building jar: <https://builds.apache.org/job/Ant-Build-Matrix-master-Linux/OS=xenial,jdk=JDK%201.8%20(latest)/ws/build/lib/ant-apache-oro.jar>
[exec] Building jar: <https://builds.apache.org/job/Ant-Build-Matrix-master-Linux/OS=xenial,jdk=JDK%201.8%20(latest)/ws/build/lib/ant-apache-bcel.jar>
[exec] Building jar: <https://builds.apache.org/job/Ant-Build-Matrix-master-Linux/OS=xenial,jdk=JDK%201.8%20(latest)/ws/build/lib/ant-apache-log4j.jar>
[exec] Building jar: <https://builds.apache.org/job/Ant-Build-Matrix-master-Linux/OS=xenial,jdk=JDK%201.8%20(latest)/ws/build/lib/ant-commons-logging.jar>
[exec] Building jar: <https://builds.apache.org/job/Ant-Build-Matrix-master-Linux/OS=xenial,jdk=JDK%201.8%20(latest)/ws/build/lib/ant-apache-bsf.jar>
[exec] Building jar: <https://builds.apache.org/job/Ant-Build-Matrix-master-Linux/OS=xenial,jdk=JDK%201.8%20(latest)/ws/build/lib/ant-javamail.jar>
[exec] Building jar: <https://builds.apache.org/job/Ant-Build-Matrix-master-Linux/OS=xenial,jdk=JDK%201.8%20(latest)/ws/build/lib/ant-netrexx.jar>
[exec] Building jar: <https://builds.apache.org/job/Ant-Build-Matrix-master-Linux/OS=xenial,jdk=JDK%201.8%20(latest)/ws/build/lib/ant-commons-net.jar>
[exec] Building jar: <https://builds.apache.org/job/Ant-Build-Matrix-master-Linux/OS=xenial,jdk=JDK%201.8%20(latest)/ws/build/lib/ant-antlr.jar>
[exec] Building jar: <https://builds.apache.org/job/Ant-Build-Matrix-master-Linux/OS=xenial,jdk=JDK%201.8%20(latest)/ws/build/lib/ant-jmf.jar>
[exec] Building jar: <https://builds.apache.org/job/Ant-Build-Matrix-master-Linux/OS=xenial,jdk=JDK%201.8%20(latest)/ws/build/lib/ant-jai.jar>
[exec] Building jar: <https://builds.apache.org/job/Ant-Build-Matrix-master-Linux/OS=xenial,jdk=JDK%201.8%20(latest)/ws/build/lib/ant-swing.jar>
[exec] Building jar: <https://builds.apache.org/job/Ant-Build-Matrix-master-Linux/OS=xenial,jdk=JDK%201.8%20(latest)/ws/build/lib/ant-jsch.jar>
[exec] Building jar: <https://builds.apache.org/job/Ant-Build-Matrix-master-Linux/OS=xenial,jdk=JDK%201.8%20(latest)/ws/build/lib/ant-jdepend.jar>
[exec] Building jar: <https://builds.apache.org/job/Ant-Build-Matrix-master-Linux/OS=xenial,jdk=JDK%201.8%20(latest)/ws/build/lib/ant-apache-xalan2.jar>
[exec] Building jar: <https://builds.apache.org/job/Ant-Build-Matrix-master-Linux/OS=xenial,jdk=JDK%201.8%20(latest)/ws/build/lib/ant-xz.jar>
[exec]
[exec] compile-tests:
[exec] Created dir: <https://builds.apache.org/job/Ant-Build-Matrix-master-Linux/OS=xenial,jdk=JDK%201.8%20(latest)/ws/build/testcases>
[exec] Compiling 314 source files to <https://builds.apache.org/job/Ant-Build-Matrix-master-Linux/OS=xenial,jdk=JDK%201.8%20(latest)/ws/build/testcases>
[exec] Note: Some input files use or override a deprecated API.
[exec] Note: Recompile with -Xlint:deprecation for details.
[exec] Building jar: <https://builds.apache.org/job/Ant-Build-Matrix-master-Linux/OS=xenial,jdk=JDK%201.8%20(latest)/ws/build/testcases/org/apache/tools/ant/taskdefs/test2-antlib.jar>
[exec]
[exec] test-jar:
[exec] Building jar: <https://builds.apache.org/job/Ant-Build-Matrix-master-Linux/OS=xenial,jdk=JDK%201.8%20(latest)/ws/build/lib/ant-testutil.jar>
[exec]
[exec] dist-lite:
[exec] Created dir: <https://builds.apache.org/job/Ant-Build-Matrix-master-Linux/OS=xenial,jdk=JDK%201.8%20(latest)/ws/bootstrap>
[exec] Created dir: <https://builds.apache.org/job/Ant-Build-Matrix-master-Linux/OS=xenial,jdk=JDK%201.8%20(latest)/ws/bootstrap/bin>
[exec] Created dir: <https://builds.apache.org/job/Ant-Build-Matrix-master-Linux/OS=xenial,jdk=JDK%201.8%20(latest)/ws/bootstrap/lib>
[exec] Copying 24 files to <https://builds.apache.org/job/Ant-Build-Matrix-master-Linux/OS=xenial,jdk=JDK%201.8%20(latest)/ws/bootstrap/lib>
[exec] Copying 13 files to <https://builds.apache.org/job/Ant-Build-Matrix-master-Linux/OS=xenial,jdk=JDK%201.8%20(latest)/ws/bootstrap/bin>
[exec]
[exec] BUILD SUCCESSFUL
[exec] Total time: 7 seconds
[exec] ... Cleaning Up Build Directories
[exec] ... Done Bootstrapping Ant Distribution
[exec] java.lang.NoClassDefFoundError: org/apache/tools/ant/util/FileUtils
[exec] at org.apache.tools.ant.launch.Locator.getLocationURLs(Locator.java:479)
[exec] at org.apache.tools.ant.launch.Locator.getLocationURLs(Locator.java:458)
[exec] at org.apache.tools.ant.launch.Launcher.addPath(Launcher.java:147)
[exec] at org.apache.tools.ant.launch.Launcher.getLibPathURLs(Launcher.java:327)
[exec] at org.apache.tools.ant.launch.Launcher.run(Launcher.java:251)
[exec] at org.apache.tools.ant.launch.Launcher.main(Launcher.java:101)
[exec] Caused by: java.lang.ClassNotFoundException: org.apache.tools.ant.util.FileUtils
[exec] at java.net.URLClassLoader.findClass(URLClassLoader.java:381)
[exec] at java.lang.ClassLoader.loadClass(ClassLoader.java:424)
[exec] at sun.misc.Launcher$AppClassLoader.loadClass(Launcher.java:338)
[exec] at java.lang.ClassLoader.loadClass(ClassLoader.java:357)
[exec] ... 6 more
BUILD FAILED
<https://builds.apache.org/job/Ant-Build-Matrix-master-Linux/OS=xenial,jdk=JDK%201.8%20(latest)/ws/launch-build.xml>:40: exec returned: 2
Total time: 15 seconds
Build step 'Invoke Ant' marked build as failure
Recording test results
ERROR: Step ?Publish JUnit test result report? failed: No test report files were found. Configuration error?