You are viewing a plain text version of this content. The canonical link for it is here.
Posted to hdfs-dev@hadoop.apache.org by Apache Jenkins Server <hu...@hudson.apache.org> on 2011/05/18 00:17:31 UTC
Hadoop-Hdfs-trunk-Commit - Build # 664 - Still Failing
See https://builds.apache.org/hudson/job/Hadoop-Hdfs-trunk-Commit/664/
###################################################################################
########################## LAST 60 LINES OF THE CONSOLE ###########################
[...truncated 2522 lines...]
[javac] ^
[javac] /tmp/clover1180382457086089189.tmp/org/apache/hadoop/fs/TestResolveHdfsSymlink.java:120: warning: [unchecked] unchecked cast
[javac] found : org.apache.hadoop.security.token.Token<capture#559 of ?>
[javac] required: org.apache.hadoop.security.token.Token<? extends org.apache.hadoop.security.token.delegation.AbstractDelegationTokenIdentifier>
[javac] (Token<? extends AbstractDelegationTokenIdentifier>) tokenList.get(0));
[javac] ^
[javac] Note: Some input files use or override a deprecated API.
[javac] Note: Recompile with -Xlint:deprecation for details.
[javac] 2 warnings
[mkdir] Created dir: /grid/0/hudson/hudson-slave/workspace/Hadoop-Hdfs-trunk-Commit/trunk/build/test/cache
[copy] Copying 1 file to /grid/0/hudson/hudson-slave/workspace/Hadoop-Hdfs-trunk-Commit/trunk/build/test/cache
[copy] Copying 1 file to /grid/0/hudson/hudson-slave/workspace/Hadoop-Hdfs-trunk-Commit/trunk/build/test/cache
[copy] Copying 1 file to /grid/0/hudson/hudson-slave/workspace/Hadoop-Hdfs-trunk-Commit/trunk/build/test/cache
[copy] Copying 1 file to /grid/0/hudson/hudson-slave/workspace/Hadoop-Hdfs-trunk-Commit/trunk/build/test/cache
[copy] Copying 1 file to /grid/0/hudson/hudson-slave/workspace/Hadoop-Hdfs-trunk-Commit/trunk/build/test/cache
[copy] Copying 1 file to /grid/0/hudson/hudson-slave/workspace/Hadoop-Hdfs-trunk-Commit/trunk/build/test/cache
[copy] Copying 1 file to /grid/0/hudson/hudson-slave/workspace/Hadoop-Hdfs-trunk-Commit/trunk/build/test/cache
[copy] Copying 1 file to /grid/0/hudson/hudson-slave/workspace/Hadoop-Hdfs-trunk-Commit/trunk/build/test/cache
[copy] Copying 1 file to /grid/0/hudson/hudson-slave/workspace/Hadoop-Hdfs-trunk-Commit/trunk/build/test/cache
[copy] Copying 1 file to /grid/0/hudson/hudson-slave/workspace/Hadoop-Hdfs-trunk-Commit/trunk/build/test/cache
[copy] Copying 1 file to /grid/0/hudson/hudson-slave/workspace/Hadoop-Hdfs-trunk-Commit/trunk/build/test/cache
[copy] Copying 1 file to /grid/0/hudson/hudson-slave/workspace/Hadoop-Hdfs-trunk-Commit/trunk/build/test/cache
run-commit-test:
[mkdir] Created dir: /grid/0/hudson/hudson-slave/workspace/Hadoop-Hdfs-trunk-Commit/trunk/build/test/data
[mkdir] Created dir: /grid/0/hudson/hudson-slave/workspace/Hadoop-Hdfs-trunk-Commit/trunk/build/test/logs
[copy] Copying 1 file to /grid/0/hudson/hudson-slave/workspace/Hadoop-Hdfs-trunk-Commit/trunk/build/test/extraconf
[copy] Copying 1 file to /grid/0/hudson/hudson-slave/workspace/Hadoop-Hdfs-trunk-Commit/trunk/build/test/extraconf
[junit] Running org.apache.hadoop.hdfs.server.datanode.TestBlockRecovery
[junit] Running org.apache.hadoop.hdfs.server.datanode.TestBlockRecovery
[junit] Tests run: 1, Failures: 0, Errors: 1, Time elapsed: 0 sec
[junit] Test org.apache.hadoop.hdfs.server.datanode.TestBlockRecovery FAILED (timeout)
[junit] Running org.apache.hadoop.hdfs.server.datanode.TestDataDirs
[junit] Tests run: 1, Failures: 0, Errors: 0, Time elapsed: 0.594 sec
[junit] Running org.apache.hadoop.hdfs.server.namenode.TestGetImageServlet
[junit] Tests run: 2, Failures: 0, Errors: 0, Time elapsed: 0.458 sec
[junit] Running org.apache.hadoop.hdfs.server.namenode.TestINodeFile
[junit] Tests run: 7, Failures: 0, Errors: 0, Time elapsed: 0.245 sec
[junit] Running org.apache.hadoop.hdfs.server.namenode.TestNNLeaseRecovery
[junit] Tests run: 11, Failures: 0, Errors: 0, Time elapsed: 3.769 sec
checkfailure:
[touch] Creating /grid/0/hudson/hudson-slave/workspace/Hadoop-Hdfs-trunk-Commit/trunk/build/test/testsfailed
BUILD FAILED
/grid/0/hudson/hudson-slave/workspace/Hadoop-Hdfs-trunk-Commit/trunk/build.xml:703: The following error occurred while executing this line:
/grid/0/hudson/hudson-slave/workspace/Hadoop-Hdfs-trunk-Commit/trunk/build.xml:666: The following error occurred while executing this line:
/grid/0/hudson/hudson-slave/workspace/Hadoop-Hdfs-trunk-Commit/trunk/build.xml:734: Tests failed!
Total time: 15 minutes 29 seconds
[FINDBUGS] Skipping publisher since build result is FAILURE
Recording fingerprints
Archiving artifacts
Recording test results
Publishing Javadoc
Publishing Clover coverage report...
No Clover report will be published due to a Build Failure
Email was triggered for: Failure
Sending email for trigger: Failure
###################################################################################
############################## FAILED TESTS (if any) ##############################
1 tests failed.
FAILED: org.apache.hadoop.hdfs.server.datanode.TestBlockRecovery.testErrorReplicas
Error Message:
Timeout occurred. Please note the time in the report does not reflect the time until the timeout.
Stack Trace:
junit.framework.AssertionFailedError: Timeout occurred. Please note the time in the report does not reflect the time until the timeout.