You are viewing a plain text version of this content. The canonical link for it is here.
Posted to dev@lucene.apache.org by Policeman Jenkins Server <je...@thetaphi.de> on 2017/04/06 00:58:59 UTC

[JENKINS] Lucene-Solr-6.x-Linux (64bit/jdk1.8.0_121) - Build # 3209 - Still Unstable!

Build: https://jenkins.thetaphi.de/job/Lucene-Solr-6.x-Linux/3209/
Java: 64bit/jdk1.8.0_121 -XX:-UseCompressedOops -XX:+UseConcMarkSweepGC

1 tests failed.
FAILED:  org.apache.solr.cloud.TestSolrCloudWithKerberosAlt.testBasics

Error Message:
Address already in use

Stack Trace:
java.net.BindException: Address already in use
	at __randomizedtesting.SeedInfo.seed([E418AD886A6384D2:D9C003A4528DDAA2]:0)
	at sun.nio.ch.Net.bind0(Native Method)
	at sun.nio.ch.Net.bind(Net.java:433)
	at sun.nio.ch.Net.bind(Net.java:425)
	at sun.nio.ch.ServerSocketChannelImpl.bind(ServerSocketChannelImpl.java:223)
	at sun.nio.ch.ServerSocketAdaptor.bind(ServerSocketAdaptor.java:74)
	at org.apache.mina.transport.socket.nio.NioSocketAcceptor.open(NioSocketAcceptor.java:252)
	at org.apache.mina.transport.socket.nio.NioSocketAcceptor.open(NioSocketAcceptor.java:49)
	at org.apache.mina.core.polling.AbstractPollingIoAcceptor.registerHandles(AbstractPollingIoAcceptor.java:525)
	at org.apache.mina.core.polling.AbstractPollingIoAcceptor.access$200(AbstractPollingIoAcceptor.java:67)
	at org.apache.mina.core.polling.AbstractPollingIoAcceptor$Acceptor.run(AbstractPollingIoAcceptor.java:409)
	at org.apache.mina.util.NamePreservingRunnable.run(NamePreservingRunnable.java:65)
	at java.util.concurrent.ThreadPoolExecutor.runWorker(ThreadPoolExecutor.java:1142)
	at java.util.concurrent.ThreadPoolExecutor$Worker.run(ThreadPoolExecutor.java:617)
	at java.lang.Thread.run(Thread.java:745)




Build Log:
[...truncated 12716 lines...]
   [junit4] Suite: org.apache.solr.cloud.TestSolrCloudWithKerberosAlt
   [junit4]   2> 1598393 WARN  (TEST-TestSolrCloudWithKerberosAlt.testBasics-seed#[E418AD886A6384D2]) [    ] o.a.d.s.c.DefaultDirectoryService You didn't change the admin password of directory service instance 'DefaultKrbServer'.  Please update the admin password as soon as possible to prevent a possible security breach.
   [junit4]   2> NOTE: reproduce with: ant test  -Dtestcase=TestSolrCloudWithKerberosAlt -Dtests.method=testBasics -Dtests.seed=E418AD886A6384D2 -Dtests.multiplier=3 -Dtests.slow=true -Dtests.locale=en-ZA -Dtests.timezone=Etc/GMT+7 -Dtests.asserts=true -Dtests.file.encoding=UTF-8
   [junit4] ERROR   19.0s J1 | TestSolrCloudWithKerberosAlt.testBasics <<<
   [junit4]    > Throwable #1: java.net.BindException: Address already in use
   [junit4]    > 	at __randomizedtesting.SeedInfo.seed([E418AD886A6384D2:D9C003A4528DDAA2]:0)
   [junit4]    > 	at sun.nio.ch.Net.bind0(Native Method)
   [junit4]    > 	at sun.nio.ch.Net.bind(Net.java:433)
   [junit4]    > 	at sun.nio.ch.Net.bind(Net.java:425)
   [junit4]    > 	at sun.nio.ch.ServerSocketChannelImpl.bind(ServerSocketChannelImpl.java:223)
   [junit4]    > 	at sun.nio.ch.ServerSocketAdaptor.bind(ServerSocketAdaptor.java:74)
   [junit4]    > 	at org.apache.mina.transport.socket.nio.NioSocketAcceptor.open(NioSocketAcceptor.java:252)
   [junit4]    > 	at org.apache.mina.transport.socket.nio.NioSocketAcceptor.open(NioSocketAcceptor.java:49)
   [junit4]    > 	at org.apache.mina.core.polling.AbstractPollingIoAcceptor.registerHandles(AbstractPollingIoAcceptor.java:525)
   [junit4]    > 	at org.apache.mina.core.polling.AbstractPollingIoAcceptor.access$200(AbstractPollingIoAcceptor.java:67)
   [junit4]    > 	at org.apache.mina.core.polling.AbstractPollingIoAcceptor$Acceptor.run(AbstractPollingIoAcceptor.java:409)
   [junit4]    > 	at org.apache.mina.util.NamePreservingRunnable.run(NamePreservingRunnable.java:65)
   [junit4]    > 	at java.util.concurrent.ThreadPoolExecutor.runWorker(ThreadPoolExecutor.java:1142)
   [junit4]    > 	at java.util.concurrent.ThreadPoolExecutor$Worker.run(ThreadPoolExecutor.java:617)
   [junit4]    > 	at java.lang.Thread.run(Thread.java:745)
   [junit4]   2> NOTE: leaving temporary files on disk at: /home/jenkins/workspace/Lucene-Solr-6.x-Linux/solr/build/solr-core/test/J1/temp/solr.cloud.TestSolrCloudWithKerberosAlt_E418AD886A6384D2-001
   [junit4]   2> NOTE: test params are: codec=Asserting(Lucene62): {}, docValues:{}, maxPointsInLeafNode=151, maxMBSortInHeap=6.337958194002499, sim=RandomSimilarity(queryNorm=true,coord=yes): {}, locale=en-ZA, timezone=Etc/GMT+7
   [junit4]   2> NOTE: Linux 4.4.0-66-generic amd64/Oracle Corporation 1.8.0_121 (64-bit)/cpus=12,threads=1,free=141112896,total=518979584
   [junit4]   2> NOTE: All tests run in this JVM: [SearchHandlerTest, SpatialFilterTest, TestDelegationWithHadoopAuth, CoreAdminRequestStatusTest, SolrCoreMetricManagerTest, ZkSolrClientTest, TestSchemaSimilarityResource, ShardSplitTest, LargeFieldTest, TestStressVersions, TestSurroundQueryParser, DistributedQueryComponentOptimizationTest, SolrJmxReporterTest, SampleTest, TestSolrQueryParserDefaultOperatorResource, ChaosMonkeySafeLeaderTest, TestComplexPhraseLeadingWildcard, TestBulkSchemaAPI, TestSizeLimitedDistributedMap, DistributedIntervalFacetingTest, UpdateLogTest, DistributedDebugComponentTest, TestCursorMarkWithoutUniqueKey, TestJsonFacetRefinement, TestSystemCollAutoCreate, TestExactStatsCache, HdfsRecoverLeaseTest, TestRTGBase, TestReqParamsAPI, TestDownShardTolerantSearch, BooleanFieldTest, ZkCLITest, ConnectionManagerTest, ExitableDirectoryReaderTest, TestSolrCloudWithSecureImpersonation, DistributedTermsComponentTest, AtomicUpdatesTest, CSVRequestHandlerTest, TestHashPartitioner, OpenCloseCoreStressTest, MetricsHandlerTest, InfixSuggestersTest, TestCloudRecovery, TestOverriddenPrefixQueryForCustomFieldType, TestConfigSetProperties, DateMathParserTest, CdcrBootstrapTest, JsonValidatorTest, MoreLikeThisHandlerTest, SegmentsInfoRequestHandlerTest, TestCryptoKeys, ConvertedLegacyTest, SoftAutoCommitTest, TestQueryTypes, ForceLeaderTest, BlockDirectoryTest, TestPerFieldSimilarityClassic, GraphQueryTest, BlobRepositoryCloudTest, FileUtilsTest, TestRandomFlRTGCloud, CollectionsAPIDistributedZkTest, TestQuerySenderListener, HLLUtilTest, SchemaVersionSpecificBehaviorTest, TestQueryUtils, TestFuzzyAnalyzedSuggestions, TestWordDelimiterFilterFactory, TestLRUCache, CdcrUpdateLogTest, TestManagedStopFilterFactory, SolrIndexSplitterTest, TestSmileRequest, TestSQLHandlerNonCloud, DeleteReplicaTest, AssignTest, WordBreakSolrSpellCheckerTest, ConfigureRecoveryStrategyTest, SpatialHeatmapFacetsTest, TestJsonRequest, HdfsSyncSliceTest, TestMacroExpander, HighlighterTest, HdfsBasicDistributedZk2Test, TestFieldCacheSortRandom, OverseerRolesTest, OverriddenZkACLAndCredentialsProvidersTest, JsonLoaderTest, TestBackupRepositoryFactory, TestBM25SimilarityFactory, SpellingQueryConverterTest, TestFieldTypeResource, TestExportWriter, EchoParamsTest, TestMissingGroups, DocValuesTest, TestLeaderElectionWithEmptyReplica, DistanceFunctionTest, CheckHdfsIndexTest, TestConfigReload, CleanupOldIndexTest, BasicAuthStandaloneTest, IndexSchemaTest, TestReloadAndDeleteDocs, TestUpdate, TestJavabinTupleStreamParser, TestInfoStreamLogging, CollectionStateFormat2Test, SolrInfoMBeanTest, SpellCheckCollatorTest, SliceStateTest, TestSchemalessBufferedUpdates, DistribCursorPagingTest, PreAnalyzedFieldManagedSchemaCloudTest, TestUnifiedSolrHighlighter, DistributedQueueTest, DocValuesNotIndexedTest, LeaderFailoverAfterPartitionTest, LeaderInitiatedRecoveryOnCommitTest, MissingSegmentRecoveryTest, ReplaceNodeTest, SaslZkACLProviderTest, SharedFSAutoReplicaFailoverTest, SimpleCollectionCreateDeleteTest, TestConfigSetsAPIExclusivity, TestLeaderInitiatedRecoveryThread, TestMiniSolrCloudCluster, TestReplicaProperties, TestSSLRandomization, TestSolrCloudWithKerberosAlt]
   [junit4] Completed [530/702 (1!)] on J1 in 19.01s, 1 test, 1 error <<< FAILURES!

[...truncated 43927 lines...]