You are viewing a plain text version of this content. The canonical link for it is here.
Posted to builds@beam.apache.org by Apache Jenkins Server <je...@builds.apache.org> on 2023/09/06 12:30:16 UTC
Build failed in Jenkins: beam_PostCommit_XVR_PythonUsingJavaSQL_Dataflow #2310
See <https://ci-beam.apache.org/job/beam_PostCommit_XVR_PythonUsingJavaSQL_Dataflow/2310/display/redirect>
Changes:
------------------------------------------
[...truncated 699.69 KB...]
#9 422.1 removing build/bdist.linux-x86_64/wheel
#9 422.3 Building wheel for apache-beam (setup.py): finished with status 'done'
#9 422.3 Created wheel for apache-beam: filename=apache_beam-2.51.0.dev0-cp311-cp311-linux_x86_64.whl size=15789816 sha256=bdd5491390c6208815b69052e38dfcf25a21188dc3988bc1260b8d4868557a47
#9 422.3 Stored in directory: /root/.cache/pip/wheels/1c/f9/b2/4b1eddc5b0ebe3a955a58e43440c937f3642f0b65c975a1cf4
#9 422.3 Successfully built apache-beam
#9 422.3 Installing collected packages: apache-beam
#9 425.3 Successfully installed apache-beam-2.51.0.dev0
#9 425.3 WARNING: Running pip as the 'root' user can result in broken permissions and conflicting behaviour with the system package manager. It is recommended to use a virtual environment instead: https://pip.pypa.io/warnings/venv
#9 427.3 No broken requirements found.
#9 428.1 absl-py==1.4.0
#9 428.1 apache-beam @ file:///opt/apache/beam/tars/apache-beam.tar.gz#sha256=988f9232a6cc56332336630d50bc7cb74a5443bbd81f884a4400ea15c4ff5d44
#9 428.1 astunparse==1.6.3
#9 428.1 attrs==23.1.0
#9 428.1 beautifulsoup4==4.12.2
#9 428.1 bs4==0.0.1
#9 428.1 cachetools==5.3.1
#9 428.1 certifi==2023.7.22
#9 428.1 cffi==1.15.1
#9 428.1 charset-normalizer==3.2.0
#9 428.1 click==8.1.6
#9 428.1 cloudpickle==2.2.1
#9 428.1 crcmod==1.7
#9 428.1 cryptography==41.0.3
#9 428.1 Cython==0.29.36
#9 428.1 deprecation==2.1.0
#9 428.1 dill==0.3.1.1
#9 428.1 dnspython==2.4.2
#9 428.1 docker==6.1.3
#9 428.1 docopt==0.6.2
#9 428.1 execnet==2.0.2
#9 428.1 fastavro==1.8.2
#9 428.1 fasteners==0.18
#9 428.1 flatbuffers==23.5.26
#9 428.1 freezegun==1.2.2
#9 428.1 future==0.18.3
#9 428.1 gast==0.4.0
#9 428.1 google-api-core==2.11.1
#9 428.1 google-apitools==0.5.31
#9 428.1 google-auth==2.22.0
#9 428.1 google-auth-httplib2==0.1.0
#9 428.1 google-auth-oauthlib==1.0.0
#9 428.1 google-cloud-aiplatform==1.29.0
#9 428.1 google-cloud-bigquery==3.11.4
#9 428.1 google-cloud-bigquery-storage==2.22.0
#9 428.1 google-cloud-bigtable==2.21.0
#9 428.1 google-cloud-core==2.3.3
#9 428.1 google-cloud-datastore==2.17.0
#9 428.1 google-cloud-dlp==3.12.2
#9 428.1 google-cloud-language==2.10.1
#9 428.1 google-cloud-pubsub==2.18.2
#9 428.1 google-cloud-pubsublite==1.8.3
#9 428.1 google-cloud-recommendations-ai==0.10.4
#9 428.1 google-cloud-resource-manager==1.10.3
#9 428.1 google-cloud-spanner==3.40.0
#9 428.1 google-cloud-storage==2.10.0
#9 428.1 google-cloud-videointelligence==2.11.3
#9 428.1 google-cloud-vision==3.4.4
#9 428.1 google-crc32c==1.5.0
#9 428.1 google-pasta==0.2.0
#9 428.1 google-resumable-media==2.5.0
#9 428.1 googleapis-common-protos==1.60.0
#9 428.1 greenlet==2.0.2
#9 428.1 grpc-google-iam-v1==0.12.6
#9 428.1 grpcio==1.56.2
#9 428.1 grpcio-status==1.56.2
#9 428.1 guppy3==3.1.3
#9 428.1 h5py==3.9.0
#9 428.1 hdfs==2.7.2
#9 428.1 httplib2==0.22.0
#9 428.1 hypothesis==6.82.3
#9 428.1 idna==3.4
#9 428.1 iniconfig==2.0.0
#9 428.1 joblib==1.3.2
#9 428.1 keras==2.13.1
#9 428.1 libclang==16.0.6
#9 428.1 Markdown==3.4.4
#9 428.1 MarkupSafe==2.1.3
#9 428.1 mmh3==4.0.1
#9 428.1 mock==5.1.0
#9 428.1 nltk==3.8.1
#9 428.1 nose==1.3.7
#9 428.1 numpy==1.24.3
#9 428.1 oauth2client==4.1.3
#9 428.1 oauthlib==3.2.2
#9 428.1 objsize==0.6.1
#9 428.1 opt-einsum==3.3.0
#9 428.1 orjson==3.9.4
#9 428.1 overrides==6.5.0
#9 428.1 packaging==23.1
#9 428.1 pandas==1.5.3
#9 428.1 parameterized==0.9.0
#9 428.1 pip==23.2.1
#9 428.1 pluggy==1.2.0
#9 428.1 proto-plus==1.22.3
#9 428.1 protobuf==4.23.4
#9 428.1 psycopg2-binary==2.9.7
#9 428.1 pyarrow==11.0.0
#9 428.1 pyasn1==0.5.0
#9 428.1 pyasn1-modules==0.3.0
#9 428.1 pycparser==2.21
#9 428.1 pydot==1.4.2
#9 428.1 PyHamcrest==2.0.4
#9 428.1 pymongo==4.4.1
#9 428.1 PyMySQL==1.1.0
#9 428.1 pyparsing==3.1.1
#9 428.1 pytest==7.4.0
#9 428.1 pytest-timeout==2.1.0
#9 428.1 pytest-xdist==3.3.1
#9 428.1 python-dateutil==2.8.2
#9 428.1 pytz==2023.3
#9 428.1 PyYAML==6.0.1
#9 428.1 regex==2023.8.8
#9 428.1 requests==2.31.0
#9 428.1 requests-mock==1.11.0
#9 428.1 requests-oauthlib==1.3.1
#9 428.1 rsa==4.9
#9 428.1 scikit-learn==1.3.0
#9 428.1 scipy==1.11.1
#9 428.1 setuptools==68.1.2
#9 428.1 Shapely==1.8.5.post1
#9 428.1 six==1.16.0
#9 428.1 sortedcontainers==2.4.0
#9 428.1 soupsieve==2.4.1
#9 428.1 SQLAlchemy==1.4.49
#9 428.1 sqlparse==0.4.4
#9 428.1 tenacity==8.2.2
#9 428.1 tensorboard==2.13.0
#9 428.1 tensorboard-data-server==0.7.1
#9 428.1 tensorflow==2.13.0
#9 428.1 tensorflow-estimator==2.13.0
#9 428.1 tensorflow-io-gcs-filesystem==0.33.0
#9 428.1 termcolor==2.3.0
#9 428.1 testcontainers==3.7.1
#9 428.1 threadpoolctl==3.2.0
#9 428.1 tqdm==4.66.0
#9 428.1 typing_extensions==4.5.0
#9 428.1 urllib3==1.26.16
#9 428.1 websocket-client==1.6.1
#9 428.1 Werkzeug==2.3.6
#9 428.1 wheel==0.41.2
#9 428.1 wrapt==1.15.0
#9 428.1 zstandard==0.21.0
#9 DONE 451.6s
#10 [third_party_licenses 1/4] COPY target/license_scripts /tmp/license_scripts/
#10 DONE 0.2s
#11 [third_party_licenses 2/4] COPY target/go-licenses/* /opt/apache/beam/third_party_licenses/golang/
#11 DONE 0.1s
#12 [third_party_licenses 3/4] COPY target/license_scripts /tmp/license_scripts/
#12 DONE 0.1s
#13 [third_party_licenses 4/4] RUN if [ "true" = "true" ] ; then pip install 'pip-licenses<5' pyyaml tenacity && python /tmp/license_scripts/pull_licenses_py.py ; fi
#13 1.057 Collecting pip-licenses<5
#13 1.057 Obtaining dependency information for pip-licenses<5 from https://files.pythonhosted.org/packages/25/53/a2c514b9133bed6e7e1bc703f6c89f5bf22f93c92da2ac006afcdf036066/pip_licenses-4.3.2-py3-none-any.whl.metadata
#13 1.125 Downloading pip_licenses-4.3.2-py3-none-any.whl.metadata (31 kB)
#13 1.141 Requirement already satisfied: pyyaml in /usr/local/lib/python3.11/site-packages (6.0.1)
#13 1.143 Requirement already satisfied: tenacity in /usr/local/lib/python3.11/site-packages (8.2.2)
#13 1.189 Collecting prettytable>=2.3.0 (from pip-licenses<5)
#13 1.189 Obtaining dependency information for prettytable>=2.3.0 from https://files.pythonhosted.org/packages/25/1e/4c284713b092ec384fad4399452f43f6446ad9aabc9c0b3c3c0920cc53b6/prettytable-3.8.0-py3-none-any.whl.metadata
#13 1.205 Downloading prettytable-3.8.0-py3-none-any.whl.metadata (26 kB)
#13 1.255 Collecting wcwidth (from prettytable>=2.3.0->pip-licenses<5)
#13 1.269 Downloading wcwidth-0.2.6-py2.py3-none-any.whl (29 kB)
#13 1.295 Downloading pip_licenses-4.3.2-py3-none-any.whl (19 kB)
#13 1.316 Downloading prettytable-3.8.0-py3-none-any.whl (27 kB)
#13 2.439 Installing collected packages: wcwidth, prettytable, pip-licenses
#13 2.565 Successfully installed pip-licenses-4.3.2 prettytable-3.8.0 wcwidth-0.2.6
#13 2.566 WARNING: Running pip as the 'root' user can result in broken permissions and conflicting behaviour with the system package manager. It is recommended to use a virtual environment instead: https://pip.pypa.io/warnings/venv
#13 8.111 INFO:root:Successfully pulled licenses for 129 dependencies
#13 8.111 Skip pulling license for bs4
#13 DONE 11.0s
#14 [stage-2 1/2] COPY --from=third_party_licenses /opt/apache/beam/third_party_licenses /opt/apache/beam/third_party_licenses
#14 DONE 0.2s
#15 [stage-2 2/2] RUN if [ "true" != "true" ] ; then rm -rf /opt/apache/beam/third_party_licenses ; fi
#15 DONE 0.3s
#16 exporting to image
#16 exporting layers
#16 exporting layers 23.3s done
#16 writing image sha256:49362312828a0906616d623780183ceeb04f8d99a4a1d7336e3a634b579faf82
#16 writing image sha256:49362312828a0906616d623780183ceeb04f8d99a4a1d7336e3a634b579faf82 done
#16 naming to docker.io/apache/beam_python3.11_sdk:2.51.0.dev done
#16 DONE 23.3s
> Task :runners:google-cloud-dataflow-java:buildAndPushDockerPythonContainer
WARNING: `gcloud docker` will not be supported for Docker client versions above 18.03.
As an alternative, use `gcloud auth configure-docker` to configure `docker` to
use `gcloud` as a credential helper, then use `docker` as you would for non-GCR
registries, e.g. `docker pull gcr.io/project-id/my-image`. Add
`--verbosity=error` to silence this warning: `gcloud docker
--verbosity=error -- pull gcr.io/project-id/my-image`.
See: https://cloud.google.com/container-registry/docs/support/deprecation-notices#gcloud-docker
> Task :runners:google-cloud-dataflow-java:setupXVR
> Task :runners:google-cloud-dataflow-java:validatesCrossLanguageRunnerSetup
> Task :runners:google-cloud-dataflow-java:validatesCrossLanguageRunnerPythonUsingSql FAILED
> Task :runners:google-cloud-dataflow-java:cleanupXVR UP-TO-DATE
> Task :runners:google-cloud-dataflow-java:cleanUpDockerPythonImages
WARNING: Successfully resolved tag to sha256, but it is recommended to use sha256 directly.
Tag: [us.gcr.io/apache-beam-testing/java-postcommit-it/python:20230906121741]
- referencing digest: [us.gcr.io/apache-beam-testing/java-postcommit-it/python@sha256:dd8f42af72f3ef2767f1bc89bf082ee0e6c4241831bfb2156785ca0d4350f9bd]
Deleted [[us.gcr.io/apache-beam-testing/java-postcommit-it/python:20230906121741] (referencing [us.gcr.io/apache-beam-testing/java-postcommit-it/python@sha256:dd8f42af72f3ef2767f1bc89bf082ee0e6c4241831bfb2156785ca0d4350f9bd])].
> Task :runners:google-cloud-dataflow-java:cleanUpDockerJavaImages
WARNING: Successfully resolved tag to sha256, but it is recommended to use sha256 directly.
Tag: [us.gcr.io/apache-beam-testing/java-postcommit-it/java:20230906121741]
- referencing digest: [us.gcr.io/apache-beam-testing/java-postcommit-it/java@sha256:7a45c65b356feef2c23e73ed82e0ee072d85767add37760a8ac202c1ba6558f5]
Deleted [[us.gcr.io/apache-beam-testing/java-postcommit-it/java:20230906121741] (referencing [us.gcr.io/apache-beam-testing/java-postcommit-it/java@sha256:7a45c65b356feef2c23e73ed82e0ee072d85767add37760a8ac202c1ba6558f5])].
> Task :runners:google-cloud-dataflow-java:validatesCrossLanguageRunnerCleanup
FAILURE: Build failed with an exception.
* What went wrong:
Execution failed for task ':runners:google-cloud-dataflow-java:validatesCrossLanguageRunnerPythonUsingSql'.
> Process 'command 'sh'' finished with non-zero exit value 1
* Try:
> Run with --stacktrace option to get the stack trace.
> Run with --info or --debug option to get more log output.
* Get more help at https://help.gradle.org
Deprecated Gradle features were used in this build, making it incompatible with Gradle 8.0.
You can use '--warning-mode all' to show the individual deprecation warnings and determine if they come from your own scripts or plugins.
See https://docs.gradle.org/7.6.2/userguide/command_line_interface.html#sec:command_line_warnings
Execution optimizations have been disabled for 1 invalid unit(s) of work during this build to ensure correctness.
Please consult deprecation warnings for more details.
BUILD FAILED in 12m 50s
179 actionable tasks: 119 executed, 54 from cache, 6 up-to-date
Publishing build scan...
https://ge.apache.org/s/r6akscjlmnmsa
Build step 'Invoke Gradle script' changed build result to FAILURE
Build step 'Invoke Gradle script' marked build as failure
---------------------------------------------------------------------
To unsubscribe, e-mail: builds-unsubscribe@beam.apache.org
For additional commands, e-mail: builds-help@beam.apache.org
Jenkins build is back to normal : beam_PostCommit_XVR_PythonUsingJavaSQL_Dataflow #2316
Posted by Apache Jenkins Server <je...@builds.apache.org>.
See <https://ci-beam.apache.org/job/beam_PostCommit_XVR_PythonUsingJavaSQL_Dataflow/2316/display/redirect>
---------------------------------------------------------------------
To unsubscribe, e-mail: builds-unsubscribe@beam.apache.org
For additional commands, e-mail: builds-help@beam.apache.org
Build failed in Jenkins: beam_PostCommit_XVR_PythonUsingJavaSQL_Dataflow #2315
Posted by Apache Jenkins Server <je...@builds.apache.org>.
See <https://ci-beam.apache.org/job/beam_PostCommit_XVR_PythonUsingJavaSQL_Dataflow/2315/display/redirect>
Changes:
------------------------------------------
[...truncated 701.84 KB...]
#9 449.5 adding 'apache_beam-2.51.0.dev0.dist-info/RECORD'
#9 449.5 removing build/bdist.linux-x86_64/wheel
#9 449.7 Building wheel for apache-beam (setup.py): finished with status 'done'
#9 449.7 Created wheel for apache-beam: filename=apache_beam-2.51.0.dev0-cp311-cp311-linux_x86_64.whl size=15790880 sha256=53744da528ca47206432f444fa2cc948aba44b312f02fae0264c2919fa601d90
#9 449.7 Stored in directory: /root/.cache/pip/wheels/1c/f9/b2/4b1eddc5b0ebe3a955a58e43440c937f3642f0b65c975a1cf4
#9 449.8 Successfully built apache-beam
#9 449.8 Installing collected packages: apache-beam
#9 453.1 Successfully installed apache-beam-2.51.0.dev0
#9 453.1 WARNING: Running pip as the 'root' user can result in broken permissions and conflicting behaviour with the system package manager. It is recommended to use a virtual environment instead: https://pip.pypa.io/warnings/venv
#9 455.2 No broken requirements found.
#9 456.3 absl-py==1.4.0
#9 456.3 apache-beam @ file:///opt/apache/beam/tars/apache-beam.tar.gz#sha256=828d95315c7f80c3a6d86ab3ac656b0037cbc01950bf83c59091b0bb1b7c2cc7
#9 456.3 astunparse==1.6.3
#9 456.3 attrs==23.1.0
#9 456.3 beautifulsoup4==4.12.2
#9 456.3 bs4==0.0.1
#9 456.3 cachetools==5.3.1
#9 456.3 certifi==2023.7.22
#9 456.3 cffi==1.15.1
#9 456.3 charset-normalizer==3.2.0
#9 456.3 click==8.1.6
#9 456.3 cloudpickle==2.2.1
#9 456.3 crcmod==1.7
#9 456.3 cryptography==41.0.3
#9 456.3 Cython==0.29.36
#9 456.3 deprecation==2.1.0
#9 456.3 dill==0.3.1.1
#9 456.3 dnspython==2.4.2
#9 456.3 docker==6.1.3
#9 456.3 docopt==0.6.2
#9 456.3 execnet==2.0.2
#9 456.3 fastavro==1.8.2
#9 456.3 fasteners==0.18
#9 456.3 flatbuffers==23.5.26
#9 456.3 freezegun==1.2.2
#9 456.3 future==0.18.3
#9 456.3 gast==0.4.0
#9 456.3 google-api-core==2.11.1
#9 456.3 google-apitools==0.5.31
#9 456.3 google-auth==2.22.0
#9 456.3 google-auth-httplib2==0.1.0
#9 456.3 google-auth-oauthlib==1.0.0
#9 456.3 google-cloud-aiplatform==1.29.0
#9 456.3 google-cloud-bigquery==3.11.4
#9 456.3 google-cloud-bigquery-storage==2.22.0
#9 456.3 google-cloud-bigtable==2.21.0
#9 456.3 google-cloud-core==2.3.3
#9 456.3 google-cloud-datastore==2.17.0
#9 456.3 google-cloud-dlp==3.12.2
#9 456.3 google-cloud-language==2.10.1
#9 456.3 google-cloud-pubsub==2.18.2
#9 456.3 google-cloud-pubsublite==1.8.3
#9 456.3 google-cloud-recommendations-ai==0.10.4
#9 456.3 google-cloud-resource-manager==1.10.3
#9 456.3 google-cloud-spanner==3.40.0
#9 456.3 google-cloud-storage==2.10.0
#9 456.3 google-cloud-videointelligence==2.11.3
#9 456.3 google-cloud-vision==3.4.4
#9 456.3 google-crc32c==1.5.0
#9 456.3 google-pasta==0.2.0
#9 456.3 google-resumable-media==2.5.0
#9 456.3 googleapis-common-protos==1.60.0
#9 456.3 greenlet==2.0.2
#9 456.3 grpc-google-iam-v1==0.12.6
#9 456.3 grpcio==1.56.2
#9 456.3 grpcio-status==1.56.2
#9 456.3 guppy3==3.1.3
#9 456.3 h5py==3.9.0
#9 456.3 hdfs==2.7.2
#9 456.3 httplib2==0.22.0
#9 456.3 hypothesis==6.82.3
#9 456.3 idna==3.4
#9 456.3 iniconfig==2.0.0
#9 456.3 joblib==1.3.2
#9 456.3 keras==2.13.1
#9 456.3 libclang==16.0.6
#9 456.3 Markdown==3.4.4
#9 456.3 MarkupSafe==2.1.3
#9 456.3 mmh3==4.0.1
#9 456.3 mock==5.1.0
#9 456.3 nltk==3.8.1
#9 456.3 nose==1.3.7
#9 456.3 numpy==1.24.3
#9 456.3 oauth2client==4.1.3
#9 456.3 oauthlib==3.2.2
#9 456.3 objsize==0.6.1
#9 456.3 opt-einsum==3.3.0
#9 456.3 orjson==3.9.2
#9 456.3 overrides==6.5.0
#9 456.3 packaging==23.1
#9 456.3 pandas==1.5.3
#9 456.3 parameterized==0.9.0
#9 456.3 pip==23.2.1
#9 456.3 pluggy==1.2.0
#9 456.3 proto-plus==1.22.3
#9 456.3 protobuf==4.23.4
#9 456.3 psycopg2-binary==2.9.7
#9 456.3 pyarrow==11.0.0
#9 456.3 pyasn1==0.5.0
#9 456.3 pyasn1-modules==0.3.0
#9 456.3 pycparser==2.21
#9 456.3 pydot==1.4.2
#9 456.3 PyHamcrest==2.0.4
#9 456.3 pymongo==4.4.1
#9 456.3 PyMySQL==1.1.0
#9 456.3 pyparsing==3.1.1
#9 456.3 pytest==7.4.0
#9 456.3 pytest-timeout==2.1.0
#9 456.3 pytest-xdist==3.3.1
#9 456.3 python-dateutil==2.8.2
#9 456.3 pytz==2023.3
#9 456.3 PyYAML==6.0.1
#9 456.3 regex==2023.8.8
#9 456.3 requests==2.31.0
#9 456.3 requests-mock==1.11.0
#9 456.3 requests-oauthlib==1.3.1
#9 456.3 rsa==4.9
#9 456.3 scikit-learn==1.3.0
#9 456.3 scipy==1.11.1
#9 456.3 setuptools==68.2.0
#9 456.3 Shapely==1.8.5.post1
#9 456.3 six==1.16.0
#9 456.3 sortedcontainers==2.4.0
#9 456.3 soupsieve==2.4.1
#9 456.3 SQLAlchemy==1.4.49
#9 456.3 sqlparse==0.4.4
#9 456.3 tenacity==8.2.2
#9 456.3 tensorboard==2.13.0
#9 456.3 tensorboard-data-server==0.7.1
#9 456.3 tensorflow==2.13.0
#9 456.3 tensorflow-estimator==2.13.0
#9 456.3 tensorflow-io-gcs-filesystem==0.33.0
#9 456.3 termcolor==2.3.0
#9 456.3 testcontainers==3.7.1
#9 456.3 threadpoolctl==3.2.0
#9 456.3 tqdm==4.66.0
#9 456.3 typing_extensions==4.5.0
#9 456.3 urllib3==1.26.16
#9 456.3 websocket-client==1.6.1
#9 456.3 Werkzeug==2.3.6
#9 456.3 wheel==0.41.2
#9 456.3 wrapt==1.15.0
#9 456.3 zstandard==0.21.0
#9 DONE 460.3s
#10 [third_party_licenses 1/4] COPY target/license_scripts /tmp/license_scripts/
#10 DONE 0.2s
#11 [third_party_licenses 2/4] COPY target/go-licenses/* /opt/apache/beam/third_party_licenses/golang/
#11 DONE 0.3s
#12 [third_party_licenses 3/4] COPY target/license_scripts /tmp/license_scripts/
#12 DONE 0.3s
#13 [third_party_licenses 4/4] RUN if [ "true" = "true" ] ; then pip install 'pip-licenses<5' pyyaml tenacity && python /tmp/license_scripts/pull_licenses_py.py ; fi
#13 1.035 Collecting pip-licenses<5
#13 1.035 Obtaining dependency information for pip-licenses<5 from https://files.pythonhosted.org/packages/25/53/a2c514b9133bed6e7e1bc703f6c89f5bf22f93c92da2ac006afcdf036066/pip_licenses-4.3.2-py3-none-any.whl.metadata
#13 1.096 Downloading pip_licenses-4.3.2-py3-none-any.whl.metadata (31 kB)
#13 1.116 Requirement already satisfied: pyyaml in /usr/local/lib/python3.11/site-packages (6.0.1)
#13 1.117 Requirement already satisfied: tenacity in /usr/local/lib/python3.11/site-packages (8.2.2)
#13 1.167 Collecting prettytable>=2.3.0 (from pip-licenses<5)
#13 1.167 Obtaining dependency information for prettytable>=2.3.0 from https://files.pythonhosted.org/packages/25/1e/4c284713b092ec384fad4399452f43f6446ad9aabc9c0b3c3c0920cc53b6/prettytable-3.8.0-py3-none-any.whl.metadata
#13 1.183 Downloading prettytable-3.8.0-py3-none-any.whl.metadata (26 kB)
#13 1.244 Collecting wcwidth (from prettytable>=2.3.0->pip-licenses<5)
#13 1.257 Downloading wcwidth-0.2.6-py2.py3-none-any.whl (29 kB)
#13 1.287 Downloading pip_licenses-4.3.2-py3-none-any.whl (19 kB)
#13 1.308 Downloading prettytable-3.8.0-py3-none-any.whl (27 kB)
#13 2.442 Installing collected packages: wcwidth, prettytable, pip-licenses
#13 2.600 Successfully installed pip-licenses-4.3.2 prettytable-3.8.0 wcwidth-0.2.6
#13 2.600 WARNING: Running pip as the 'root' user can result in broken permissions and conflicting behaviour with the system package manager. It is recommended to use a virtual environment instead: https://pip.pypa.io/warnings/venv
#13 26.23 INFO:root:Successfully pulled licenses for 129 dependencies
#13 26.23 Skip pulling license for bs4
#13 DONE 30.9s
#14 [stage-2 1/2] COPY --from=third_party_licenses /opt/apache/beam/third_party_licenses /opt/apache/beam/third_party_licenses
#14 DONE 0.2s
#15 [stage-2 2/2] RUN if [ "true" != "true" ] ; then rm -rf /opt/apache/beam/third_party_licenses ; fi
#15 DONE 0.3s
#16 exporting to image
#16 exporting layers
#16 exporting layers 27.7s done
#16 writing image sha256:ead899a6402a292ece5d36c4a95a177ea80f5dbce11d0aaca61924507461dd2d done
#16 naming to docker.io/apache/beam_python3.11_sdk:2.51.0.dev done
#16 DONE 27.7s
> Task :runners:google-cloud-dataflow-java:buildAndPushDockerPythonContainer
WARNING: `gcloud docker` will not be supported for Docker client versions above 18.03.
As an alternative, use `gcloud auth configure-docker` to configure `docker` to
use `gcloud` as a credential helper, then use `docker` as you would for non-GCR
registries, e.g. `docker pull gcr.io/project-id/my-image`. Add
`--verbosity=error` to silence this warning: `gcloud docker
--verbosity=error -- pull gcr.io/project-id/my-image`.
See: https://cloud.google.com/container-registry/docs/support/deprecation-notices#gcloud-docker
> Task :runners:google-cloud-dataflow-java:setupXVR
> Task :runners:google-cloud-dataflow-java:validatesCrossLanguageRunnerSetup
> Task :runners:google-cloud-dataflow-java:validatesCrossLanguageRunnerPythonUsingSql FAILED
> Task :runners:google-cloud-dataflow-java:cleanupXVR UP-TO-DATE
> Task :runners:google-cloud-dataflow-java:cleanUpDockerPythonImages
WARNING: Successfully resolved tag to sha256, but it is recommended to use sha256 directly.
Tag: [us.gcr.io/apache-beam-testing/java-postcommit-it/python:20230907184324]
- referencing digest: [us.gcr.io/apache-beam-testing/java-postcommit-it/python@sha256:612a527fd5ef2891b9580dea55562caa5c394c72ad7f89102e983bbbe6c2ee06]
Deleted [[us.gcr.io/apache-beam-testing/java-postcommit-it/python:20230907184324] (referencing [us.gcr.io/apache-beam-testing/java-postcommit-it/python@sha256:612a527fd5ef2891b9580dea55562caa5c394c72ad7f89102e983bbbe6c2ee06])].
> Task :runners:google-cloud-dataflow-java:cleanUpDockerJavaImages
WARNING: Successfully resolved tag to sha256, but it is recommended to use sha256 directly.
Tag: [us.gcr.io/apache-beam-testing/java-postcommit-it/java:20230907184324]
- referencing digest: [us.gcr.io/apache-beam-testing/java-postcommit-it/java@sha256:17da4d6bf00ceb47049361e7eac53fcfcdc2ace97d32addf512cd1d872de46f3]
Deleted [[us.gcr.io/apache-beam-testing/java-postcommit-it/java:20230907184324] (referencing [us.gcr.io/apache-beam-testing/java-postcommit-it/java@sha256:17da4d6bf00ceb47049361e7eac53fcfcdc2ace97d32addf512cd1d872de46f3])].
> Task :runners:google-cloud-dataflow-java:validatesCrossLanguageRunnerCleanup
FAILURE: Build failed with an exception.
* What went wrong:
Execution failed for task ':runners:google-cloud-dataflow-java:validatesCrossLanguageRunnerPythonUsingSql'.
> Process 'command 'sh'' finished with non-zero exit value 1
* Try:
> Run with --stacktrace option to get the stack trace.
> Run with --info or --debug option to get more log output.
* Get more help at https://help.gradle.org
Deprecated Gradle features were used in this build, making it incompatible with Gradle 8.0.
You can use '--warning-mode all' to show the individual deprecation warnings and determine if they come from your own scripts or plugins.
See https://docs.gradle.org/7.6.2/userguide/command_line_interface.html#sec:command_line_warnings
Execution optimizations have been disabled for 1 invalid unit(s) of work during this build to ensure correctness.
Please consult deprecation warnings for more details.
BUILD FAILED in 14m 24s
179 actionable tasks: 119 executed, 54 from cache, 6 up-to-date
Publishing build scan...
https://ge.apache.org/s/ie4rb3kcjyges
Build step 'Invoke Gradle script' changed build result to FAILURE
Build step 'Invoke Gradle script' marked build as failure
---------------------------------------------------------------------
To unsubscribe, e-mail: builds-unsubscribe@beam.apache.org
For additional commands, e-mail: builds-help@beam.apache.org
Build failed in Jenkins: beam_PostCommit_XVR_PythonUsingJavaSQL_Dataflow #2314
Posted by Apache Jenkins Server <je...@builds.apache.org>.
See <https://ci-beam.apache.org/job/beam_PostCommit_XVR_PythonUsingJavaSQL_Dataflow/2314/display/redirect?page=changes>
Changes:
[noreply] Merge pull request #27991: Refactor ConvertHelpers in "core" to not
------------------------------------------
[...truncated 689.04 KB...]
#9 387.7 removing build/bdist.linux-x86_64/wheel
#9 387.8 Building wheel for apache-beam (setup.py): finished with status 'done'
#9 387.9 Created wheel for apache-beam: filename=apache_beam-2.51.0.dev0-cp311-cp311-linux_x86_64.whl size=15790835 sha256=4018dc319770f441b198ad8bcda5056df2b5666c40d71ddaa23d01298f5971f3
#9 387.9 Stored in directory: /root/.cache/pip/wheels/1c/f9/b2/4b1eddc5b0ebe3a955a58e43440c937f3642f0b65c975a1cf4
#9 387.9 Successfully built apache-beam
#9 387.9 Installing collected packages: apache-beam
#9 391.0 Successfully installed apache-beam-2.51.0.dev0
#9 391.0 WARNING: Running pip as the 'root' user can result in broken permissions and conflicting behaviour with the system package manager. It is recommended to use a virtual environment instead: https://pip.pypa.io/warnings/venv
#9 393.0 No broken requirements found.
#9 393.8 absl-py==1.4.0
#9 393.8 apache-beam @ file:///opt/apache/beam/tars/apache-beam.tar.gz#sha256=22da571c9aa148c3bfdb382f1160ca1e8048514aed6993f2a1149e9b65e900f8
#9 393.8 astunparse==1.6.3
#9 393.8 attrs==23.1.0
#9 393.8 beautifulsoup4==4.12.2
#9 393.8 bs4==0.0.1
#9 393.8 cachetools==5.3.1
#9 393.8 certifi==2023.7.22
#9 393.8 cffi==1.15.1
#9 393.8 charset-normalizer==3.2.0
#9 393.8 click==8.1.6
#9 393.8 cloudpickle==2.2.1
#9 393.8 crcmod==1.7
#9 393.8 cryptography==41.0.3
#9 393.8 Cython==0.29.36
#9 393.8 deprecation==2.1.0
#9 393.8 dill==0.3.1.1
#9 393.8 dnspython==2.4.2
#9 393.8 docker==6.1.3
#9 393.8 docopt==0.6.2
#9 393.8 execnet==2.0.2
#9 393.8 fastavro==1.8.2
#9 393.8 fasteners==0.18
#9 393.8 flatbuffers==23.5.26
#9 393.8 freezegun==1.2.2
#9 393.8 future==0.18.3
#9 393.8 gast==0.4.0
#9 393.8 google-api-core==2.11.1
#9 393.8 google-apitools==0.5.31
#9 393.8 google-auth==2.22.0
#9 393.8 google-auth-httplib2==0.1.0
#9 393.8 google-auth-oauthlib==1.0.0
#9 393.8 google-cloud-aiplatform==1.29.0
#9 393.8 google-cloud-bigquery==3.11.4
#9 393.8 google-cloud-bigquery-storage==2.22.0
#9 393.8 google-cloud-bigtable==2.21.0
#9 393.8 google-cloud-core==2.3.3
#9 393.8 google-cloud-datastore==2.17.0
#9 393.8 google-cloud-dlp==3.12.2
#9 393.8 google-cloud-language==2.10.1
#9 393.8 google-cloud-pubsub==2.18.2
#9 393.8 google-cloud-pubsublite==1.8.3
#9 393.8 google-cloud-recommendations-ai==0.10.4
#9 393.8 google-cloud-resource-manager==1.10.3
#9 393.8 google-cloud-spanner==3.40.0
#9 393.8 google-cloud-storage==2.10.0
#9 393.8 google-cloud-videointelligence==2.11.3
#9 393.8 google-cloud-vision==3.4.4
#9 393.8 google-crc32c==1.5.0
#9 393.8 google-pasta==0.2.0
#9 393.8 google-resumable-media==2.5.0
#9 393.8 googleapis-common-protos==1.60.0
#9 393.8 greenlet==2.0.2
#9 393.8 grpc-google-iam-v1==0.12.6
#9 393.8 grpcio==1.56.2
#9 393.8 grpcio-status==1.56.2
#9 393.8 guppy3==3.1.3
#9 393.8 h5py==3.9.0
#9 393.8 hdfs==2.7.2
#9 393.8 httplib2==0.22.0
#9 393.8 hypothesis==6.82.3
#9 393.8 idna==3.4
#9 393.8 iniconfig==2.0.0
#9 393.8 joblib==1.3.2
#9 393.8 keras==2.13.1
#9 393.8 libclang==16.0.6
#9 393.8 Markdown==3.4.4
#9 393.8 MarkupSafe==2.1.3
#9 393.8 mmh3==4.0.1
#9 393.8 mock==5.1.0
#9 393.8 nltk==3.8.1
#9 393.8 nose==1.3.7
#9 393.8 numpy==1.24.3
#9 393.8 oauth2client==4.1.3
#9 393.8 oauthlib==3.2.2
#9 393.8 objsize==0.6.1
#9 393.8 opt-einsum==3.3.0
#9 393.8 orjson==3.9.2
#9 393.8 overrides==6.5.0
#9 393.8 packaging==23.1
#9 393.8 pandas==1.5.3
#9 393.8 parameterized==0.9.0
#9 393.8 pip==23.2.1
#9 393.8 pluggy==1.2.0
#9 393.8 proto-plus==1.22.3
#9 393.8 protobuf==4.23.4
#9 393.8 psycopg2-binary==2.9.7
#9 393.8 pyarrow==11.0.0
#9 393.8 pyasn1==0.5.0
#9 393.8 pyasn1-modules==0.3.0
#9 393.8 pycparser==2.21
#9 393.8 pydot==1.4.2
#9 393.8 PyHamcrest==2.0.4
#9 393.8 pymongo==4.4.1
#9 393.8 PyMySQL==1.1.0
#9 393.8 pyparsing==3.1.1
#9 393.8 pytest==7.4.0
#9 393.8 pytest-timeout==2.1.0
#9 393.8 pytest-xdist==3.3.1
#9 393.8 python-dateutil==2.8.2
#9 393.8 pytz==2023.3
#9 393.8 PyYAML==6.0.1
#9 393.8 regex==2023.8.8
#9 393.8 requests==2.31.0
#9 393.8 requests-mock==1.11.0
#9 393.8 requests-oauthlib==1.3.1
#9 393.8 rsa==4.9
#9 393.8 scikit-learn==1.3.0
#9 393.8 scipy==1.11.1
#9 393.8 setuptools==68.2.0
#9 393.8 Shapely==1.8.5.post1
#9 393.8 six==1.16.0
#9 393.8 sortedcontainers==2.4.0
#9 393.8 soupsieve==2.4.1
#9 393.8 SQLAlchemy==1.4.49
#9 393.8 sqlparse==0.4.4
#9 393.8 tenacity==8.2.2
#9 393.8 tensorboard==2.13.0
#9 393.8 tensorboard-data-server==0.7.1
#9 393.8 tensorflow==2.13.0
#9 393.8 tensorflow-estimator==2.13.0
#9 393.8 tensorflow-io-gcs-filesystem==0.33.0
#9 393.8 termcolor==2.3.0
#9 393.8 testcontainers==3.7.1
#9 393.8 threadpoolctl==3.2.0
#9 393.8 tqdm==4.66.0
#9 393.8 typing_extensions==4.5.0
#9 393.8 urllib3==1.26.16
#9 393.8 websocket-client==1.6.1
#9 393.8 Werkzeug==2.3.6
#9 393.8 wheel==0.41.2
#9 393.8 wrapt==1.15.0
#9 393.8 zstandard==0.21.0
#9 DONE 395.0s
#10 [third_party_licenses 1/4] COPY target/license_scripts /tmp/license_scripts/
#10 DONE 0.0s
#11 [third_party_licenses 2/4] COPY target/go-licenses/* /opt/apache/beam/third_party_licenses/golang/
#11 DONE 0.0s
#12 [third_party_licenses 3/4] COPY target/license_scripts /tmp/license_scripts/
#12 DONE 0.1s
#13 [third_party_licenses 4/4] RUN if [ "true" = "true" ] ; then pip install 'pip-licenses<5' pyyaml tenacity && python /tmp/license_scripts/pull_licenses_py.py ; fi
#13 1.055 Collecting pip-licenses<5
#13 1.055 Obtaining dependency information for pip-licenses<5 from https://files.pythonhosted.org/packages/25/53/a2c514b9133bed6e7e1bc703f6c89f5bf22f93c92da2ac006afcdf036066/pip_licenses-4.3.2-py3-none-any.whl.metadata
#13 1.125 Downloading pip_licenses-4.3.2-py3-none-any.whl.metadata (31 kB)
#13 1.140 Requirement already satisfied: pyyaml in /usr/local/lib/python3.11/site-packages (6.0.1)
#13 1.141 Requirement already satisfied: tenacity in /usr/local/lib/python3.11/site-packages (8.2.2)
#13 1.189 Collecting prettytable>=2.3.0 (from pip-licenses<5)
#13 1.189 Obtaining dependency information for prettytable>=2.3.0 from https://files.pythonhosted.org/packages/25/1e/4c284713b092ec384fad4399452f43f6446ad9aabc9c0b3c3c0920cc53b6/prettytable-3.8.0-py3-none-any.whl.metadata
#13 1.205 Downloading prettytable-3.8.0-py3-none-any.whl.metadata (26 kB)
#13 1.256 Collecting wcwidth (from prettytable>=2.3.0->pip-licenses<5)
#13 1.271 Downloading wcwidth-0.2.6-py2.py3-none-any.whl (29 kB)
#13 1.298 Downloading pip_licenses-4.3.2-py3-none-any.whl (19 kB)
#13 1.317 Downloading prettytable-3.8.0-py3-none-any.whl (27 kB)
#13 2.453 Installing collected packages: wcwidth, prettytable, pip-licenses
#13 2.582 Successfully installed pip-licenses-4.3.2 prettytable-3.8.0 wcwidth-0.2.6
#13 2.582 WARNING: Running pip as the 'root' user can result in broken permissions and conflicting behaviour with the system package manager. It is recommended to use a virtual environment instead: https://pip.pypa.io/warnings/venv
#13 8.202 INFO:root:Successfully pulled licenses for 129 dependencies
#13 8.202 Skip pulling license for bs4
#13 DONE 8.3s
#14 [stage-2 1/2] COPY --from=third_party_licenses /opt/apache/beam/third_party_licenses /opt/apache/beam/third_party_licenses
#14 DONE 0.1s
#15 [stage-2 2/2] RUN if [ "true" != "true" ] ; then rm -rf /opt/apache/beam/third_party_licenses ; fi
#15 DONE 0.3s
#16 exporting to image
#16 exporting layers
#16 exporting layers 23.5s done
#16 writing image sha256:6e672a03e627b1f42f97604fbbdd8c5f3437d07b3d5e5eec232e3c6673273747 done
#16 naming to docker.io/apache/beam_python3.11_sdk:2.51.0.dev done
#16 DONE 23.5s
> Task :runners:google-cloud-dataflow-java:buildAndPushDockerPythonContainer
WARNING: `gcloud docker` will not be supported for Docker client versions above 18.03.
As an alternative, use `gcloud auth configure-docker` to configure `docker` to
use `gcloud` as a credential helper, then use `docker` as you would for non-GCR
registries, e.g. `docker pull gcr.io/project-id/my-image`. Add
`--verbosity=error` to silence this warning: `gcloud docker
--verbosity=error -- pull gcr.io/project-id/my-image`.
See: https://cloud.google.com/container-registry/docs/support/deprecation-notices#gcloud-docker
> Task :runners:google-cloud-dataflow-java:setupXVR
> Task :runners:google-cloud-dataflow-java:validatesCrossLanguageRunnerSetup
> Task :runners:google-cloud-dataflow-java:validatesCrossLanguageRunnerPythonUsingSql
> Task :runners:google-cloud-dataflow-java:validatesCrossLanguageRunnerPythonUsingSql FAILED
> Task :runners:google-cloud-dataflow-java:cleanupXVR UP-TO-DATE
> Task :runners:google-cloud-dataflow-java:cleanUpDockerPythonImages
WARNING: Successfully resolved tag to sha256, but it is recommended to use sha256 directly.
Tag: [us.gcr.io/apache-beam-testing/java-postcommit-it/python:20230907121740]
- referencing digest: [us.gcr.io/apache-beam-testing/java-postcommit-it/python@sha256:2c6cca1663696ffd7cf378800bfab882cb06727fb8974de8bb134a921b946e9d]
Deleted [[us.gcr.io/apache-beam-testing/java-postcommit-it/python:20230907121740] (referencing [us.gcr.io/apache-beam-testing/java-postcommit-it/python@sha256:2c6cca1663696ffd7cf378800bfab882cb06727fb8974de8bb134a921b946e9d])].
> Task :runners:google-cloud-dataflow-java:cleanUpDockerJavaImages
WARNING: Successfully resolved tag to sha256, but it is recommended to use sha256 directly.
Tag: [us.gcr.io/apache-beam-testing/java-postcommit-it/java:20230907121740]
- referencing digest: [us.gcr.io/apache-beam-testing/java-postcommit-it/java@sha256:e9a8c35fad1af31346a406f8792a4f29dac7f1aed436a2a97f4941ed89bf6f9e]
Deleted [[us.gcr.io/apache-beam-testing/java-postcommit-it/java:20230907121740] (referencing [us.gcr.io/apache-beam-testing/java-postcommit-it/java@sha256:e9a8c35fad1af31346a406f8792a4f29dac7f1aed436a2a97f4941ed89bf6f9e])].
> Task :runners:google-cloud-dataflow-java:validatesCrossLanguageRunnerCleanup
FAILURE: Build failed with an exception.
* What went wrong:
Execution failed for task ':runners:google-cloud-dataflow-java:validatesCrossLanguageRunnerPythonUsingSql'.
> Process 'command 'sh'' finished with non-zero exit value 1
* Try:
> Run with --stacktrace option to get the stack trace.
> Run with --info or --debug option to get more log output.
* Get more help at https://help.gradle.org
Deprecated Gradle features were used in this build, making it incompatible with Gradle 8.0.
You can use '--warning-mode all' to show the individual deprecation warnings and determine if they come from your own scripts or plugins.
See https://docs.gradle.org/7.6.2/userguide/command_line_interface.html#sec:command_line_warnings
Execution optimizations have been disabled for 1 invalid unit(s) of work during this build to ensure correctness.
Please consult deprecation warnings for more details.
BUILD FAILED in 13m 3s
179 actionable tasks: 121 executed, 52 from cache, 6 up-to-date
Publishing build scan...
https://ge.apache.org/s/ssxpeiyer5pae
Build step 'Invoke Gradle script' changed build result to FAILURE
Build step 'Invoke Gradle script' marked build as failure
---------------------------------------------------------------------
To unsubscribe, e-mail: builds-unsubscribe@beam.apache.org
For additional commands, e-mail: builds-help@beam.apache.org
Build failed in Jenkins: beam_PostCommit_XVR_PythonUsingJavaSQL_Dataflow #2313
Posted by Apache Jenkins Server <je...@builds.apache.org>.
See <https://ci-beam.apache.org/job/beam_PostCommit_XVR_PythonUsingJavaSQL_Dataflow/2313/display/redirect>
Changes:
------------------------------------------
[...truncated 734.31 KB...]
______________________ SqlTransformTest.test_tagged_join _______________________
[gw6] linux -- Python 3.11.2 <https://ci-beam.apache.org/job/beam_PostCommit_XVR_PythonUsingJavaSQL_Dataflow/ws/src/build/gradleenv/1922375555/bin/python3.11>
self = <apache_beam.transforms.sql_test.SqlTransformTest testMethod=test_tagged_join>
def test_tagged_join(self):
with TestPipeline() as p:
enrich = (
p | "Create enrich" >> beam.Create(
[Enrich(1, "a"), Enrich(2, "b"), Enrich(26, "z")]))
simple = (
p | "Create simple" >> beam.Create([
SimpleRow(1, "foo", 3.14),
SimpleRow(26, "bar", 1.11),
SimpleRow(1, "baz", 2.34)
]))
out = ({
'simple': simple, 'enrich': enrich
}
> | SqlTransform(
"""
SELECT
simple.`id` AS `id`,
enrich.metadata AS metadata
FROM simple
JOIN enrich
ON simple.`id` = enrich.`id`"""))
apache_beam/transforms/sql_test.py:133:
_ _ _ _ _ _ _ _ _ _ _ _ _ _ _ _ _ _ _ _ _ _ _ _ _ _ _ _ _ _ _ _ _ _ _ _ _ _ _ _
apache_beam/transforms/sql.py:86: in __init__
expansion_service = expansion_service or BeamJarExpansionService(
apache_beam/transforms/external.py:983: in __init__
path_to_jar = subprocess_server.JavaJarServer.path_to_beam_jar(
_ _ _ _ _ _ _ _ _ _ _ _ _ _ _ _ _ _ _ _ _ _ _ _ _ _ _ _ _ _ _ _ _ _ _ _ _ _ _ _
cls = <class 'apache_beam.utils.subprocess_server.JavaJarServer'>
gradle_target = ':sdks:java:extensions:sql:expansion-service:shadowJar'
appendix = None, version = '2.51.0.dev'
artifact_id = 'beam-sdks-java-extensions-sql-expansion-service'
@classmethod
def path_to_beam_jar(
cls,
gradle_target,
appendix=None,
version=beam_version,
artifact_id=None):
if gradle_target in cls._BEAM_SERVICES.replacements:
return cls._BEAM_SERVICES.replacements[gradle_target]
gradle_package = gradle_target.strip(':').rsplit(':', 1)[0]
if not artifact_id:
artifact_id = 'beam-' + gradle_package.replace(':', '-')
project_root = os.path.sep.join(
os.path.abspath(__file__).split(os.path.sep)[:-5])
local_path = os.path.join(
project_root,
gradle_package.replace(':', os.path.sep),
'build',
'libs',
cls.jar_name(
artifact_id,
version.replace('.dev', ''),
classifier='SNAPSHOT',
appendix=appendix))
if os.path.exists(local_path):
_LOGGER.info('Using pre-built snapshot at %s', local_path)
return local_path
elif '.dev' in version:
# TODO: Attempt to use nightly snapshots?
> raise RuntimeError(
(
'%s not found. '
'Please build the server with \n cd %s; ./gradlew %s') %
(local_path, os.path.abspath(project_root), gradle_target))
E RuntimeError: <https://ci-beam.apache.org/job/beam_PostCommit_XVR_PythonUsingJavaSQL_Dataflow/ws/src/sdks/java/extensions/sql/expansion-service/build/libs/beam-sdks-java-extensions-sql-expansion-service-2.51.0-SNAPSHOT.jar> not found. Please build the server with
E cd <https://ci-beam.apache.org/job/beam_PostCommit_XVR_PythonUsingJavaSQL_Dataflow/ws/src;> ./gradlew :sdks:java:extensions:sql:expansion-service:shadowJar
apache_beam/utils/subprocess_server.py:243: RuntimeError
=============================== warnings summary ===============================
../../build/gradleenv/1922375555/lib/python3.11/site-packages/hdfs/config.py:28
../../build/gradleenv/1922375555/lib/python3.11/site-packages/hdfs/config.py:28
../../build/gradleenv/1922375555/lib/python3.11/site-packages/hdfs/config.py:28
../../build/gradleenv/1922375555/lib/python3.11/site-packages/hdfs/config.py:28
../../build/gradleenv/1922375555/lib/python3.11/site-packages/hdfs/config.py:28
../../build/gradleenv/1922375555/lib/python3.11/site-packages/hdfs/config.py:28
../../build/gradleenv/1922375555/lib/python3.11/site-packages/hdfs/config.py:28
../../build/gradleenv/1922375555/lib/python3.11/site-packages/hdfs/config.py:28
../../build/gradleenv/1922375555/lib/python3.11/site-packages/hdfs/config.py:28
<https://ci-beam.apache.org/job/beam_PostCommit_XVR_PythonUsingJavaSQL_Dataflow/ws/src/build/gradleenv/1922375555/lib/python3.11/site-packages/hdfs/config.py>:28: DeprecationWarning: the imp module is deprecated in favour of importlib and slated for removal in Python 3.12; see the module's documentation for alternative uses
from imp import load_source
../../build/gradleenv/1922375555/lib/python3.11/site-packages/google/rpc/__init__.py:18
../../build/gradleenv/1922375555/lib/python3.11/site-packages/google/rpc/__init__.py:18
../../build/gradleenv/1922375555/lib/python3.11/site-packages/google/rpc/__init__.py:18
../../build/gradleenv/1922375555/lib/python3.11/site-packages/google/rpc/__init__.py:18
../../build/gradleenv/1922375555/lib/python3.11/site-packages/google/rpc/__init__.py:18
../../build/gradleenv/1922375555/lib/python3.11/site-packages/google/rpc/__init__.py:18
../../build/gradleenv/1922375555/lib/python3.11/site-packages/google/rpc/__init__.py:18
../../build/gradleenv/1922375555/lib/python3.11/site-packages/google/rpc/__init__.py:18
../../build/gradleenv/1922375555/lib/python3.11/site-packages/google/rpc/__init__.py:18
<https://ci-beam.apache.org/job/beam_PostCommit_XVR_PythonUsingJavaSQL_Dataflow/ws/src/build/gradleenv/1922375555/lib/python3.11/site-packages/google/rpc/__init__.py>:18: DeprecationWarning: pkg_resources is deprecated as an API. See https://setuptools.pypa.io/en/latest/pkg_resources.html
import pkg_resources
../../build/gradleenv/1922375555/lib/python3.11/site-packages/pkg_resources/__init__.py:2871: 171 warnings
<https://ci-beam.apache.org/job/beam_PostCommit_XVR_PythonUsingJavaSQL_Dataflow/ws/src/build/gradleenv/1922375555/lib/python3.11/site-packages/pkg_resources/__init__.py>:2871: DeprecationWarning: Deprecated call to `pkg_resources.declare_namespace('google')`.
Implementing implicit namespace packages (as specified in PEP 420) is preferred to `pkg_resources.declare_namespace`. See https://setuptools.pypa.io/en/latest/references/keywords.html#keyword-namespace-packages
declare_namespace(pkg)
../../build/gradleenv/1922375555/lib/python3.11/site-packages/pkg_resources/__init__.py:2871: 144 warnings
<https://ci-beam.apache.org/job/beam_PostCommit_XVR_PythonUsingJavaSQL_Dataflow/ws/src/build/gradleenv/1922375555/lib/python3.11/site-packages/pkg_resources/__init__.py>:2871: DeprecationWarning: Deprecated call to `pkg_resources.declare_namespace('google.cloud')`.
Implementing implicit namespace packages (as specified in PEP 420) is preferred to `pkg_resources.declare_namespace`. See https://setuptools.pypa.io/en/latest/references/keywords.html#keyword-namespace-packages
declare_namespace(pkg)
../../build/gradleenv/1922375555/lib/python3.11/site-packages/pkg_resources/__init__.py:2350: 36 warnings
<https://ci-beam.apache.org/job/beam_PostCommit_XVR_PythonUsingJavaSQL_Dataflow/ws/src/build/gradleenv/1922375555/lib/python3.11/site-packages/pkg_resources/__init__.py>:2350: DeprecationWarning: Deprecated call to `pkg_resources.declare_namespace('google')`.
Implementing implicit namespace packages (as specified in PEP 420) is preferred to `pkg_resources.declare_namespace`. See https://setuptools.pypa.io/en/latest/references/keywords.html#keyword-namespace-packages
declare_namespace(parent)
../../build/gradleenv/1922375555/lib/python3.11/site-packages/pkg_resources/__init__.py:2871
../../build/gradleenv/1922375555/lib/python3.11/site-packages/pkg_resources/__init__.py:2871
../../build/gradleenv/1922375555/lib/python3.11/site-packages/pkg_resources/__init__.py:2871
../../build/gradleenv/1922375555/lib/python3.11/site-packages/pkg_resources/__init__.py:2871
../../build/gradleenv/1922375555/lib/python3.11/site-packages/pkg_resources/__init__.py:2871
../../build/gradleenv/1922375555/lib/python3.11/site-packages/pkg_resources/__init__.py:2871
../../build/gradleenv/1922375555/lib/python3.11/site-packages/pkg_resources/__init__.py:2871
../../build/gradleenv/1922375555/lib/python3.11/site-packages/pkg_resources/__init__.py:2871
../../build/gradleenv/1922375555/lib/python3.11/site-packages/pkg_resources/__init__.py:2871
<https://ci-beam.apache.org/job/beam_PostCommit_XVR_PythonUsingJavaSQL_Dataflow/ws/src/build/gradleenv/1922375555/lib/python3.11/site-packages/pkg_resources/__init__.py>:2871: DeprecationWarning: Deprecated call to `pkg_resources.declare_namespace('google.logging')`.
Implementing implicit namespace packages (as specified in PEP 420) is preferred to `pkg_resources.declare_namespace`. See https://setuptools.pypa.io/en/latest/references/keywords.html#keyword-namespace-packages
declare_namespace(pkg)
../../build/gradleenv/1922375555/lib/python3.11/site-packages/pkg_resources/__init__.py:2871
../../build/gradleenv/1922375555/lib/python3.11/site-packages/pkg_resources/__init__.py:2871
../../build/gradleenv/1922375555/lib/python3.11/site-packages/pkg_resources/__init__.py:2871
../../build/gradleenv/1922375555/lib/python3.11/site-packages/pkg_resources/__init__.py:2871
../../build/gradleenv/1922375555/lib/python3.11/site-packages/pkg_resources/__init__.py:2871
../../build/gradleenv/1922375555/lib/python3.11/site-packages/pkg_resources/__init__.py:2871
../../build/gradleenv/1922375555/lib/python3.11/site-packages/pkg_resources/__init__.py:2871
../../build/gradleenv/1922375555/lib/python3.11/site-packages/pkg_resources/__init__.py:2871
../../build/gradleenv/1922375555/lib/python3.11/site-packages/pkg_resources/__init__.py:2871
<https://ci-beam.apache.org/job/beam_PostCommit_XVR_PythonUsingJavaSQL_Dataflow/ws/src/build/gradleenv/1922375555/lib/python3.11/site-packages/pkg_resources/__init__.py>:2871: DeprecationWarning: Deprecated call to `pkg_resources.declare_namespace('google.iam')`.
Implementing implicit namespace packages (as specified in PEP 420) is preferred to `pkg_resources.declare_namespace`. See https://setuptools.pypa.io/en/latest/references/keywords.html#keyword-namespace-packages
declare_namespace(pkg)
../../build/gradleenv/1922375555/lib/python3.11/site-packages/google/rpc/__init__.py:20
../../build/gradleenv/1922375555/lib/python3.11/site-packages/google/rpc/__init__.py:20
../../build/gradleenv/1922375555/lib/python3.11/site-packages/google/rpc/__init__.py:20
../../build/gradleenv/1922375555/lib/python3.11/site-packages/google/rpc/__init__.py:20
../../build/gradleenv/1922375555/lib/python3.11/site-packages/google/rpc/__init__.py:20
../../build/gradleenv/1922375555/lib/python3.11/site-packages/google/rpc/__init__.py:20
../../build/gradleenv/1922375555/lib/python3.11/site-packages/google/rpc/__init__.py:20
../../build/gradleenv/1922375555/lib/python3.11/site-packages/google/rpc/__init__.py:20
../../build/gradleenv/1922375555/lib/python3.11/site-packages/google/rpc/__init__.py:20
<https://ci-beam.apache.org/job/beam_PostCommit_XVR_PythonUsingJavaSQL_Dataflow/ws/src/build/gradleenv/1922375555/lib/python3.11/site-packages/google/rpc/__init__.py>:20: DeprecationWarning: Deprecated call to `pkg_resources.declare_namespace('google.rpc')`.
Implementing implicit namespace packages (as specified in PEP 420) is preferred to `pkg_resources.declare_namespace`. See https://setuptools.pypa.io/en/latest/references/keywords.html#keyword-namespace-packages
pkg_resources.declare_namespace(__name__)
../../build/gradleenv/1922375555/lib/python3.11/site-packages/google/api_core/operations_v1/abstract_operations_client.py:17
../../build/gradleenv/1922375555/lib/python3.11/site-packages/google/api_core/operations_v1/abstract_operations_client.py:17
../../build/gradleenv/1922375555/lib/python3.11/site-packages/google/api_core/operations_v1/abstract_operations_client.py:17
../../build/gradleenv/1922375555/lib/python3.11/site-packages/google/api_core/operations_v1/abstract_operations_client.py:17
../../build/gradleenv/1922375555/lib/python3.11/site-packages/google/api_core/operations_v1/abstract_operations_client.py:17
../../build/gradleenv/1922375555/lib/python3.11/site-packages/google/api_core/operations_v1/abstract_operations_client.py:17
../../build/gradleenv/1922375555/lib/python3.11/site-packages/google/api_core/operations_v1/abstract_operations_client.py:17
../../build/gradleenv/1922375555/lib/python3.11/site-packages/google/api_core/operations_v1/abstract_operations_client.py:17
<https://ci-beam.apache.org/job/beam_PostCommit_XVR_PythonUsingJavaSQL_Dataflow/ws/src/build/gradleenv/1922375555/lib/python3.11/site-packages/google/api_core/operations_v1/abstract_operations_client.py>:17: DeprecationWarning: The distutils package is deprecated and slated for removal in Python 3.12. Use setuptools or check PEP 632 for potential alternatives
from distutils import util
-- Docs: https://docs.pytest.org/en/stable/how-to/capture-warnings.html
- generated xml file: <https://ci-beam.apache.org/job/beam_PostCommit_XVR_PythonUsingJavaSQL_Dataflow/ws/src/sdks/python/pytest_xlangSqlValidateRunner.xml> -
=========================== short test summary info ============================
FAILED apache_beam/transforms/sql_test.py::SqlTransformTest::test_project - RuntimeError: <https://ci-beam.apache.org/job/beam_PostCommit_XVR_PythonUsingJavaSQL_Dataflow/ws/src/sdks/java/extensions/sql/expansion-service/build/libs/beam-sdks-java-extensions-sql-expansion-service-2.51.0-SNAPSHOT.jar> not found. Please build the server with
cd <https://ci-beam.apache.org/job/beam_PostCommit_XVR_PythonUsingJavaSQL_Dataflow/ws/src;> ./gradlew :sdks:java:extensions:sql:expansion-service:shadowJar
FAILED apache_beam/transforms/sql_test.py::SqlTransformTest::test_generate_data - RuntimeError: <https://ci-beam.apache.org/job/beam_PostCommit_XVR_PythonUsingJavaSQL_Dataflow/ws/src/sdks/java/extensions/sql/expansion-service/build/libs/beam-sdks-java-extensions-sql-expansion-service-2.51.0-SNAPSHOT.jar> not found. Please build the server with
cd <https://ci-beam.apache.org/job/beam_PostCommit_XVR_PythonUsingJavaSQL_Dataflow/ws/src;> ./gradlew :sdks:java:extensions:sql:expansion-service:shadowJar
FAILED apache_beam/transforms/sql_test.py::SqlTransformTest::test_map - RuntimeError: <https://ci-beam.apache.org/job/beam_PostCommit_XVR_PythonUsingJavaSQL_Dataflow/ws/src/sdks/java/extensions/sql/expansion-service/build/libs/beam-sdks-java-extensions-sql-expansion-service-2.51.0-SNAPSHOT.jar> not found. Please build the server with
cd <https://ci-beam.apache.org/job/beam_PostCommit_XVR_PythonUsingJavaSQL_Dataflow/ws/src;> ./gradlew :sdks:java:extensions:sql:expansion-service:shadowJar
FAILED apache_beam/transforms/sql_test.py::SqlTransformTest::test_agg - RuntimeError: <https://ci-beam.apache.org/job/beam_PostCommit_XVR_PythonUsingJavaSQL_Dataflow/ws/src/sdks/java/extensions/sql/expansion-service/build/libs/beam-sdks-java-extensions-sql-expansion-service-2.51.0-SNAPSHOT.jar> not found. Please build the server with
cd <https://ci-beam.apache.org/job/beam_PostCommit_XVR_PythonUsingJavaSQL_Dataflow/ws/src;> ./gradlew :sdks:java:extensions:sql:expansion-service:shadowJar
FAILED apache_beam/transforms/sql_test.py::SqlTransformTest::test_windowing_before_sql - RuntimeError: <https://ci-beam.apache.org/job/beam_PostCommit_XVR_PythonUsingJavaSQL_Dataflow/ws/src/sdks/java/extensions/sql/expansion-service/build/libs/beam-sdks-java-extensions-sql-expansion-service-2.51.0-SNAPSHOT.jar> not found. Please build the server with
cd <https://ci-beam.apache.org/job/beam_PostCommit_XVR_PythonUsingJavaSQL_Dataflow/ws/src;> ./gradlew :sdks:java:extensions:sql:expansion-service:shadowJar
FAILED apache_beam/transforms/sql_test.py::SqlTransformTest::test_filter - RuntimeError: <https://ci-beam.apache.org/job/beam_PostCommit_XVR_PythonUsingJavaSQL_Dataflow/ws/src/sdks/java/extensions/sql/expansion-service/build/libs/beam-sdks-java-extensions-sql-expansion-service-2.51.0-SNAPSHOT.jar> not found. Please build the server with
cd <https://ci-beam.apache.org/job/beam_PostCommit_XVR_PythonUsingJavaSQL_Dataflow/ws/src;> ./gradlew :sdks:java:extensions:sql:expansion-service:shadowJar
FAILED apache_beam/transforms/sql_test.py::SqlTransformTest::test_row - RuntimeError: <https://ci-beam.apache.org/job/beam_PostCommit_XVR_PythonUsingJavaSQL_Dataflow/ws/src/sdks/java/extensions/sql/expansion-service/build/libs/beam-sdks-java-extensions-sql-expansion-service-2.51.0-SNAPSHOT.jar> not found. Please build the server with
cd <https://ci-beam.apache.org/job/beam_PostCommit_XVR_PythonUsingJavaSQL_Dataflow/ws/src;> ./gradlew :sdks:java:extensions:sql:expansion-service:shadowJar
FAILED apache_beam/transforms/sql_test.py::SqlTransformTest::test_zetasql_generate_data - RuntimeError: <https://ci-beam.apache.org/job/beam_PostCommit_XVR_PythonUsingJavaSQL_Dataflow/ws/src/sdks/java/extensions/sql/expansion-service/build/libs/beam-sdks-java-extensions-sql-expansion-service-2.51.0-SNAPSHOT.jar> not found. Please build the server with
cd <https://ci-beam.apache.org/job/beam_PostCommit_XVR_PythonUsingJavaSQL_Dataflow/ws/src;> ./gradlew :sdks:java:extensions:sql:expansion-service:shadowJar
FAILED apache_beam/transforms/sql_test.py::SqlTransformTest::test_tagged_join - RuntimeError: <https://ci-beam.apache.org/job/beam_PostCommit_XVR_PythonUsingJavaSQL_Dataflow/ws/src/sdks/java/extensions/sql/expansion-service/build/libs/beam-sdks-java-extensions-sql-expansion-service-2.51.0-SNAPSHOT.jar> not found. Please build the server with
cd <https://ci-beam.apache.org/job/beam_PostCommit_XVR_PythonUsingJavaSQL_Dataflow/ws/src;> ./gradlew :sdks:java:extensions:sql:expansion-service:shadowJar
================= 9 failed, 16 skipped, 404 warnings in 13.01s =================
> Task :runners:google-cloud-dataflow-java:validatesCrossLanguageRunnerPythonUsingSql FAILED
> Task :runners:google-cloud-dataflow-java:cleanupXVR UP-TO-DATE
> Task :runners:google-cloud-dataflow-java:cleanUpDockerPythonImages
Untagged: us.gcr.io/apache-beam-testing/java-postcommit-it/python:20230907061737
Untagged: us.gcr.io/apache-beam-testing/java-postcommit-it/python@sha256:e1c70f37a1d5015b575a1bfb89847d4efd97d682d59f6ff1a67d9519ba202bde
WARNING: Successfully resolved tag to sha256, but it is recommended to use sha256 directly.
Tag: [us.gcr.io/apache-beam-testing/java-postcommit-it/python:20230907061737]
- referencing digest: [us.gcr.io/apache-beam-testing/java-postcommit-it/python@sha256:e1c70f37a1d5015b575a1bfb89847d4efd97d682d59f6ff1a67d9519ba202bde]
Deleted [[us.gcr.io/apache-beam-testing/java-postcommit-it/python:20230907061737] (referencing [us.gcr.io/apache-beam-testing/java-postcommit-it/python@sha256:e1c70f37a1d5015b575a1bfb89847d4efd97d682d59f6ff1a67d9519ba202bde])].
Removing untagged image us.gcr.io/apache-beam-testing/java-postcommit-it/python@sha256:e1c70f37a1d5015b575a1bfb89847d4efd97d682d59f6ff1a67d9519ba202bde
> Task :runners:google-cloud-dataflow-java:cleanUpDockerJavaImages
Untagged: us.gcr.io/apache-beam-testing/java-postcommit-it/java:20230907061737
Untagged: us.gcr.io/apache-beam-testing/java-postcommit-it/java@sha256:821e9ca7df637f36e4b63650b56655f9b13bc1d2fac3acf3ffacd6a40970c802
WARNING: Successfully resolved tag to sha256, but it is recommended to use sha256 directly.
Tag: [us.gcr.io/apache-beam-testing/java-postcommit-it/java:20230907061737]
- referencing digest: [us.gcr.io/apache-beam-testing/java-postcommit-it/java@sha256:821e9ca7df637f36e4b63650b56655f9b13bc1d2fac3acf3ffacd6a40970c802]
Deleted [[us.gcr.io/apache-beam-testing/java-postcommit-it/java:20230907061737] (referencing [us.gcr.io/apache-beam-testing/java-postcommit-it/java@sha256:821e9ca7df637f36e4b63650b56655f9b13bc1d2fac3acf3ffacd6a40970c802])].
Removing untagged image us.gcr.io/apache-beam-testing/java-postcommit-it/java@sha256:821e9ca7df637f36e4b63650b56655f9b13bc1d2fac3acf3ffacd6a40970c802
> Task :runners:google-cloud-dataflow-java:validatesCrossLanguageRunnerCleanup
Stopping expansion service pid: 3000601.
Stopping expansion service pid: 3000602.
FAILURE: Build failed with an exception.
* What went wrong:
Execution failed for task ':runners:google-cloud-dataflow-java:validatesCrossLanguageRunnerPythonUsingSql'.
> Process 'command 'sh'' finished with non-zero exit value 1
* Try:
> Run with --stacktrace option to get the stack trace.
> Run with --info or --debug option to get more log output.
* Get more help at https://help.gradle.org
Deprecated Gradle features were used in this build, making it incompatible with Gradle 8.0.
You can use '--warning-mode all' to show the individual deprecation warnings and determine if they come from your own scripts or plugins.
See https://docs.gradle.org/7.6.2/userguide/command_line_interface.html#sec:command_line_warnings
Execution optimizations have been disabled for 1 invalid unit(s) of work during this build to ensure correctness.
Please consult deprecation warnings for more details.
BUILD FAILED in 10m 54s
179 actionable tasks: 119 executed, 54 from cache, 6 up-to-date
Publishing build scan...
https://ge.apache.org/s/ehlw4jfvvh45g
Build step 'Invoke Gradle script' changed build result to FAILURE
Build step 'Invoke Gradle script' marked build as failure
---------------------------------------------------------------------
To unsubscribe, e-mail: builds-unsubscribe@beam.apache.org
For additional commands, e-mail: builds-help@beam.apache.org
Build failed in Jenkins: beam_PostCommit_XVR_PythonUsingJavaSQL_Dataflow #2312
Posted by Apache Jenkins Server <je...@builds.apache.org>.
See <https://ci-beam.apache.org/job/beam_PostCommit_XVR_PythonUsingJavaSQL_Dataflow/2312/display/redirect>
Changes:
------------------------------------------
[...truncated 686.82 KB...]
#9 628.7 adding 'apache_beam-2.51.0.dev0.dist-info/RECORD'
#9 628.7 removing build/bdist.linux-x86_64/wheel
#9 629.0 Building wheel for apache-beam (setup.py): finished with status 'done'
#9 629.0 Created wheel for apache-beam: filename=apache_beam-2.51.0.dev0-cp311-cp311-linux_x86_64.whl size=15790881 sha256=0c2ec5ddb248d5f888bd89858bdbd9105e0a42710c778ed6e433e22fd9194c15
#9 629.0 Stored in directory: /root/.cache/pip/wheels/1c/f9/b2/4b1eddc5b0ebe3a955a58e43440c937f3642f0b65c975a1cf4
#9 629.1 Successfully built apache-beam
#9 629.1 Installing collected packages: apache-beam
#9 633.8 Successfully installed apache-beam-2.51.0.dev0
#9 633.8 WARNING: Running pip as the 'root' user can result in broken permissions and conflicting behaviour with the system package manager. It is recommended to use a virtual environment instead: https://pip.pypa.io/warnings/venv
#9 636.9 No broken requirements found.
#9 638.0 absl-py==1.4.0
#9 638.0 apache-beam @ file:///opt/apache/beam/tars/apache-beam.tar.gz#sha256=6fda257f8a526b00394a3b6ee5fb3161519716064260ce5a0ab6ee6366048355
#9 638.0 astunparse==1.6.3
#9 638.0 attrs==23.1.0
#9 638.0 beautifulsoup4==4.12.2
#9 638.0 bs4==0.0.1
#9 638.0 cachetools==5.3.1
#9 638.0 certifi==2023.7.22
#9 638.0 cffi==1.15.1
#9 638.0 charset-normalizer==3.2.0
#9 638.0 click==8.1.6
#9 638.0 cloudpickle==2.2.1
#9 638.0 crcmod==1.7
#9 638.0 cryptography==41.0.3
#9 638.0 Cython==0.29.36
#9 638.0 deprecation==2.1.0
#9 638.0 dill==0.3.1.1
#9 638.0 dnspython==2.4.2
#9 638.0 docker==6.1.3
#9 638.0 docopt==0.6.2
#9 638.0 execnet==2.0.2
#9 638.0 fastavro==1.8.2
#9 638.0 fasteners==0.18
#9 638.0 flatbuffers==23.5.26
#9 638.0 freezegun==1.2.2
#9 638.0 future==0.18.3
#9 638.0 gast==0.4.0
#9 638.0 google-api-core==2.11.1
#9 638.0 google-apitools==0.5.31
#9 638.0 google-auth==2.22.0
#9 638.0 google-auth-httplib2==0.1.0
#9 638.0 google-auth-oauthlib==1.0.0
#9 638.0 google-cloud-aiplatform==1.29.0
#9 638.0 google-cloud-bigquery==3.11.4
#9 638.0 google-cloud-bigquery-storage==2.22.0
#9 638.0 google-cloud-bigtable==2.21.0
#9 638.0 google-cloud-core==2.3.3
#9 638.0 google-cloud-datastore==2.17.0
#9 638.0 google-cloud-dlp==3.12.2
#9 638.0 google-cloud-language==2.10.1
#9 638.0 google-cloud-pubsub==2.18.2
#9 638.0 google-cloud-pubsublite==1.8.3
#9 638.0 google-cloud-recommendations-ai==0.10.4
#9 638.0 google-cloud-resource-manager==1.10.3
#9 638.0 google-cloud-spanner==3.40.0
#9 638.0 google-cloud-storage==2.10.0
#9 638.0 google-cloud-videointelligence==2.11.3
#9 638.0 google-cloud-vision==3.4.4
#9 638.0 google-crc32c==1.5.0
#9 638.0 google-pasta==0.2.0
#9 638.0 google-resumable-media==2.5.0
#9 638.0 googleapis-common-protos==1.60.0
#9 638.0 greenlet==2.0.2
#9 638.0 grpc-google-iam-v1==0.12.6
#9 638.0 grpcio==1.56.2
#9 638.0 grpcio-status==1.56.2
#9 638.0 guppy3==3.1.3
#9 638.0 h5py==3.9.0
#9 638.0 hdfs==2.7.2
#9 638.0 httplib2==0.22.0
#9 638.0 hypothesis==6.82.3
#9 638.0 idna==3.4
#9 638.0 iniconfig==2.0.0
#9 638.0 joblib==1.3.2
#9 638.0 keras==2.13.1
#9 638.0 libclang==16.0.6
#9 638.0 Markdown==3.4.4
#9 638.0 MarkupSafe==2.1.3
#9 638.0 mmh3==4.0.1
#9 638.0 mock==5.1.0
#9 638.0 nltk==3.8.1
#9 638.0 nose==1.3.7
#9 638.0 numpy==1.24.3
#9 638.0 oauth2client==4.1.3
#9 638.0 oauthlib==3.2.2
#9 638.0 objsize==0.6.1
#9 638.0 opt-einsum==3.3.0
#9 638.0 orjson==3.9.2
#9 638.0 overrides==6.5.0
#9 638.0 packaging==23.1
#9 638.0 pandas==1.5.3
#9 638.0 parameterized==0.9.0
#9 638.0 pip==23.2.1
#9 638.0 pluggy==1.2.0
#9 638.0 proto-plus==1.22.3
#9 638.0 protobuf==4.23.4
#9 638.0 psycopg2-binary==2.9.7
#9 638.0 pyarrow==11.0.0
#9 638.0 pyasn1==0.5.0
#9 638.0 pyasn1-modules==0.3.0
#9 638.0 pycparser==2.21
#9 638.0 pydot==1.4.2
#9 638.0 PyHamcrest==2.0.4
#9 638.0 pymongo==4.4.1
#9 638.0 PyMySQL==1.1.0
#9 638.0 pyparsing==3.1.1
#9 638.0 pytest==7.4.0
#9 638.0 pytest-timeout==2.1.0
#9 638.0 pytest-xdist==3.3.1
#9 638.0 python-dateutil==2.8.2
#9 638.0 pytz==2023.3
#9 638.0 PyYAML==6.0.1
#9 638.0 regex==2023.8.8
#9 638.0 requests==2.31.0
#9 638.0 requests-mock==1.11.0
#9 638.0 requests-oauthlib==1.3.1
#9 638.0 rsa==4.9
#9 638.0 scikit-learn==1.3.0
#9 638.0 scipy==1.11.1
#9 638.0 setuptools==68.2.0
#9 638.0 Shapely==1.8.5.post1
#9 638.0 six==1.16.0
#9 638.0 sortedcontainers==2.4.0
#9 638.0 soupsieve==2.4.1
#9 638.0 SQLAlchemy==1.4.49
#9 638.0 sqlparse==0.4.4
#9 638.0 tenacity==8.2.2
#9 638.0 tensorboard==2.13.0
#9 638.0 tensorboard-data-server==0.7.1
#9 638.0 tensorflow==2.13.0
#9 638.0 tensorflow-estimator==2.13.0
#9 638.0 tensorflow-io-gcs-filesystem==0.33.0
#9 638.0 termcolor==2.3.0
#9 638.0 testcontainers==3.7.1
#9 638.0 threadpoolctl==3.2.0
#9 638.0 tqdm==4.66.0
#9 638.0 typing_extensions==4.5.0
#9 638.0 urllib3==1.26.16
#9 638.0 websocket-client==1.6.1
#9 638.0 Werkzeug==2.3.6
#9 638.0 wheel==0.41.2
#9 638.0 wrapt==1.15.0
#9 638.0 zstandard==0.21.0
#9 DONE 642.6s
#10 [third_party_licenses 1/4] COPY target/license_scripts /tmp/license_scripts/
#10 DONE 0.1s
#11 [third_party_licenses 2/4] COPY target/go-licenses/* /opt/apache/beam/third_party_licenses/golang/
#11 DONE 0.1s
#12 [third_party_licenses 3/4] COPY target/license_scripts /tmp/license_scripts/
#12 DONE 0.2s
#13 [third_party_licenses 4/4] RUN if [ "true" = "true" ] ; then pip install 'pip-licenses<5' pyyaml tenacity && python /tmp/license_scripts/pull_licenses_py.py ; fi
#13 2.295 Collecting pip-licenses<5
#13 2.296 Obtaining dependency information for pip-licenses<5 from https://files.pythonhosted.org/packages/25/53/a2c514b9133bed6e7e1bc703f6c89f5bf22f93c92da2ac006afcdf036066/pip_licenses-4.3.2-py3-none-any.whl.metadata
#13 2.357 Downloading pip_licenses-4.3.2-py3-none-any.whl.metadata (31 kB)
#13 2.378 Requirement already satisfied: pyyaml in /usr/local/lib/python3.11/site-packages (6.0.1)
#13 2.380 Requirement already satisfied: tenacity in /usr/local/lib/python3.11/site-packages (8.2.2)
#13 2.452 Collecting prettytable>=2.3.0 (from pip-licenses<5)
#13 2.453 Obtaining dependency information for prettytable>=2.3.0 from https://files.pythonhosted.org/packages/25/1e/4c284713b092ec384fad4399452f43f6446ad9aabc9c0b3c3c0920cc53b6/prettytable-3.8.0-py3-none-any.whl.metadata
#13 2.475 Downloading prettytable-3.8.0-py3-none-any.whl.metadata (26 kB)
#13 2.556 Collecting wcwidth (from prettytable>=2.3.0->pip-licenses<5)
#13 2.573 Downloading wcwidth-0.2.6-py2.py3-none-any.whl (29 kB)
#13 2.608 Downloading pip_licenses-4.3.2-py3-none-any.whl (19 kB)
#13 2.631 Downloading prettytable-3.8.0-py3-none-any.whl (27 kB)
#13 4.444 Installing collected packages: wcwidth, prettytable, pip-licenses
#13 4.635 Successfully installed pip-licenses-4.3.2 prettytable-3.8.0 wcwidth-0.2.6
#13 4.636 WARNING: Running pip as the 'root' user can result in broken permissions and conflicting behaviour with the system package manager. It is recommended to use a virtual environment instead: https://pip.pypa.io/warnings/venv
#13 11.65 INFO:root:Successfully pulled licenses for 129 dependencies
#13 11.66 Skip pulling license for bs4
#13 DONE 13.6s
#14 [stage-2 1/2] COPY --from=third_party_licenses /opt/apache/beam/third_party_licenses /opt/apache/beam/third_party_licenses
#14 DONE 0.2s
#15 [stage-2 2/2] RUN if [ "true" != "true" ] ; then rm -rf /opt/apache/beam/third_party_licenses ; fi
#15 DONE 1.3s
#16 exporting to image
#16 exporting layers
#16 exporting layers 35.3s done
#16 writing image sha256:e5f8f5c8065aa5a6642ac6ba21093332fac699a135f632bead857b270346b86e done
#16 naming to docker.io/apache/beam_python3.11_sdk:2.51.0.dev done
#16 DONE 35.3s
> Task :runners:google-cloud-dataflow-java:buildAndPushDockerPythonContainer
WARNING: `gcloud docker` will not be supported for Docker client versions above 18.03.
As an alternative, use `gcloud auth configure-docker` to configure `docker` to
use `gcloud` as a credential helper, then use `docker` as you would for non-GCR
registries, e.g. `docker pull gcr.io/project-id/my-image`. Add
`--verbosity=error` to silence this warning: `gcloud docker
--verbosity=error -- pull gcr.io/project-id/my-image`.
See: https://cloud.google.com/container-registry/docs/support/deprecation-notices#gcloud-docker
> Task :runners:google-cloud-dataflow-java:setupXVR
> Task :runners:google-cloud-dataflow-java:validatesCrossLanguageRunnerSetup
> Task :runners:google-cloud-dataflow-java:validatesCrossLanguageRunnerPythonUsingSql FAILED
> Task :runners:google-cloud-dataflow-java:cleanupXVR UP-TO-DATE
> Task :runners:google-cloud-dataflow-java:cleanUpDockerPythonImages
WARNING: Successfully resolved tag to sha256, but it is recommended to use sha256 directly.
Tag: [us.gcr.io/apache-beam-testing/java-postcommit-it/python:20230907001737]
- referencing digest: [us.gcr.io/apache-beam-testing/java-postcommit-it/python@sha256:0333cef7204dd619218f7d03c793ce0eb2dd11d66df05551c6f94c5bc9aa87cf]
Deleted [[us.gcr.io/apache-beam-testing/java-postcommit-it/python:20230907001737] (referencing [us.gcr.io/apache-beam-testing/java-postcommit-it/python@sha256:0333cef7204dd619218f7d03c793ce0eb2dd11d66df05551c6f94c5bc9aa87cf])].
> Task :runners:google-cloud-dataflow-java:cleanUpDockerJavaImages
WARNING: Successfully resolved tag to sha256, but it is recommended to use sha256 directly.
Tag: [us.gcr.io/apache-beam-testing/java-postcommit-it/java:20230907001737]
- referencing digest: [us.gcr.io/apache-beam-testing/java-postcommit-it/java@sha256:fc6320e2ed72475cf53ccaaa6ea58f4fed02bcd0aff809d4ee2aa3a8469ceab5]
Deleted [[us.gcr.io/apache-beam-testing/java-postcommit-it/java:20230907001737] (referencing [us.gcr.io/apache-beam-testing/java-postcommit-it/java@sha256:fc6320e2ed72475cf53ccaaa6ea58f4fed02bcd0aff809d4ee2aa3a8469ceab5])].
> Task :runners:google-cloud-dataflow-java:validatesCrossLanguageRunnerCleanup
FAILURE: Build failed with an exception.
* What went wrong:
Execution failed for task ':runners:google-cloud-dataflow-java:validatesCrossLanguageRunnerPythonUsingSql'.
> Process 'command 'sh'' finished with non-zero exit value 1
* Try:
> Run with --stacktrace option to get the stack trace.
> Run with --info or --debug option to get more log output.
* Get more help at https://help.gradle.org
Deprecated Gradle features were used in this build, making it incompatible with Gradle 8.0.
You can use '--warning-mode all' to show the individual deprecation warnings and determine if they come from your own scripts or plugins.
See https://docs.gradle.org/7.6.2/userguide/command_line_interface.html#sec:command_line_warnings
Execution optimizations have been disabled for 1 invalid unit(s) of work during this build to ensure correctness.
Please consult deprecation warnings for more details.
BUILD FAILED in 17m 20s
179 actionable tasks: 119 executed, 54 from cache, 6 up-to-date
Publishing build scan...
https://ge.apache.org/s/2d3oybon4l7a4
Build step 'Invoke Gradle script' changed build result to FAILURE
Build step 'Invoke Gradle script' marked build as failure
---------------------------------------------------------------------
To unsubscribe, e-mail: builds-unsubscribe@beam.apache.org
For additional commands, e-mail: builds-help@beam.apache.org
Build failed in Jenkins: beam_PostCommit_XVR_PythonUsingJavaSQL_Dataflow #2311
Posted by Apache Jenkins Server <je...@builds.apache.org>.
See <https://ci-beam.apache.org/job/beam_PostCommit_XVR_PythonUsingJavaSQL_Dataflow/2311/display/redirect?page=changes>
Changes:
[noreply] Migrate "beam_PreCommit_SQL" Jenkins job to Github Actions (#28336)
------------------------------------------
[...truncated 711.72 KB...]
#9 390.7 removing build/bdist.linux-x86_64/wheel
#9 390.8 Building wheel for apache-beam (setup.py): finished with status 'done'
#9 390.9 Created wheel for apache-beam: filename=apache_beam-2.51.0.dev0-cp311-cp311-linux_x86_64.whl size=15790475 sha256=b1c0257b66e109de2e0e6292afa228eb9f0393d400dece1f1b0fa25887a9bfd9
#9 390.9 Stored in directory: /root/.cache/pip/wheels/1c/f9/b2/4b1eddc5b0ebe3a955a58e43440c937f3642f0b65c975a1cf4
#9 390.9 Successfully built apache-beam
#9 390.9 Installing collected packages: apache-beam
#9 393.9 Successfully installed apache-beam-2.51.0.dev0
#9 393.9 WARNING: Running pip as the 'root' user can result in broken permissions and conflicting behaviour with the system package manager. It is recommended to use a virtual environment instead: https://pip.pypa.io/warnings/venv
#9 395.8 No broken requirements found.
#9 396.5 absl-py==1.4.0
#9 396.5 apache-beam @ file:///opt/apache/beam/tars/apache-beam.tar.gz#sha256=15034acd8cc81ddd6dbe09063d4ebc6142faf7dee77e7072257589fa98283ca1
#9 396.5 astunparse==1.6.3
#9 396.5 attrs==23.1.0
#9 396.5 beautifulsoup4==4.12.2
#9 396.5 bs4==0.0.1
#9 396.5 cachetools==5.3.1
#9 396.5 certifi==2023.7.22
#9 396.5 cffi==1.15.1
#9 396.5 charset-normalizer==3.2.0
#9 396.5 click==8.1.6
#9 396.5 cloudpickle==2.2.1
#9 396.5 crcmod==1.7
#9 396.5 cryptography==41.0.3
#9 396.5 Cython==0.29.36
#9 396.5 deprecation==2.1.0
#9 396.5 dill==0.3.1.1
#9 396.5 dnspython==2.4.2
#9 396.5 docker==6.1.3
#9 396.5 docopt==0.6.2
#9 396.5 execnet==2.0.2
#9 396.5 fastavro==1.8.2
#9 396.5 fasteners==0.18
#9 396.5 flatbuffers==23.5.26
#9 396.5 freezegun==1.2.2
#9 396.5 future==0.18.3
#9 396.5 gast==0.4.0
#9 396.5 google-api-core==2.11.1
#9 396.5 google-apitools==0.5.31
#9 396.5 google-auth==2.22.0
#9 396.5 google-auth-httplib2==0.1.0
#9 396.5 google-auth-oauthlib==1.0.0
#9 396.5 google-cloud-aiplatform==1.29.0
#9 396.5 google-cloud-bigquery==3.11.4
#9 396.5 google-cloud-bigquery-storage==2.22.0
#9 396.5 google-cloud-bigtable==2.21.0
#9 396.5 google-cloud-core==2.3.3
#9 396.5 google-cloud-datastore==2.17.0
#9 396.5 google-cloud-dlp==3.12.2
#9 396.5 google-cloud-language==2.10.1
#9 396.5 google-cloud-pubsub==2.18.2
#9 396.5 google-cloud-pubsublite==1.8.3
#9 396.5 google-cloud-recommendations-ai==0.10.4
#9 396.5 google-cloud-resource-manager==1.10.3
#9 396.5 google-cloud-spanner==3.40.0
#9 396.5 google-cloud-storage==2.10.0
#9 396.5 google-cloud-videointelligence==2.11.3
#9 396.5 google-cloud-vision==3.4.4
#9 396.5 google-crc32c==1.5.0
#9 396.5 google-pasta==0.2.0
#9 396.5 google-resumable-media==2.5.0
#9 396.5 googleapis-common-protos==1.60.0
#9 396.5 greenlet==2.0.2
#9 396.5 grpc-google-iam-v1==0.12.6
#9 396.5 grpcio==1.56.2
#9 396.5 grpcio-status==1.56.2
#9 396.5 guppy3==3.1.3
#9 396.5 h5py==3.9.0
#9 396.5 hdfs==2.7.2
#9 396.5 httplib2==0.22.0
#9 396.5 hypothesis==6.82.3
#9 396.5 idna==3.4
#9 396.5 iniconfig==2.0.0
#9 396.5 joblib==1.3.2
#9 396.5 keras==2.13.1
#9 396.5 libclang==16.0.6
#9 396.5 Markdown==3.4.4
#9 396.5 MarkupSafe==2.1.3
#9 396.5 mmh3==4.0.1
#9 396.5 mock==5.1.0
#9 396.5 nltk==3.8.1
#9 396.5 nose==1.3.7
#9 396.5 numpy==1.24.3
#9 396.5 oauth2client==4.1.3
#9 396.5 oauthlib==3.2.2
#9 396.5 objsize==0.6.1
#9 396.5 opt-einsum==3.3.0
#9 396.5 orjson==3.9.4
#9 396.5 overrides==6.5.0
#9 396.5 packaging==23.1
#9 396.5 pandas==1.5.3
#9 396.5 parameterized==0.9.0
#9 396.5 pip==23.2.1
#9 396.5 pluggy==1.2.0
#9 396.5 proto-plus==1.22.3
#9 396.5 protobuf==4.23.4
#9 396.5 psycopg2-binary==2.9.7
#9 396.5 pyarrow==11.0.0
#9 396.5 pyasn1==0.5.0
#9 396.5 pyasn1-modules==0.3.0
#9 396.5 pycparser==2.21
#9 396.5 pydot==1.4.2
#9 396.5 PyHamcrest==2.0.4
#9 396.5 pymongo==4.4.1
#9 396.5 PyMySQL==1.1.0
#9 396.5 pyparsing==3.1.1
#9 396.5 pytest==7.4.0
#9 396.5 pytest-timeout==2.1.0
#9 396.5 pytest-xdist==3.3.1
#9 396.5 python-dateutil==2.8.2
#9 396.5 pytz==2023.3
#9 396.5 PyYAML==6.0.1
#9 396.5 regex==2023.8.8
#9 396.5 requests==2.31.0
#9 396.5 requests-mock==1.11.0
#9 396.5 requests-oauthlib==1.3.1
#9 396.5 rsa==4.9
#9 396.5 scikit-learn==1.3.0
#9 396.5 scipy==1.11.1
#9 396.5 setuptools==68.1.2
#9 396.5 Shapely==1.8.5.post1
#9 396.5 six==1.16.0
#9 396.5 sortedcontainers==2.4.0
#9 396.5 soupsieve==2.4.1
#9 396.5 SQLAlchemy==1.4.49
#9 396.5 sqlparse==0.4.4
#9 396.5 tenacity==8.2.2
#9 396.5 tensorboard==2.13.0
#9 396.5 tensorboard-data-server==0.7.1
#9 396.5 tensorflow==2.13.0
#9 396.5 tensorflow-estimator==2.13.0
#9 396.5 tensorflow-io-gcs-filesystem==0.33.0
#9 396.5 termcolor==2.3.0
#9 396.5 testcontainers==3.7.1
#9 396.5 threadpoolctl==3.2.0
#9 396.5 tqdm==4.66.0
#9 396.5 typing_extensions==4.5.0
#9 396.5 urllib3==1.26.16
#9 396.5 websocket-client==1.6.1
#9 396.5 Werkzeug==2.3.6
#9 396.5 wheel==0.41.2
#9 396.5 wrapt==1.15.0
#9 396.5 zstandard==0.21.0
#9 DONE 429.9s
#10 [third_party_licenses 1/4] COPY target/license_scripts /tmp/license_scripts/
#10 DONE 10.9s
#11 [third_party_licenses 2/4] COPY target/go-licenses/* /opt/apache/beam/third_party_licenses/golang/
#11 DONE 1.3s
#12 [third_party_licenses 3/4] COPY target/license_scripts /tmp/license_scripts/
#12 DONE 0.7s
#13 [third_party_licenses 4/4] RUN if [ "true" = "true" ] ; then pip install 'pip-licenses<5' pyyaml tenacity && python /tmp/license_scripts/pull_licenses_py.py ; fi
#13 1.072 Collecting pip-licenses<5
#13 1.073 Obtaining dependency information for pip-licenses<5 from https://files.pythonhosted.org/packages/25/53/a2c514b9133bed6e7e1bc703f6c89f5bf22f93c92da2ac006afcdf036066/pip_licenses-4.3.2-py3-none-any.whl.metadata
#13 1.125 Downloading pip_licenses-4.3.2-py3-none-any.whl.metadata (31 kB)
#13 1.142 Requirement already satisfied: pyyaml in /usr/local/lib/python3.11/site-packages (6.0.1)
#13 1.144 Requirement already satisfied: tenacity in /usr/local/lib/python3.11/site-packages (8.2.2)
#13 1.194 Collecting prettytable>=2.3.0 (from pip-licenses<5)
#13 1.195 Obtaining dependency information for prettytable>=2.3.0 from https://files.pythonhosted.org/packages/25/1e/4c284713b092ec384fad4399452f43f6446ad9aabc9c0b3c3c0920cc53b6/prettytable-3.8.0-py3-none-any.whl.metadata
#13 1.210 Downloading prettytable-3.8.0-py3-none-any.whl.metadata (26 kB)
#13 1.267 Collecting wcwidth (from prettytable>=2.3.0->pip-licenses<5)
#13 1.281 Downloading wcwidth-0.2.6-py2.py3-none-any.whl (29 kB)
#13 1.312 Downloading pip_licenses-4.3.2-py3-none-any.whl (19 kB)
#13 1.337 Downloading prettytable-3.8.0-py3-none-any.whl (27 kB)
#13 2.437 Installing collected packages: wcwidth, prettytable, pip-licenses
#13 2.565 Successfully installed pip-licenses-4.3.2 prettytable-3.8.0 wcwidth-0.2.6
#13 2.566 WARNING: Running pip as the 'root' user can result in broken permissions and conflicting behaviour with the system package manager. It is recommended to use a virtual environment instead: https://pip.pypa.io/warnings/venv
#13 9.875 INFO:root:Successfully pulled licenses for 129 dependencies
#13 9.875 Skip pulling license for bs4
#13 DONE 21.7s
#14 [stage-2 1/2] COPY --from=third_party_licenses /opt/apache/beam/third_party_licenses /opt/apache/beam/third_party_licenses
#14 DONE 0.2s
#15 [stage-2 2/2] RUN if [ "true" != "true" ] ; then rm -rf /opt/apache/beam/third_party_licenses ; fi
#15 DONE 0.3s
#16 exporting to image
#16 exporting layers
#16 exporting layers 22.8s done
#16 writing image sha256:0cc4167abfb84766e2905531cf57ee437497345e5574c37b6ba140d11993ff5b done
#16 naming to docker.io/apache/beam_python3.11_sdk:2.51.0.dev
#16 naming to docker.io/apache/beam_python3.11_sdk:2.51.0.dev done
#16 DONE 22.8s
> Task :runners:google-cloud-dataflow-java:buildAndPushDockerPythonContainer
WARNING: `gcloud docker` will not be supported for Docker client versions above 18.03.
As an alternative, use `gcloud auth configure-docker` to configure `docker` to
use `gcloud` as a credential helper, then use `docker` as you would for non-GCR
registries, e.g. `docker pull gcr.io/project-id/my-image`. Add
`--verbosity=error` to silence this warning: `gcloud docker
--verbosity=error -- pull gcr.io/project-id/my-image`.
See: https://cloud.google.com/container-registry/docs/support/deprecation-notices#gcloud-docker
> Task :runners:google-cloud-dataflow-java:setupXVR
> Task :runners:google-cloud-dataflow-java:validatesCrossLanguageRunnerSetup
> Task :runners:google-cloud-dataflow-java:validatesCrossLanguageRunnerPythonUsingSql FAILED
> Task :runners:google-cloud-dataflow-java:cleanupXVR UP-TO-DATE
> Task :runners:google-cloud-dataflow-java:cleanUpDockerPythonImages
WARNING: Successfully resolved tag to sha256, but it is recommended to use sha256 directly.
Tag: [us.gcr.io/apache-beam-testing/java-postcommit-it/python:20230906191459]
- referencing digest: [us.gcr.io/apache-beam-testing/java-postcommit-it/python@sha256:bfbc71265afe446c2e6092659487f24975e1a15eefc0940fabb10187e10d1d32]
Deleted [[us.gcr.io/apache-beam-testing/java-postcommit-it/python:20230906191459] (referencing [us.gcr.io/apache-beam-testing/java-postcommit-it/python@sha256:bfbc71265afe446c2e6092659487f24975e1a15eefc0940fabb10187e10d1d32])].
> Task :runners:google-cloud-dataflow-java:cleanUpDockerJavaImages
WARNING: Successfully resolved tag to sha256, but it is recommended to use sha256 directly.
Tag: [us.gcr.io/apache-beam-testing/java-postcommit-it/java:20230906191459]
- referencing digest: [us.gcr.io/apache-beam-testing/java-postcommit-it/java@sha256:68778f55f0c9523ac6a52404f35bdfd707b18753a8d2fb97089cf6e02f27eb5f]
Deleted [[us.gcr.io/apache-beam-testing/java-postcommit-it/java:20230906191459] (referencing [us.gcr.io/apache-beam-testing/java-postcommit-it/java@sha256:68778f55f0c9523ac6a52404f35bdfd707b18753a8d2fb97089cf6e02f27eb5f])].
> Task :runners:google-cloud-dataflow-java:validatesCrossLanguageRunnerCleanup
FAILURE: Build failed with an exception.
* What went wrong:
Execution failed for task ':runners:google-cloud-dataflow-java:validatesCrossLanguageRunnerPythonUsingSql'.
> Process 'command 'sh'' finished with non-zero exit value 1
* Try:
> Run with --stacktrace option to get the stack trace.
> Run with --info or --debug option to get more log output.
* Get more help at https://help.gradle.org
Deprecated Gradle features were used in this build, making it incompatible with Gradle 8.0.
You can use '--warning-mode all' to show the individual deprecation warnings and determine if they come from your own scripts or plugins.
See https://docs.gradle.org/7.6.2/userguide/command_line_interface.html#sec:command_line_warnings
Execution optimizations have been disabled for 1 invalid unit(s) of work during this build to ensure correctness.
Please consult deprecation warnings for more details.
BUILD FAILED in 13m 52s
179 actionable tasks: 119 executed, 54 from cache, 6 up-to-date
Publishing build scan...
https://ge.apache.org/s/p37ah5cvkpnje
Build step 'Invoke Gradle script' changed build result to FAILURE
Build step 'Invoke Gradle script' marked build as failure
---------------------------------------------------------------------
To unsubscribe, e-mail: builds-unsubscribe@beam.apache.org
For additional commands, e-mail: builds-help@beam.apache.org