You are viewing a plain text version of this content. The canonical link for it is here.
Posted to dev@brooklyn.apache.org by Apache Jenkins Server <je...@builds.apache.org> on 2019/05/19 15:53:38 UTC

Build failed in Jenkins: brooklyn-dist-master-docker #320

See <https://builds.apache.org/job/brooklyn-dist-master-docker/320/display/redirect>

------------------------------------------
[...truncated 3.90 MB...]
[INFO]               enricher.suppressDuplicates[ConfigKey:java.lang.Boolean] = true
[INFO]               enricher.targetSensor[ConfigKey:org.apache.brooklyn.api.sensor.Sensor<?>] = Sensor: service.isUp (java.lang.Boolean)
[INFO]               enricher.transformation[ConfigKey:com.google.common.base.Function<?, ?>] = if[{Predicates.not(Predicates.isNull())=forPredicate(Predicates.equalTo(0)(sizeFunction(keys)))}]-else[UNCHANGED]
[INFO]           ComputeServiceState{uniqueTag=service.state.actual, running=true, entity=TestEffectorImpl{id=pkc998demz}, id=i48mr1ermw}
[INFO]     TestSensorImpl{id=cjs24yrwkx} cjs24yrwkx
[INFO]         displayName = TestSensor:cjs2
[INFO]         locations = []
[INFO]         assert = {equalTo=myEffector(myVal)}
[INFO]         sensor = lastCall
[INFO]         targetId = sample
[INFO]         application.id: hiikbbly0m
[INFO]         entity.id: cjs24yrwkx
[INFO]         service.isUp: true
[INFO]         service.state: running
[INFO]         service.state.expected: running @ 1558281184646 / Sun May 19 15:53:04 GMT 2019
[INFO]         target: MySampleImpl{id=xlxjpj0u06}
[INFO]         test.target.entity.id: xlxjpj0u06
[INFO]         test.target.entity.name: MySample:xlxj
[INFO]         test.target.entity.type: com.acme.sample.brooklyn.MySample
[INFO]         Enrichers:
[INFO]           Transformer{uniqueTag=service.isUp if no service.notUp.indicators, running=true, entity=TestSensorImpl{id=cjs24yrwkx}, id=fgtgb69k4k}
[INFO]               enricher.sourceSensor[ConfigKey:org.apache.brooklyn.api.sensor.Sensor<?>] = Sensor: service.notUp.indicators (java.util.Map)
[INFO]               enricher.suppressDuplicates[ConfigKey:java.lang.Boolean] = true
[INFO]               enricher.targetSensor[ConfigKey:org.apache.brooklyn.api.sensor.Sensor<?>] = Sensor: service.isUp (java.lang.Boolean)
[INFO]               enricher.transformation[ConfigKey:com.google.common.base.Function<?, ?>] = if[{Predicates.not(Predicates.isNull())=forPredicate(Predicates.equalTo(0)(sizeFunction(keys)))}]-else[UNCHANGED]
[INFO]           ComputeServiceState{uniqueTag=service.state.actual, running=true, entity=TestSensorImpl{id=cjs24yrwkx}, id=v5zier88fz}
[INFO]     TestEffectorImpl{id=mf50wa6rsw} mf50wa6rsw
[INFO]         displayName = TestEffector:mf50
[INFO]         locations = []
[INFO]         effector = stop
[INFO]         targetId = sample
[INFO]         application.id: hiikbbly0m
[INFO]         entity.id: mf50wa6rsw
[INFO]         service.isUp: true
[INFO]         service.state: running
[INFO]         service.state.expected: running @ 1558281184656 / Sun May 19 15:53:04 GMT 2019
[INFO]         target: MySampleImpl{id=xlxjpj0u06}
[INFO]         test.target.entity.id: xlxjpj0u06
[INFO]         test.target.entity.name: MySample:xlxj
[INFO]         test.target.entity.type: com.acme.sample.brooklyn.MySample
[INFO]         Enrichers:
[INFO]           Transformer{uniqueTag=service.isUp if no service.notUp.indicators, running=true, entity=TestEffectorImpl{id=mf50wa6rsw}, id=stb67yaiu1}
[INFO]               enricher.sourceSensor[ConfigKey:org.apache.brooklyn.api.sensor.Sensor<?>] = Sensor: service.notUp.indicators (java.util.Map)
[INFO]               enricher.suppressDuplicates[ConfigKey:java.lang.Boolean] = true
[INFO]               enricher.targetSensor[ConfigKey:org.apache.brooklyn.api.sensor.Sensor<?>] = Sensor: service.isUp (java.lang.Boolean)
[INFO]               enricher.transformation[ConfigKey:com.google.common.base.Function<?, ?>] = if[{Predicates.not(Predicates.isNull())=forPredicate(Predicates.equalTo(0)(sizeFunction(keys)))}]-else[UNCHANGED]
[INFO]           ComputeServiceState{uniqueTag=service.state.actual, running=true, entity=TestEffectorImpl{id=mf50wa6rsw}, id=imv8j1i93t}
[INFO]     TestSensorImpl{id=p5ooqjqelv} p5ooqjqelv
[INFO]         displayName = TestSensor:p5oo
[INFO]         locations = []
[INFO]         assert = {equalTo=false}
[INFO]         sensor = service.isUp
[INFO]         targetId = sample
[INFO]         timeout = 10s
[INFO]         application.id: hiikbbly0m
[INFO]         entity.id: p5ooqjqelv
[INFO]         service.isUp: true
[INFO]         service.state: running
[INFO]         service.state.expected: running @ 1558281184694 / Sun May 19 15:53:04 GMT 2019
[INFO]         target: MySampleImpl{id=xlxjpj0u06}
[INFO]         test.target.entity.id: xlxjpj0u06
[INFO]         test.target.entity.name: MySample:xlxj
[INFO]         test.target.entity.type: com.acme.sample.brooklyn.MySample
[INFO]         Enrichers:
[INFO]           Transformer{uniqueTag=service.isUp if no service.notUp.indicators, running=true, entity=TestSensorImpl{id=p5ooqjqelv}, id=cr9xts6e9t}
[INFO]               enricher.sourceSensor[ConfigKey:org.apache.brooklyn.api.sensor.Sensor<?>] = Sensor: service.notUp.indicators (java.util.Map)
[INFO]               enricher.suppressDuplicates[ConfigKey:java.lang.Boolean] = true
[INFO]               enricher.targetSensor[ConfigKey:org.apache.brooklyn.api.sensor.Sensor<?>] = Sensor: service.isUp (java.lang.Boolean)
[INFO]               enricher.transformation[ConfigKey:com.google.common.base.Function<?, ?>] = if[{Predicates.not(Predicates.isNull())=forPredicate(Predicates.equalTo(0)(sizeFunction(keys)))}]-else[UNCHANGED]
[INFO]           ComputeServiceState{uniqueTag=service.state.actual, running=true, entity=TestSensorImpl{id=p5ooqjqelv}, id=ofpqv1epjb}
[INFO] 2019-05-19 15:53:04,834 INFO  - TESTNG PASSED: "Surefire test" - com.acme.sample.brooklyn.MySampleYamlTest.testUsingTestFramework() finished in 941 ms
[INFO] 2019-05-19 15:53:04,840 INFO  - TESTNG INVOKING CONFIGURATION: "Surefire test" - @AfterMethod org.apache.brooklyn.camp.brooklyn.AbstractYamlTest.tearDown()
[INFO] 2019-05-19 15:53:04,855 INFO  JBXYUojs-[hiikbbly0m] Stopping application BasicApplicationImpl{id=hiikbbly0m}
[INFO] 2019-05-19 15:53:04,861 INFO  tdqiF7lx-[hiikbbly0m,xlxjpj0u06] MySampleImpl.stop()
[INFO] 2019-05-19 15:53:04,924 INFO  JBXYUojs-[hiikbbly0m] Stopped application BasicApplicationImpl{id=hiikbbly0m}
[INFO] 2019-05-19 15:53:04,960 INFO  - TESTNG PASSED CONFIGURATION: "Surefire test" - @AfterMethod org.apache.brooklyn.camp.brooklyn.AbstractYamlTest.tearDown() finished in 120 ms
[INFO] 2019-05-19 15:53:04,964 INFO  - TESTNG INVOKING CONFIGURATION: "Surefire test" - @BeforeMethod org.apache.brooklyn.core.test.BrooklynAppUnitTestSupport.setUp()
[INFO] 2019-05-19 15:53:04,967 INFO  - Added external config supplier named 'brooklyn-demo-sample': org.apache.brooklyn.core.config.external.InPlaceExternalConfigSupplier@22db8f4
[INFO] 2019-05-19 15:53:05,125 INFO  - TESTNG PASSED CONFIGURATION: "Surefire test" - @BeforeMethod org.apache.brooklyn.core.test.BrooklynAppUnitTestSupport.setUp() finished in 161 ms
[INFO] 2019-05-19 15:53:05,127 INFO  - TESTNG INVOKING: "Surefire test" - com.acme.sample.brooklyn.MySampleTest.testEntity()
[INFO] 2019-05-19 15:53:05,185 INFO  - MySampleImpl.init() with config myConfVal
[INFO] 2019-05-19 15:53:05,198 INFO  qEyfVr6Y-[amiepj5wwr,cvg84lp7c5] MySampleImpl.start([])
[INFO] 2019-05-19 15:53:05,199 WARN  qEyfVr6Y-[amiepj5wwr,cvg84lp7c5] Setting MySampleImpl{id=cvg84lp7c5} on-fire due to problems when expected running, up=false, not-up-indicators: {}
[INFO] 2019-05-19 15:53:05,252 INFO  YhB5D1dM-[amiepj5wwr,cvg84lp7c5] MySampleImpl.myEffector(myArgVal)
[INFO] 2019-05-19 15:53:05,258 INFO  O0E22PAR-[amiepj5wwr,cvg84lp7c5] MySampleImpl.stop()
[INFO] 2019-05-19 15:53:35,269 INFO  - succeedsEventually exceeded max attempts or timeout - 75 attempts lasting 30001 ms, for RunnableAdapter(org.apache.brooklyn.core.entity.EntityAsserts$1@33aa93c)
[INFO] 2019-05-19 15:53:35,269 INFO  - failed succeeds-eventually, 75 attempts, 30001ms elapsed (rethrowing): java.lang.AssertionError: entity=MySampleImpl{id=cvg84lp7c5}; attribute=Sensor: service.isUp (java.lang.Boolean) expected [false] but found [true]
[INFO] 2019-05-19 15:53:35,274 INFO  - TESTNG FAILED: "Surefire test" - com.acme.sample.brooklyn.MySampleTest.testEntity() finished in 30145 ms
[INFO] java.lang.AssertionError: failed succeeds-eventually, 75 attempts, 30001ms elapsed: AssertionError: entity=MySampleImpl{id=cvg84lp7c5}; attribute=Sensor: service.isUp (java.lang.Boolean) expected [false] but found [true]
[INFO] 	at org.apache.brooklyn.test.Asserts.succeedsEventually(Asserts.java:1009)
[INFO] 	at org.apache.brooklyn.test.Asserts.succeedsEventually(Asserts.java:892)
[INFO] 	at org.apache.brooklyn.core.entity.EntityAsserts.assertAttributeEqualsEventually(EntityAsserts.java:71)
[INFO] 	at org.apache.brooklyn.core.entity.EntityAsserts.assertAttributeEqualsEventually(EntityAsserts.java:66)
[INFO] 	at com.acme.sample.brooklyn.MySampleTest.testEntity(MySampleTest.java:33)
[INFO] Caused by: java.lang.AssertionError: entity=MySampleImpl{id=cvg84lp7c5}; attribute=Sensor: service.isUp (java.lang.Boolean) expected [false] but found [true]
[INFO] 	at org.apache.brooklyn.test.Asserts.fail(Asserts.java:755)
[INFO] 	at org.apache.brooklyn.test.Asserts.failNotEquals(Asserts.java:145)
[INFO] 	at org.apache.brooklyn.test.Asserts.assertEquals(Asserts.java:467)
[INFO] 	at org.apache.brooklyn.core.entity.EntityAsserts.assertAttributeEquals(EntityAsserts.java:58)
[INFO] 	at org.apache.brooklyn.core.entity.EntityAsserts$1.run(EntityAsserts.java:74)
[INFO] 	at org.apache.brooklyn.test.Asserts$RunnableAdapter.call(Asserts.java:1367)
[INFO] 	at org.apache.brooklyn.test.Asserts.succeedsEventually(Asserts.java:970)
[INFO] 	... 33 more
[INFO] 2019-05-19 15:53:35,278 INFO  - TESTNG INVOKING CONFIGURATION: "Surefire test" - @AfterMethod org.apache.brooklyn.core.test.BrooklynMgmtUnitTestSupport.tearDown()
[INFO] 2019-05-19 15:53:35,289 INFO  - TESTNG PASSED CONFIGURATION: "Surefire test" - @AfterMethod org.apache.brooklyn.core.test.BrooklynMgmtUnitTestSupport.tearDown() finished in 11 ms
[INFO] 2019-05-19 15:53:35,315 INFO  - TESTNG 
[INFO] ===============================================
[INFO]     Surefire test
[INFO]     Tests run: 3, Failures: 1, Skips: 0
[INFO] ===============================================
[INFO] Tests run: 3, Failures: 1, Errors: 0, Skipped: 0, Time elapsed: 36.736 sec <<< FAILURE! - in TestSuite
[INFO] testEntity(com.acme.sample.brooklyn.MySampleTest)  Time elapsed: 30.151 sec  <<< FAILURE!
[INFO] java.lang.AssertionError: failed succeeds-eventually, 75 attempts, 30001ms elapsed: AssertionError: entity=MySampleImpl{id=cvg84lp7c5}; attribute=Sensor: service.isUp (java.lang.Boolean) expected [false] but found [true]
[INFO] 	at org.apache.brooklyn.test.Asserts.fail(Asserts.java:755)
[INFO] 	at org.apache.brooklyn.test.Asserts.failNotEquals(Asserts.java:145)
[INFO] 	at org.apache.brooklyn.test.Asserts.assertEquals(Asserts.java:467)
[INFO] 	at org.apache.brooklyn.core.entity.EntityAsserts.assertAttributeEquals(EntityAsserts.java:58)
[INFO] 	at org.apache.brooklyn.core.entity.EntityAsserts$1.run(EntityAsserts.java:74)
[INFO] 	at org.apache.brooklyn.test.Asserts$RunnableAdapter.call(Asserts.java:1367)
[INFO] 	at org.apache.brooklyn.test.Asserts.succeedsEventually(Asserts.java:970)
[INFO] 	at org.apache.brooklyn.test.Asserts.succeedsEventually(Asserts.java:892)
[INFO] 	at org.apache.brooklyn.core.entity.EntityAsserts.assertAttributeEqualsEventually(EntityAsserts.java:71)
[INFO] 	at org.apache.brooklyn.core.entity.EntityAsserts.assertAttributeEqualsEventually(EntityAsserts.java:66)
[INFO] 	at com.acme.sample.brooklyn.MySampleTest.testEntity(MySampleTest.java:33)
[INFO] 
[INFO] 
[INFO] Results :
[INFO] 
[INFO] Failed tests: 
[INFO]   MySampleTest.testEntity:33 failed succeeds-eventually, 75 attempts, 30001ms elapsed: AssertionError: entity=MySampleImpl{id=cvg84lp7c5}; attribute=Sensor: service.isUp (java.lang.Boolean) expected [false] but found [true]
[INFO] 
[INFO] Tests run: 3, Failures: 1, Errors: 0, Skipped: 0
[INFO] 
[INFO] [INFO] ------------------------------------------------------------------------
[INFO] [INFO] BUILD FAILURE
[INFO] [INFO] ------------------------------------------------------------------------
[INFO] [INFO] Total time: 01:37 min
[INFO] [INFO] Finished at: 2019-05-19T15:53:35Z
[INFO] [INFO] Final Memory: 60M/612M
[INFO] [INFO] ------------------------------------------------------------------------
[INFO] [ERROR] Failed to execute goal org.apache.maven.plugins:maven-surefire-plugin:2.18.1:test (default-test) on project brooklyn-sample: There are test failures.
[INFO] [ERROR] 
[INFO] [ERROR] Please refer to /usr/build/archetypes/quickstart/target/test-classes/projects/integration-test-1/project/brooklyn-sample/target/surefire-reports for the individual test results.
[INFO] [ERROR] -> [Help 1]
[INFO] org.apache.maven.lifecycle.LifecycleExecutionException: Failed to execute goal org.apache.maven.plugins:maven-surefire-plugin:2.18.1:test (default-test) on project brooklyn-sample: There are test failures.
[INFO] 
[INFO] Please refer to /usr/build/archetypes/quickstart/target/test-classes/projects/integration-test-1/project/brooklyn-sample/target/surefire-reports for the individual test results.
[INFO]     at org.apache.maven.lifecycle.internal.MojoExecutor.execute (MojoExecutor.java:213)
[INFO]     at org.apache.maven.lifecycle.internal.MojoExecutor.execute (MojoExecutor.java:154)
[INFO]     at org.apache.maven.lifecycle.internal.MojoExecutor.execute (MojoExecutor.java:146)
[INFO]     at org.apache.maven.lifecycle.internal.LifecycleModuleBuilder.buildProject (LifecycleModuleBuilder.java:117)
[INFO]     at org.apache.maven.lifecycle.internal.LifecycleModuleBuilder.buildProject (LifecycleModuleBuilder.java:81)
[INFO]     at org.apache.maven.lifecycle.internal.builder.singlethreaded.SingleThreadedBuilder.build (SingleThreadedBuilder.java:51)
[INFO]     at org.apache.maven.lifecycle.internal.LifecycleStarter.execute (LifecycleStarter.java:128)
[INFO]     at org.apache.maven.DefaultMaven.doExecute (DefaultMaven.java:309)
[INFO]     at org.apache.maven.DefaultMaven.doExecute (DefaultMaven.java:194)
[INFO]     at org.apache.maven.DefaultMaven.execute (DefaultMaven.java:107)
[INFO]     at org.apache.maven.cli.MavenCli.execute (MavenCli.java:955)
[INFO]     at org.apache.maven.cli.MavenCli.doMain (MavenCli.java:290)
[INFO]     at org.apache.maven.cli.MavenCli.main (MavenCli.java:194)
[INFO]     at sun.reflect.NativeMethodAccessorImpl.invoke0 (Native Method)
[INFO]     at sun.reflect.NativeMethodAccessorImpl.invoke (NativeMethodAccessorImpl.java:62)
[INFO]     at sun.reflect.DelegatingMethodAccessorImpl.invoke (DelegatingMethodAccessorImpl.java:43)
[INFO]     at java.lang.reflect.Method.invoke (Method.java:498)
[INFO]     at org.codehaus.plexus.classworlds.launcher.Launcher.launchEnhanced (Launcher.java:289)
[INFO]     at org.codehaus.plexus.classworlds.launcher.Launcher.launch (Launcher.java:229)
[INFO]     at org.codehaus.plexus.classworlds.launcher.Launcher.mainWithExitCode (Launcher.java:415)
[INFO]     at org.codehaus.plexus.classworlds.launcher.Launcher.main (Launcher.java:356)
[INFO] Caused by: org.apache.maven.plugin.MojoFailureException: There are test failures.
[INFO] 
[INFO] Please refer to /usr/build/archetypes/quickstart/target/test-classes/projects/integration-test-1/project/brooklyn-sample/target/surefire-reports for the individual test results.
[INFO]     at org.apache.maven.plugin.surefire.SurefireHelper.reportExecution (SurefireHelper.java:82)
[INFO]     at org.apache.maven.plugin.surefire.SurefirePlugin.handleSummary (SurefirePlugin.java:254)
[INFO]     at org.apache.maven.plugin.surefire.AbstractSurefireMojo.executeAfterPreconditionsChecked (AbstractSurefireMojo.java:854)
[INFO]     at org.apache.maven.plugin.surefire.AbstractSurefireMojo.execute (AbstractSurefireMojo.java:722)
[INFO]     at org.apache.maven.plugin.DefaultBuildPluginManager.executeMojo (DefaultBuildPluginManager.java:134)
[INFO]     at org.apache.maven.lifecycle.internal.MojoExecutor.execute (MojoExecutor.java:208)
[INFO]     at org.apache.maven.lifecycle.internal.MojoExecutor.execute (MojoExecutor.java:154)
[INFO]     at org.apache.maven.lifecycle.internal.MojoExecutor.execute (MojoExecutor.java:146)
[INFO]     at org.apache.maven.lifecycle.internal.LifecycleModuleBuilder.buildProject (LifecycleModuleBuilder.java:117)
[INFO]     at org.apache.maven.lifecycle.internal.LifecycleModuleBuilder.buildProject (LifecycleModuleBuilder.java:81)
[INFO]     at org.apache.maven.lifecycle.internal.builder.singlethreaded.SingleThreadedBuilder.build (SingleThreadedBuilder.java:51)
[INFO]     at org.apache.maven.lifecycle.internal.LifecycleStarter.execute (LifecycleStarter.java:128)
[INFO]     at org.apache.maven.DefaultMaven.doExecute (DefaultMaven.java:309)
[INFO]     at org.apache.maven.DefaultMaven.doExecute (DefaultMaven.java:194)
[INFO]     at org.apache.maven.DefaultMaven.execute (DefaultMaven.java:107)
[INFO]     at org.apache.maven.cli.MavenCli.execute (MavenCli.java:955)
[INFO]     at org.apache.maven.cli.MavenCli.doMain (MavenCli.java:290)
[INFO]     at org.apache.maven.cli.MavenCli.main (MavenCli.java:194)
[INFO]     at sun.reflect.NativeMethodAccessorImpl.invoke0 (Native Method)
[INFO]     at sun.reflect.NativeMethodAccessorImpl.invoke (NativeMethodAccessorImpl.java:62)
[INFO]     at sun.reflect.DelegatingMethodAccessorImpl.invoke (DelegatingMethodAccessorImpl.java:43)
[INFO]     at java.lang.reflect.Method.invoke (Method.java:498)
[INFO]     at org.codehaus.plexus.classworlds.launcher.Launcher.launchEnhanced (Launcher.java:289)
[INFO]     at org.codehaus.plexus.classworlds.launcher.Launcher.launch (Launcher.java:229)
[INFO]     at org.codehaus.plexus.classworlds.launcher.Launcher.mainWithExitCode (Launcher.java:415)
[INFO]     at org.codehaus.plexus.classworlds.launcher.Launcher.main (Launcher.java:356)
[INFO] [ERROR] 
[INFO] [ERROR] Re-run Maven using the -X switch to enable full debug logging.
[INFO] [ERROR] 
[INFO] [ERROR] For more information about the errors and possible solutions, please read the following articles:
[INFO] [ERROR] [Help 1] http://cwiki.apache.org/confluence/display/MAVEN/MojoFailureException
[INFO] Post-archetype-generation invoker exit code: 1
[INFO] ------------------------------------------------------------------------
[INFO] Reactor Summary:
[INFO] 
[INFO] Brooklyn Downstream Project Parent ................. SUCCESS [ 20.862 s]
[INFO] Brooklyn Dist Root ................................. SUCCESS [  9.388 s]
[INFO] Brooklyn All Things ................................ SUCCESS [02:07 min]
[INFO] Brooklyn Distribution .............................. SUCCESS [ 35.987 s]
[INFO] Brooklyn Karaf Distribution Parent ................. SUCCESS [  0.183 s]
[INFO] Brooklyn Karaf Server Configuration ................ SUCCESS [  1.343 s]
[INFO] Brooklyn Dist Karaf Features ....................... SUCCESS [  3.229 s]
[INFO] Brooklyn Karaf Distribution ........................ SUCCESS [02:10 min]
[INFO] Brooklyn Karaf pax-exam itest ...................... SUCCESS [04:43 min]
[INFO] Brooklyn Vagrant Getting Started Environment ....... SUCCESS [  0.272 s]
[INFO] Brooklyn Quick-Start Project Archetype ............. FAILURE [01:43 min]
[INFO] Brooklyn Shared Package Files ...................... SKIPPED
[INFO] Brooklyn RPM Package ............................... SKIPPED
[INFO] Brooklyn DEB Package ............................... SKIPPED
[INFO] Brooklyn Docker Image .............................. SKIPPED
[INFO] ------------------------------------------------------------------------
[INFO] BUILD FAILURE
[INFO] ------------------------------------------------------------------------
[INFO] Total time: 12:16 min
[INFO] Finished at: 2019-05-19T15:53:36Z
[INFO] Final Memory: 107M/809M
[INFO] ------------------------------------------------------------------------
[ERROR] Failed to execute goal org.apache.maven.plugins:maven-archetype-plugin:2.3:integration-test (default-integration-test) on project brooklyn-archetype-quickstart: 
[ERROR] Archetype IT 'integration-test-1' failed: Execution failure: exit code = 1
[ERROR] -> [Help 1]
[ERROR] 
[ERROR] To see the full stack trace of the errors, re-run Maven with the -e switch.
[ERROR] Re-run Maven using the -X switch to enable full debug logging.
[ERROR] 
[ERROR] For more information about the errors and possible solutions, please read the following articles:
[ERROR] [Help 1] http://cwiki.apache.org/confluence/display/MAVEN/MojoExecutionException
[ERROR] 
[ERROR] After correcting the problems, you can resume the build with the command
[ERROR]   mvn <goals> -rf :brooklyn-archetype-quickstart
Build step 'Execute shell' marked build as failure
Recording test results
TestNG Reports Processing: START
Looking for TestNG results report in workspace using pattern: **/testng-results.xml
Saving reports...
Processing '/x1/jenkins/jenkins-home/jobs/brooklyn-dist-master-docker/builds/320/testng/testng-results-1.xml'
Processing '/x1/jenkins/jenkins-home/jobs/brooklyn-dist-master-docker/builds/320/testng/testng-results.xml'
33.333332% of tests failed, which exceeded threshold of 0%. Marking build as UNSTABLE
TestNG Reports Processing: FINISH

Jenkins build is back to normal : brooklyn-dist-master-docker #321

Posted by Apache Jenkins Server <je...@builds.apache.org>.
See <https://builds.apache.org/job/brooklyn-dist-master-docker/321/display/redirect>