You are viewing a plain text version of this content. The canonical link for it is here.
Posted to builds@beam.apache.org by Apache Jenkins Server <je...@builds.apache.org> on 2023/02/12 11:02:26 UTC

Build failed in Jenkins: beam_PostCommit_Python37 #6319

See <https://ci-beam.apache.org/job/beam_PostCommit_Python37/6319/display/redirect>

Changes:


------------------------------------------
[...truncated 16.09 MB...]
    self.table_reference.projectId = pcoll.pipeline.options.view_as(

apache_beam/examples/cookbook/bigquery_tornadoes_it_test.py: 1 warning
apache_beam/io/gcp/bigquery_file_loads_test.py: 3 warnings
apache_beam/io/gcp/bigquery_write_it_test.py: 3 warnings
apache_beam/io/gcp/bigquery_test.py: 3 warnings
apache_beam/io/gcp/big_query_query_to_table_it_test.py: 4 warnings
  <https://ci-beam.apache.org/job/beam_PostCommit_Python37/ws/src/sdks/python/apache_beam/io/gcp/bigquery_file_loads.py>:1166: BeamDeprecationWarning: options is deprecated since First stable release. References to <pipeline>.options will not be supported
    self.project = self.project or p.options.view_as(GoogleCloudOptions).project

apache_beam/examples/cookbook/bigquery_tornadoes_it_test.py: 1 warning
apache_beam/examples/complete/game/hourly_team_score_it_test.py: 1 warning
apache_beam/io/gcp/bigquery_file_loads_test.py: 3 warnings
apache_beam/io/gcp/bigquery_write_it_test.py: 3 warnings
apache_beam/io/gcp/bigquery_test.py: 3 warnings
apache_beam/io/gcp/big_query_query_to_table_it_test.py: 4 warnings
  <https://ci-beam.apache.org/job/beam_PostCommit_Python37/ws/src/sdks/python/apache_beam/io/gcp/bigquery_file_loads.py>:1173: BeamDeprecationWarning: options is deprecated since First stable release. References to <pipeline>.options will not be supported
    temp_location = p.options.view_as(GoogleCloudOptions).temp_location

apache_beam/examples/cookbook/bigquery_tornadoes_it_test.py: 1 warning
apache_beam/examples/complete/game/hourly_team_score_it_test.py: 1 warning
apache_beam/io/gcp/bigquery_file_loads_test.py: 3 warnings
apache_beam/io/gcp/bigquery_write_it_test.py: 3 warnings
apache_beam/io/gcp/bigquery_test.py: 3 warnings
apache_beam/io/gcp/big_query_query_to_table_it_test.py: 4 warnings
  <https://ci-beam.apache.org/job/beam_PostCommit_Python37/ws/src/sdks/python/apache_beam/io/gcp/bigquery_file_loads.py>:1175: BeamDeprecationWarning: options is deprecated since First stable release. References to <pipeline>.options will not be supported
    p.options.view_as(GoogleCloudOptions).job_name or 'AUTOMATIC_JOB_NAME')

apache_beam/examples/cookbook/bigquery_tornadoes_it_test.py::BigqueryTornadoesIT::test_bigquery_tornadoes_it
  <https://ci-beam.apache.org/job/beam_PostCommit_Python37/ws/src/sdks/python/apache_beam/io/gcp/tests/utils.py>:100: PendingDeprecationWarning: Client.dataset is deprecated and will be removed in a future version. Use a string like 'my_project.my_dataset' or a cloud.google.bigquery.DatasetReference object, instead.
    table_ref = client.dataset(dataset_id).table(table_id)

apache_beam/dataframe/io_it_test.py: 2 warnings
apache_beam/io/gcp/bigquery_json_it_test.py: 1 warning
apache_beam/io/gcp/bigquery_read_it_test.py: 9 warnings
  <https://ci-beam.apache.org/job/beam_PostCommit_Python37/ws/src/sdks/python/apache_beam/io/gcp/bigquery.py>:2529: BeamDeprecationWarning: options is deprecated since First stable release. References to <pipeline>.options will not be supported
    project_id = pcoll.pipeline.options.view_as(GoogleCloudOptions).project

apache_beam/dataframe/io_it_test.py: 2 warnings
apache_beam/io/gcp/bigquery_json_it_test.py: 1 warning
apache_beam/io/gcp/bigquery_read_it_test.py: 9 warnings
  <https://ci-beam.apache.org/job/beam_PostCommit_Python37/ws/src/sdks/python/apache_beam/io/gcp/bigquery.py>:2557: BeamDeprecationWarning: options is deprecated since First stable release. References to <pipeline>.options will not be supported
    | _PassThroughThenCleanupTempDatasets(project_to_cleanup_pcoll))

apache_beam/examples/dataframe/taxiride_it_test.py::TaxirideIT::test_aggregation
apache_beam/examples/dataframe/flight_delays_it_test.py::FlightDelaysTest::test_flight_delays
apache_beam/examples/dataframe/taxiride_it_test.py::TaxirideIT::test_enrich
  <https://ci-beam.apache.org/job/beam_PostCommit_Python37/ws/src/sdks/python/apache_beam/dataframe/io.py>:664: FutureWarning: WriteToFiles is experimental.
    sink=lambda _: _WriteToPandasFileSink(

apache_beam/examples/dataframe/taxiride_it_test.py::TaxirideIT::test_aggregation
apache_beam/examples/dataframe/flight_delays_it_test.py::FlightDelaysTest::test_flight_delays
apache_beam/examples/dataframe/taxiride_it_test.py::TaxirideIT::test_enrich
  <https://ci-beam.apache.org/job/beam_PostCommit_Python37/ws/src/sdks/python/apache_beam/io/fileio.py>:591: BeamDeprecationWarning: options is deprecated since First stable release. References to <pipeline>.options will not be supported
    p.options.view_as(GoogleCloudOptions).temp_location or

apache_beam/examples/dataframe/flight_delays_it_test.py::FlightDelaysTest::test_flight_delays
  <https://ci-beam.apache.org/job/beam_PostCommit_Python37/ws/src/sdks/python/apache_beam/examples/dataframe/flight_delays.py>:47: FutureWarning: Dropping of nuisance columns in DataFrame reductions (with 'numeric_only=None') is deprecated; in a future version this will raise TypeError.  Select only valid columns before calling the reduction.
    return airline_df[at_top_airports].mean()

apache_beam/io/gcp/bigquery_test.py::BigQueryStreamingInsertTransformIntegrationTests::test_multiple_destinations_transform
  <https://ci-beam.apache.org/job/beam_PostCommit_Python37/ws/src/sdks/python/apache_beam/io/gcp/bigquery_test.py>:1690: BeamDeprecationWarning: options is deprecated since First stable release. References to <pipeline>.options will not be supported
    streaming = self.test_pipeline.options.view_as(StandardOptions).streaming

apache_beam/io/gcp/bigquery_read_it_test.py::ReadTests::test_native_source
  <https://ci-beam.apache.org/job/beam_PostCommit_Python37/ws/src/sdks/python/apache_beam/io/gcp/bigquery_read_it_test.py>:170: BeamDeprecationWarning: BigQuerySource is deprecated since 2.25.0. Use ReadFromBigQuery instead.
    beam.io.BigQuerySource(query=self.query, use_standard_sql=True)))

apache_beam/ml/gcp/cloud_dlp_it_test.py::CloudDLPIT::test_deidentification
  <https://ci-beam.apache.org/job/beam_PostCommit_Python37/ws/src/sdks/python/apache_beam/ml/gcp/cloud_dlp_it_test.py>:77: FutureWarning: MaskDetectedDetails is experimental.
    inspection_config=INSPECT_CONFIG))

apache_beam/ml/gcp/cloud_dlp_it_test.py::CloudDLPIT::test_inspection
  <https://ci-beam.apache.org/job/beam_PostCommit_Python37/ws/src/sdks/python/apache_beam/ml/gcp/cloud_dlp_it_test.py>:87: FutureWarning: InspectForDetails is experimental.
    | beam.ParDo(extract_inspection_results).with_outputs(

apache_beam/ml/inference/sklearn_inference_it_test.py::SklearnInference::test_sklearn_regression
  <https://ci-beam.apache.org/job/beam_PostCommit_Python37/ws/src/sdks/python/apache_beam/examples/inference/sklearn_japanese_housing_regression.py>:129: FutureWarning: SklearnModelHandlerPandas is experimental. No backwards-compatibility guarantees.
    model_file_type=ModelFileType.PICKLE, model_uri=model_filename)

apache_beam/ml/inference/sklearn_inference_it_test.py::SklearnInference::test_sklearn_regression
  <https://ci-beam.apache.org/job/beam_PostCommit_Python37/ws/src/build/gradleenv/-1734967052/lib/python3.7/site-packages/dill/_dill.py>:472: FutureWarning: SklearnModelHandlerPandas is experimental. No backwards-compatibility guarantees.
    obj = StockUnpickler.load(self)

apache_beam/io/gcp/bigquery_read_it_test.py::ReadNewTypesTests::test_native_source
  <https://ci-beam.apache.org/job/beam_PostCommit_Python37/ws/src/sdks/python/apache_beam/io/gcp/bigquery_read_it_test.py>:693: BeamDeprecationWarning: BigQuerySource is deprecated since 2.25.0. Use ReadFromBigQuery instead.
    beam.io.BigQuerySource(query=self.query, use_standard_sql=True)))

apache_beam/io/gcp/bigquery_read_it_test.py::ReadAllBQTests::test_read_queries
  <https://ci-beam.apache.org/job/beam_PostCommit_Python37/ws/src/sdks/python/apache_beam/io/gcp/bigquery_read_it_test.py>:808: FutureWarning: ReadAllFromBigQuery is experimental.
    | beam.io.ReadAllFromBigQuery())

apache_beam/io/gcp/bigquery_read_it_test.py::ReadAllBQTests::test_read_queries
  <https://ci-beam.apache.org/job/beam_PostCommit_Python37/ws/src/sdks/python/apache_beam/io/gcp/bigquery.py>:2658: BeamDeprecationWarning: options is deprecated since First stable release. References to <pipeline>.options will not be supported
    job_name = pcoll.pipeline.options.view_as(GoogleCloudOptions).job_name

apache_beam/io/gcp/bigquery_read_it_test.py::ReadAllBQTests::test_read_queries
  <https://ci-beam.apache.org/job/beam_PostCommit_Python37/ws/src/sdks/python/apache_beam/io/gcp/bigquery.py>:2659: BeamDeprecationWarning: options is deprecated since First stable release. References to <pipeline>.options will not be supported
    project = pcoll.pipeline.options.view_as(GoogleCloudOptions).project

apache_beam/io/gcp/bigquery_read_it_test.py::ReadAllBQTests::test_read_queries
  <https://ci-beam.apache.org/job/beam_PostCommit_Python37/ws/src/sdks/python/apache_beam/io/gcp/bigquery.py>:2672: BeamDeprecationWarning: options is deprecated since First stable release. References to <pipeline>.options will not be supported
    options=pcoll.pipeline.options,

-- Docs: https://docs.pytest.org/en/stable/how-to/capture-warnings.html
- generated xml file: <https://ci-beam.apache.org/job/beam_PostCommit_Python37/ws/src/sdks/python/pytest_postCommitIT-df-py37.xml> -
========== 85 passed, 24 skipped, 225 warnings in 11558.31s (3:12:38) ==========

> Task :sdks:python:test-suites:dataflow:py37:spannerioIT
>>> RUNNING integration tests with pipeline options: --runner=TestDataflowRunner --project=apache-beam-testing --region=us-central1 --staging_location=gs://temp-storage-for-end-to-end-tests/staging-it --temp_location=gs://temp-storage-for-end-to-end-tests/temp-it --output=gs://temp-storage-for-end-to-end-tests/py-it-cloud/output --sdk_location=<https://ci-beam.apache.org/job/beam_PostCommit_Python37/ws/src/sdks/python/build/apache-beam.tar.gz> --requirements_file=postcommit_requirements.txt --num_workers=1 --sleep_secs=20 --kms_key_name=projects/apache-beam-testing/locations/global/keyRings/beam-it/cryptoKeys/test --dataflow_kms_key=projects/apache-beam-testing/locations/global/keyRings/beam-it/cryptoKeys/test
>>>   pytest options: --capture=no --timeout=4500 --color=yes --log-cli-level=INFO --numprocesses=8 --dist=loadfile
>>>   collect markers: -m=spannerio_it
============================= test session starts ==============================
platform linux -- Python 3.7.12, pytest-7.2.1, pluggy-1.0.0
rootdir: <https://ci-beam.apache.org/job/beam_PostCommit_Python37/ws/src/sdks/python,> configfile: pytest.ini
plugins: hypothesis-6.68.0, xdist-2.5.0, timeout-2.1.0, forked-1.4.0, requests-mock-1.10.0
timeout: 4500.0s
timeout method: signal
timeout func_only: False
gw0 I / gw1 I / gw2 I / gw3 I / gw4 I / gw5 I / gw6 I / gw7 I
[gw2] Python 3.7.12 (default, Jan 15 2022, 18:42:10)  -- [GCC 9.3.0]
[gw1] Python 3.7.12 (default, Jan 15 2022, 18:42:10)  -- [GCC 9.3.0]
[gw3] Python 3.7.12 (default, Jan 15 2022, 18:42:10)  -- [GCC 9.3.0]
[gw5] Python 3.7.12 (default, Jan 15 2022, 18:42:10)  -- [GCC 9.3.0]
[gw4] Python 3.7.12 (default, Jan 15 2022, 18:42:10)  -- [GCC 9.3.0]
[gw0] Python 3.7.12 (default, Jan 15 2022, 18:42:10)  -- [GCC 9.3.0]
[gw6] Python 3.7.12 (default, Jan 15 2022, 18:42:10)  -- [GCC 9.3.0]
[gw7] Python 3.7.12 (default, Jan 15 2022, 18:42:10)  -- [GCC 9.3.0]
gw0 [15] / gw1 [15] / gw2 [15] / gw3 [15] / gw4 [15] / gw5 [15] / gw6 [15] / gw7 [15]

scheduling tests via LoadFileScheduling

apache_beam/io/gcp/experimental/spannerio_write_it_test.py::SpannerWriteIntegrationTest::test_metrics_error_call 
apache_beam/io/gcp/experimental/spannerio_read_it_test.py::SpannerReadIntegrationTest::test_read_via_sql 
[gw1] SKIPPED apache_beam/io/gcp/experimental/spannerio_write_it_test.py::SpannerWriteIntegrationTest::test_metrics_error_call 
apache_beam/io/gcp/experimental/spannerio_write_it_test.py::SpannerWriteIntegrationTest::test_metrics_ok_call 
[gw1] SKIPPED apache_beam/io/gcp/experimental/spannerio_write_it_test.py::SpannerWriteIntegrationTest::test_metrics_ok_call 
apache_beam/io/gcp/experimental/spannerio_write_it_test.py::SpannerWriteIntegrationTest::test_spanner_error 
[gw1] PASSED apache_beam/io/gcp/experimental/spannerio_write_it_test.py::SpannerWriteIntegrationTest::test_spanner_error 
apache_beam/io/gcp/experimental/spannerio_write_it_test.py::SpannerWriteIntegrationTest::test_spanner_update 
[gw2] PASSED apache_beam/io/gcp/experimental/spannerio_read_it_test.py::SpannerReadIntegrationTest::test_read_via_sql 
apache_beam/io/gcp/experimental/spannerio_read_it_test.py::SpannerReadIntegrationTest::test_read_via_table 
[gw1] PASSED apache_beam/io/gcp/experimental/spannerio_write_it_test.py::SpannerWriteIntegrationTest::test_spanner_update 
apache_beam/io/gcp/experimental/spannerio_write_it_test.py::SpannerWriteIntegrationTest::test_write_batches 
[gw2] PASSED apache_beam/io/gcp/experimental/spannerio_read_it_test.py::SpannerReadIntegrationTest::test_read_via_table 
apache_beam/io/gcp/experimental/spannerio_read_it_test.py::SpannerReadIntegrationTest::test_sql_metrics_error_call 
[gw2] SKIPPED apache_beam/io/gcp/experimental/spannerio_read_it_test.py::SpannerReadIntegrationTest::test_sql_metrics_error_call 
apache_beam/io/gcp/experimental/spannerio_read_it_test.py::SpannerReadIntegrationTest::test_sql_metrics_ok_call 
[gw2] SKIPPED apache_beam/io/gcp/experimental/spannerio_read_it_test.py::SpannerReadIntegrationTest::test_sql_metrics_ok_call 
apache_beam/io/gcp/experimental/spannerio_read_it_test.py::SpannerReadIntegrationTest::test_table_metrics_error_call 
[gw2] SKIPPED apache_beam/io/gcp/experimental/spannerio_read_it_test.py::SpannerReadIntegrationTest::test_table_metrics_error_call 
apache_beam/io/gcp/experimental/spannerio_read_it_test.py::SpannerReadIntegrationTest::test_table_metrics_ok_call 
[gw2] SKIPPED apache_beam/io/gcp/experimental/spannerio_read_it_test.py::SpannerReadIntegrationTest::test_table_metrics_ok_call 
apache_beam/io/gcp/experimental/spannerio_read_it_test.py::SpannerReadIntegrationTest::test_transaction_sql_metrics_error_call 
[gw2] SKIPPED apache_beam/io/gcp/experimental/spannerio_read_it_test.py::SpannerReadIntegrationTest::test_transaction_sql_metrics_error_call 
apache_beam/io/gcp/experimental/spannerio_read_it_test.py::SpannerReadIntegrationTest::test_transaction_sql_metrics_ok_call 
[gw2] SKIPPED apache_beam/io/gcp/experimental/spannerio_read_it_test.py::SpannerReadIntegrationTest::test_transaction_sql_metrics_ok_call 
apache_beam/io/gcp/experimental/spannerio_read_it_test.py::SpannerReadIntegrationTest::test_transaction_table_metrics_error_call 
[gw2] SKIPPED apache_beam/io/gcp/experimental/spannerio_read_it_test.py::SpannerReadIntegrationTest::test_transaction_table_metrics_error_call 
apache_beam/io/gcp/experimental/spannerio_read_it_test.py::SpannerReadIntegrationTest::test_transaction_table_metrics_ok_call 
[gw2] SKIPPED apache_beam/io/gcp/experimental/spannerio_read_it_test.py::SpannerReadIntegrationTest::test_transaction_table_metrics_ok_call 
[gw1] PASSED apache_beam/io/gcp/experimental/spannerio_write_it_test.py::SpannerWriteIntegrationTest::test_write_batches 

=============================== warnings summary ===============================
../../build/gradleenv/-1734967052/lib/python3.7/site-packages/hdfs/config.py:15
../../build/gradleenv/-1734967052/lib/python3.7/site-packages/hdfs/config.py:15
../../build/gradleenv/-1734967052/lib/python3.7/site-packages/hdfs/config.py:15
../../build/gradleenv/-1734967052/lib/python3.7/site-packages/hdfs/config.py:15
../../build/gradleenv/-1734967052/lib/python3.7/site-packages/hdfs/config.py:15
../../build/gradleenv/-1734967052/lib/python3.7/site-packages/hdfs/config.py:15
../../build/gradleenv/-1734967052/lib/python3.7/site-packages/hdfs/config.py:15
../../build/gradleenv/-1734967052/lib/python3.7/site-packages/hdfs/config.py:15
../../build/gradleenv/-1734967052/lib/python3.7/site-packages/hdfs/config.py:15
  <https://ci-beam.apache.org/job/beam_PostCommit_Python37/ws/src/build/gradleenv/-1734967052/lib/python3.7/site-packages/hdfs/config.py>:15: DeprecationWarning: the imp module is deprecated in favour of importlib; see the module's documentation for alternative uses
    from imp import load_source

apache_beam/io/gcp/experimental/spannerio_write_it_test.py::SpannerWriteIntegrationTest::test_spanner_error
  <https://ci-beam.apache.org/job/beam_PostCommit_Python37/ws/src/sdks/python/apache_beam/io/gcp/experimental/spannerio_write_it_test.py>:190: FutureWarning: WriteToSpanner is experimental. No backwards-compatibility guarantees.
    database_id=self.TEST_DATABASE))

apache_beam/io/gcp/experimental/spannerio_read_it_test.py::SpannerReadIntegrationTest::test_read_via_sql
  <https://ci-beam.apache.org/job/beam_PostCommit_Python37/ws/src/sdks/python/apache_beam/io/gcp/experimental/spannerio_read_it_test.py>:128: FutureWarning: ReadFromSpanner is experimental. No backwards-compatibility guarantees.
    sql="select * from Users")

apache_beam/io/gcp/experimental/spannerio_write_it_test.py::SpannerWriteIntegrationTest::test_spanner_update
  <https://ci-beam.apache.org/job/beam_PostCommit_Python37/ws/src/sdks/python/apache_beam/io/gcp/experimental/spannerio_write_it_test.py>:171: FutureWarning: WriteToSpanner is experimental. No backwards-compatibility guarantees.
    database_id=self.TEST_DATABASE))

apache_beam/io/gcp/experimental/spannerio_read_it_test.py::SpannerReadIntegrationTest::test_read_via_table
  <https://ci-beam.apache.org/job/beam_PostCommit_Python37/ws/src/sdks/python/apache_beam/io/gcp/experimental/spannerio_read_it_test.py>:117: FutureWarning: ReadFromSpanner is experimental. No backwards-compatibility guarantees.
    columns=["UserId", "Key"])

apache_beam/io/gcp/experimental/spannerio_write_it_test.py::SpannerWriteIntegrationTest::test_write_batches
  <https://ci-beam.apache.org/job/beam_PostCommit_Python37/ws/src/sdks/python/apache_beam/io/gcp/experimental/spannerio_write_it_test.py>:135: FutureWarning: WriteToSpanner is experimental. No backwards-compatibility guarantees.
    max_batch_size_bytes=250))

-- Docs: https://docs.pytest.org/en/stable/how-to/capture-warnings.html
- generated xml file: <https://ci-beam.apache.org/job/beam_PostCommit_Python37/ws/src/sdks/python/pytest_postCommitIT-df-py37.xml> -
=========== 5 passed, 17 skipped, 14 warnings in 1605.47s (0:26:45) ============

FAILURE: Build completed with 2 failures.

1: Task failed with an exception.
-----------
* Where:
Script '<https://ci-beam.apache.org/job/beam_PostCommit_Python37/ws/src/sdks/python/test-suites/direct/common.gradle'> line: 194

* What went wrong:
Execution failed for task ':sdks:python:test-suites:direct:py37:azureIntegrationTest'.
> Process 'command 'sh'' finished with non-zero exit value 1

* Try:
> Run with --stacktrace option to get the stack trace.
> Run with --info or --debug option to get more log output.
==============================================================================

2: Task failed with an exception.
-----------
* Where:
Script '<https://ci-beam.apache.org/job/beam_PostCommit_Python37/ws/src/sdks/python/test-suites/direct/common.gradle'> line: 185

* What went wrong:
Execution failed for task ':sdks:python:test-suites:direct:py37:hdfsIntegrationTest'.
> Process 'command 'sh'' finished with non-zero exit value 1

* Try:
> Run with --stacktrace option to get the stack trace.
> Run with --info or --debug option to get more log output.
==============================================================================

* Get more help at https://help.gradle.org

Deprecated Gradle features were used in this build, making it incompatible with Gradle 8.0.

You can use '--warning-mode all' to show the individual deprecation warnings and determine if they come from your own scripts or plugins.

See https://docs.gradle.org/7.5.1/userguide/command_line_interface.html#sec:command_line_warnings

Execution optimizations have been disabled for 1 invalid unit(s) of work during this build to ensure correctness.
Please consult deprecation warnings for more details.

BUILD FAILED in 3h 41m 47s
212 actionable tasks: 148 executed, 58 from cache, 6 up-to-date

Publishing build scan...
https://gradle.com/s/5t6wrbzq5fila

Build step 'Invoke Gradle script' changed build result to FAILURE
Build step 'Invoke Gradle script' marked build as failure

---------------------------------------------------------------------
To unsubscribe, e-mail: builds-unsubscribe@beam.apache.org
For additional commands, e-mail: builds-help@beam.apache.org


Jenkins build is back to normal : beam_PostCommit_Python37 #6329

Posted by Apache Jenkins Server <je...@builds.apache.org>.
See <https://ci-beam.apache.org/job/beam_PostCommit_Python37/6329/display/redirect?page=changes>


---------------------------------------------------------------------
To unsubscribe, e-mail: builds-unsubscribe@beam.apache.org
For additional commands, e-mail: builds-help@beam.apache.org


Build failed in Jenkins: beam_PostCommit_Python37 #6328

Posted by Apache Jenkins Server <je...@builds.apache.org>.
See <https://ci-beam.apache.org/job/beam_PostCommit_Python37/6328/display/redirect>

Changes:


------------------------------------------
[...truncated 950.17 KB...]
[gw7] PASSED apache_beam/io/gcp/bigquery_read_it_test.py::ReadUsingStorageApiTests::test_iobase_source_with_very_selective_filters 
apache_beam/io/gcp/bigquery_read_it_test.py::ReadNewTypesTests::test_iobase_source 
[gw7] PASSED apache_beam/io/gcp/bigquery_read_it_test.py::ReadNewTypesTests::test_iobase_source 
apache_beam/io/gcp/bigquery_read_it_test.py::ReadNewTypesTests::test_native_source 
[gw7] PASSED apache_beam/io/gcp/bigquery_read_it_test.py::ReadNewTypesTests::test_native_source 
apache_beam/io/gcp/bigquery_read_it_test.py::ReadAllBQTests::test_read_queries 
[gw7] PASSED apache_beam/io/gcp/bigquery_read_it_test.py::ReadAllBQTests::test_read_queries 
apache_beam/io/gcp/bigquery_read_it_test.py::ReadInteractiveRunnerTests::test_read_in_interactive_runner 
[gw7] PASSED apache_beam/io/gcp/bigquery_read_it_test.py::ReadInteractiveRunnerTests::test_read_in_interactive_runner 

=============================== warnings summary ===============================
../../build/gradleenv/-1734967052/lib/python3.7/site-packages/hdfs/config.py:15
../../build/gradleenv/-1734967052/lib/python3.7/site-packages/hdfs/config.py:15
../../build/gradleenv/-1734967052/lib/python3.7/site-packages/hdfs/config.py:15
../../build/gradleenv/-1734967052/lib/python3.7/site-packages/hdfs/config.py:15
../../build/gradleenv/-1734967052/lib/python3.7/site-packages/hdfs/config.py:15
../../build/gradleenv/-1734967052/lib/python3.7/site-packages/hdfs/config.py:15
../../build/gradleenv/-1734967052/lib/python3.7/site-packages/hdfs/config.py:15
../../build/gradleenv/-1734967052/lib/python3.7/site-packages/hdfs/config.py:15
../../build/gradleenv/-1734967052/lib/python3.7/site-packages/hdfs/config.py:15
  <https://ci-beam.apache.org/job/beam_PostCommit_Python37/ws/src/build/gradleenv/-1734967052/lib/python3.7/site-packages/hdfs/config.py>:15: DeprecationWarning: the imp module is deprecated in favour of importlib; see the module's documentation for alternative uses
    from imp import load_source

../../build/gradleenv/-1734967052/lib/python3.7/site-packages/pkg_resources/__init__.py:2803: 306 warnings
  <https://ci-beam.apache.org/job/beam_PostCommit_Python37/ws/src/build/gradleenv/-1734967052/lib/python3.7/site-packages/pkg_resources/__init__.py>:2803: DeprecationWarning: Implementing implicit namespace packages (as specified in PEP 420) is preferred to `pkg_resources.declare_namespace`. See https://setuptools.pypa.io/en/latest/references/keywords.html#keyword-namespace-packages
    declare_namespace(pkg)

../../build/gradleenv/-1734967052/lib/python3.7/site-packages/pkg_resources/__init__.py:2308: 36 warnings
  <https://ci-beam.apache.org/job/beam_PostCommit_Python37/ws/src/build/gradleenv/-1734967052/lib/python3.7/site-packages/pkg_resources/__init__.py>:2308: DeprecationWarning: Implementing implicit namespace packages (as specified in PEP 420) is preferred to `pkg_resources.declare_namespace`. See https://setuptools.pypa.io/en/latest/references/keywords.html#keyword-namespace-packages
    declare_namespace(parent)

../../build/gradleenv/-1734967052/lib/python3.7/site-packages/google/rpc/__init__.py:20
../../build/gradleenv/-1734967052/lib/python3.7/site-packages/google/rpc/__init__.py:20
../../build/gradleenv/-1734967052/lib/python3.7/site-packages/google/rpc/__init__.py:20
../../build/gradleenv/-1734967052/lib/python3.7/site-packages/google/rpc/__init__.py:20
../../build/gradleenv/-1734967052/lib/python3.7/site-packages/google/rpc/__init__.py:20
../../build/gradleenv/-1734967052/lib/python3.7/site-packages/google/rpc/__init__.py:20
../../build/gradleenv/-1734967052/lib/python3.7/site-packages/google/rpc/__init__.py:20
../../build/gradleenv/-1734967052/lib/python3.7/site-packages/google/rpc/__init__.py:20
../../build/gradleenv/-1734967052/lib/python3.7/site-packages/google/rpc/__init__.py:20
  <https://ci-beam.apache.org/job/beam_PostCommit_Python37/ws/src/build/gradleenv/-1734967052/lib/python3.7/site-packages/google/rpc/__init__.py>:20: DeprecationWarning: Implementing implicit namespace packages (as specified in PEP 420) is preferred to `pkg_resources.declare_namespace`. See https://setuptools.pypa.io/en/latest/references/keywords.html#keyword-namespace-packages
    pkg_resources.declare_namespace(__name__)

apache_beam/dataframe/io_it_test.py: 3 warnings
apache_beam/examples/cookbook/bigquery_tornadoes_it_test.py: 1 warning
apache_beam/examples/dataframe/flight_delays_it_test.py: 1 warning
apache_beam/io/gcp/bigquery_io_read_it_test.py: 2 warnings
apache_beam/io/gcp/bigquery_read_it_test.py: 7 warnings
apache_beam/io/gcp/bigquery_json_it_test.py: 3 warnings
apache_beam/io/gcp/big_query_query_to_table_it_test.py: 4 warnings
  <https://ci-beam.apache.org/job/beam_PostCommit_Python37/ws/src/sdks/python/apache_beam/io/gcp/bigquery.py>:2485: BeamDeprecationWarning: options is deprecated since First stable release. References to <pipeline>.options will not be supported
    temp_location = pcoll.pipeline.options.view_as(

apache_beam/dataframe/io_it_test.py: 3 warnings
apache_beam/examples/cookbook/bigquery_tornadoes_it_test.py: 1 warning
apache_beam/examples/dataframe/flight_delays_it_test.py: 1 warning
apache_beam/io/gcp/bigquery_io_read_it_test.py: 2 warnings
apache_beam/io/gcp/bigquery_read_it_test.py: 7 warnings
apache_beam/io/gcp/bigquery_json_it_test.py: 3 warnings
apache_beam/io/gcp/big_query_query_to_table_it_test.py: 4 warnings
  <https://ci-beam.apache.org/job/beam_PostCommit_Python37/ws/src/sdks/python/apache_beam/io/gcp/bigquery.py>:2487: BeamDeprecationWarning: options is deprecated since First stable release. References to <pipeline>.options will not be supported
    job_name = pcoll.pipeline.options.view_as(GoogleCloudOptions).job_name

apache_beam/dataframe/io_it_test.py: 3 warnings
apache_beam/examples/cookbook/bigquery_tornadoes_it_test.py: 1 warning
apache_beam/examples/dataframe/flight_delays_it_test.py: 1 warning
apache_beam/io/gcp/bigquery_io_read_it_test.py: 2 warnings
apache_beam/io/gcp/bigquery_read_it_test.py: 7 warnings
apache_beam/io/gcp/bigquery_json_it_test.py: 3 warnings
apache_beam/io/gcp/big_query_query_to_table_it_test.py: 4 warnings
  <https://ci-beam.apache.org/job/beam_PostCommit_Python37/ws/src/sdks/python/apache_beam/io/gcp/bigquery.py>:2518: BeamDeprecationWarning: options is deprecated since First stable release. References to <pipeline>.options will not be supported
    | _PassThroughThenCleanup(files_to_remove_pcoll))

apache_beam/examples/complete/game/game_stats_it_test.py::GameStatsIT::test_game_stats_it
apache_beam/examples/complete/game/hourly_team_score_it_test.py::HourlyTeamScoreIT::test_hourly_team_score_it
apache_beam/examples/complete/game/leader_board_it_test.py::LeaderBoardIT::test_leader_board_it
apache_beam/io/gcp/bigquery_test.py::PubSubBigQueryIT::test_file_loads
apache_beam/io/gcp/bigquery_test.py::PubSubBigQueryIT::test_streaming_inserts
  <https://ci-beam.apache.org/job/beam_PostCommit_Python37/ws/src/sdks/python/apache_beam/io/gcp/tests/utils.py>:63: PendingDeprecationWarning: Client.dataset is deprecated and will be removed in a future version. Use a string like 'my_project.my_dataset' or a cloud.google.bigquery.DatasetReference object, instead.
    dataset_ref = client.dataset(unique_dataset_name, project=project)

apache_beam/examples/complete/game/game_stats_it_test.py: 2 warnings
apache_beam/examples/cookbook/bigquery_tornadoes_it_test.py: 1 warning
apache_beam/examples/complete/game/hourly_team_score_it_test.py: 1 warning
apache_beam/examples/complete/game/leader_board_it_test.py: 2 warnings
apache_beam/io/gcp/bigquery_file_loads_test.py: 3 warnings
apache_beam/io/gcp/bigquery_test.py: 6 warnings
apache_beam/io/gcp/bigquery_write_it_test.py: 4 warnings
apache_beam/io/gcp/bigquery_json_it_test.py: 2 warnings
apache_beam/io/gcp/big_query_query_to_table_it_test.py: 4 warnings
  <https://ci-beam.apache.org/job/beam_PostCommit_Python37/ws/src/sdks/python/apache_beam/io/gcp/bigquery.py>:1992: BeamDeprecationWarning: options is deprecated since First stable release. References to <pipeline>.options will not be supported
    is_streaming_pipeline = p.options.view_as(StandardOptions).streaming

apache_beam/examples/complete/game/game_stats_it_test.py: 2 warnings
apache_beam/examples/cookbook/bigquery_tornadoes_it_test.py: 1 warning
apache_beam/examples/complete/game/hourly_team_score_it_test.py: 1 warning
apache_beam/examples/complete/game/leader_board_it_test.py: 2 warnings
apache_beam/io/gcp/bigquery_file_loads_test.py: 3 warnings
apache_beam/io/gcp/bigquery_test.py: 6 warnings
apache_beam/io/gcp/bigquery_write_it_test.py: 4 warnings
apache_beam/io/gcp/bigquery_json_it_test.py: 2 warnings
apache_beam/io/gcp/big_query_query_to_table_it_test.py: 4 warnings
  <https://ci-beam.apache.org/job/beam_PostCommit_Python37/ws/src/sdks/python/apache_beam/io/gcp/bigquery.py>:1998: BeamDeprecationWarning: options is deprecated since First stable release. References to <pipeline>.options will not be supported
    experiments = p.options.view_as(DebugOptions).experiments or []

apache_beam/dataframe/io_it_test.py: 2 warnings
apache_beam/io/gcp/bigquery_json_it_test.py: 1 warning
apache_beam/io/gcp/bigquery_read_it_test.py: 9 warnings
  <https://ci-beam.apache.org/job/beam_PostCommit_Python37/ws/src/sdks/python/apache_beam/io/gcp/bigquery.py>:2529: BeamDeprecationWarning: options is deprecated since First stable release. References to <pipeline>.options will not be supported
    project_id = pcoll.pipeline.options.view_as(GoogleCloudOptions).project

apache_beam/dataframe/io_it_test.py: 2 warnings
apache_beam/io/gcp/bigquery_json_it_test.py: 1 warning
apache_beam/io/gcp/bigquery_read_it_test.py: 9 warnings
  <https://ci-beam.apache.org/job/beam_PostCommit_Python37/ws/src/sdks/python/apache_beam/io/gcp/bigquery.py>:2557: BeamDeprecationWarning: options is deprecated since First stable release. References to <pipeline>.options will not be supported
    | _PassThroughThenCleanupTempDatasets(project_to_cleanup_pcoll))

apache_beam/examples/cookbook/bigquery_tornadoes_it_test.py: 1 warning
apache_beam/io/gcp/bigquery_write_it_test.py: 4 warnings
apache_beam/io/gcp/big_query_query_to_table_it_test.py: 4 warnings
apache_beam/io/gcp/bigquery_test.py: 2 warnings
  <https://ci-beam.apache.org/job/beam_PostCommit_Python37/ws/src/sdks/python/apache_beam/io/gcp/bigquery.py>:1988: BeamDeprecationWarning: options is deprecated since First stable release. References to <pipeline>.options will not be supported
    self.table_reference.projectId = pcoll.pipeline.options.view_as(

apache_beam/examples/cookbook/bigquery_tornadoes_it_test.py: 1 warning
apache_beam/io/gcp/bigquery_file_loads_test.py: 3 warnings
apache_beam/io/gcp/bigquery_write_it_test.py: 3 warnings
apache_beam/io/gcp/bigquery_test.py: 3 warnings
apache_beam/io/gcp/big_query_query_to_table_it_test.py: 4 warnings
  <https://ci-beam.apache.org/job/beam_PostCommit_Python37/ws/src/sdks/python/apache_beam/io/gcp/bigquery_file_loads.py>:1166: BeamDeprecationWarning: options is deprecated since First stable release. References to <pipeline>.options will not be supported
    self.project = self.project or p.options.view_as(GoogleCloudOptions).project

apache_beam/examples/cookbook/bigquery_tornadoes_it_test.py: 1 warning
apache_beam/examples/complete/game/hourly_team_score_it_test.py: 1 warning
apache_beam/io/gcp/bigquery_file_loads_test.py: 3 warnings
apache_beam/io/gcp/bigquery_write_it_test.py: 3 warnings
apache_beam/io/gcp/bigquery_test.py: 3 warnings
apache_beam/io/gcp/big_query_query_to_table_it_test.py: 4 warnings
  <https://ci-beam.apache.org/job/beam_PostCommit_Python37/ws/src/sdks/python/apache_beam/io/gcp/bigquery_file_loads.py>:1173: BeamDeprecationWarning: options is deprecated since First stable release. References to <pipeline>.options will not be supported
    temp_location = p.options.view_as(GoogleCloudOptions).temp_location

apache_beam/examples/cookbook/bigquery_tornadoes_it_test.py: 1 warning
apache_beam/examples/complete/game/hourly_team_score_it_test.py: 1 warning
apache_beam/io/gcp/bigquery_file_loads_test.py: 3 warnings
apache_beam/io/gcp/bigquery_write_it_test.py: 3 warnings
apache_beam/io/gcp/bigquery_test.py: 3 warnings
apache_beam/io/gcp/big_query_query_to_table_it_test.py: 4 warnings
  <https://ci-beam.apache.org/job/beam_PostCommit_Python37/ws/src/sdks/python/apache_beam/io/gcp/bigquery_file_loads.py>:1175: BeamDeprecationWarning: options is deprecated since First stable release. References to <pipeline>.options will not be supported
    p.options.view_as(GoogleCloudOptions).job_name or 'AUTOMATIC_JOB_NAME')

apache_beam/examples/cookbook/bigquery_tornadoes_it_test.py::BigqueryTornadoesIT::test_bigquery_tornadoes_it
  <https://ci-beam.apache.org/job/beam_PostCommit_Python37/ws/src/sdks/python/apache_beam/io/gcp/tests/utils.py>:100: PendingDeprecationWarning: Client.dataset is deprecated and will be removed in a future version. Use a string like 'my_project.my_dataset' or a cloud.google.bigquery.DatasetReference object, instead.
    table_ref = client.dataset(dataset_id).table(table_id)

apache_beam/examples/dataframe/flight_delays_it_test.py::FlightDelaysTest::test_flight_delays
  <https://ci-beam.apache.org/job/beam_PostCommit_Python37/ws/src/sdks/python/apache_beam/examples/dataframe/flight_delays.py>:47: FutureWarning: Dropping of nuisance columns in DataFrame reductions (with 'numeric_only=None') is deprecated; in a future version this will raise TypeError.  Select only valid columns before calling the reduction.
    return airline_df[at_top_airports].mean()

apache_beam/examples/dataframe/flight_delays_it_test.py::FlightDelaysTest::test_flight_delays
apache_beam/examples/dataframe/taxiride_it_test.py::TaxirideIT::test_aggregation
apache_beam/examples/dataframe/taxiride_it_test.py::TaxirideIT::test_enrich
  <https://ci-beam.apache.org/job/beam_PostCommit_Python37/ws/src/sdks/python/apache_beam/dataframe/io.py>:664: FutureWarning: WriteToFiles is experimental.
    sink=lambda _: _WriteToPandasFileSink(

apache_beam/examples/dataframe/flight_delays_it_test.py::FlightDelaysTest::test_flight_delays
apache_beam/examples/dataframe/taxiride_it_test.py::TaxirideIT::test_aggregation
apache_beam/examples/dataframe/taxiride_it_test.py::TaxirideIT::test_enrich
  <https://ci-beam.apache.org/job/beam_PostCommit_Python37/ws/src/sdks/python/apache_beam/io/fileio.py>:593: BeamDeprecationWarning: options is deprecated since First stable release. References to <pipeline>.options will not be supported
    p.options.view_as(GoogleCloudOptions).temp_location or

apache_beam/io/gcp/bigquery_test.py::BigQueryStreamingInsertTransformIntegrationTests::test_multiple_destinations_transform
  <https://ci-beam.apache.org/job/beam_PostCommit_Python37/ws/src/sdks/python/apache_beam/io/gcp/bigquery_test.py>:1690: BeamDeprecationWarning: options is deprecated since First stable release. References to <pipeline>.options will not be supported
    streaming = self.test_pipeline.options.view_as(StandardOptions).streaming

apache_beam/io/gcp/bigquery_read_it_test.py::ReadTests::test_native_source
  <https://ci-beam.apache.org/job/beam_PostCommit_Python37/ws/src/sdks/python/apache_beam/io/gcp/bigquery_read_it_test.py>:170: BeamDeprecationWarning: BigQuerySource is deprecated since 2.25.0. Use ReadFromBigQuery instead.
    beam.io.BigQuerySource(query=self.query, use_standard_sql=True)))

apache_beam/ml/gcp/cloud_dlp_it_test.py::CloudDLPIT::test_deidentification
  <https://ci-beam.apache.org/job/beam_PostCommit_Python37/ws/src/sdks/python/apache_beam/ml/gcp/cloud_dlp_it_test.py>:77: FutureWarning: MaskDetectedDetails is experimental.
    inspection_config=INSPECT_CONFIG))

apache_beam/ml/gcp/cloud_dlp_it_test.py::CloudDLPIT::test_inspection
  <https://ci-beam.apache.org/job/beam_PostCommit_Python37/ws/src/sdks/python/apache_beam/ml/gcp/cloud_dlp_it_test.py>:87: FutureWarning: InspectForDetails is experimental.
    | beam.ParDo(extract_inspection_results).with_outputs(

apache_beam/ml/inference/sklearn_inference_it_test.py::SklearnInference::test_sklearn_regression
  <https://ci-beam.apache.org/job/beam_PostCommit_Python37/ws/src/sdks/python/apache_beam/examples/inference/sklearn_japanese_housing_regression.py>:129: FutureWarning: SklearnModelHandlerPandas is experimental. No backwards-compatibility guarantees.
    model_file_type=ModelFileType.PICKLE, model_uri=model_filename)

apache_beam/ml/inference/sklearn_inference_it_test.py::SklearnInference::test_sklearn_regression
  <https://ci-beam.apache.org/job/beam_PostCommit_Python37/ws/src/build/gradleenv/-1734967052/lib/python3.7/site-packages/dill/_dill.py>:472: FutureWarning: SklearnModelHandlerPandas is experimental. No backwards-compatibility guarantees.
    obj = StockUnpickler.load(self)

apache_beam/io/gcp/bigquery_read_it_test.py::ReadNewTypesTests::test_native_source
  <https://ci-beam.apache.org/job/beam_PostCommit_Python37/ws/src/sdks/python/apache_beam/io/gcp/bigquery_read_it_test.py>:693: BeamDeprecationWarning: BigQuerySource is deprecated since 2.25.0. Use ReadFromBigQuery instead.
    beam.io.BigQuerySource(query=self.query, use_standard_sql=True)))

apache_beam/io/gcp/bigquery_read_it_test.py::ReadAllBQTests::test_read_queries
  <https://ci-beam.apache.org/job/beam_PostCommit_Python37/ws/src/sdks/python/apache_beam/io/gcp/bigquery_read_it_test.py>:808: FutureWarning: ReadAllFromBigQuery is experimental.
    | beam.io.ReadAllFromBigQuery())

apache_beam/io/gcp/bigquery_read_it_test.py::ReadAllBQTests::test_read_queries
  <https://ci-beam.apache.org/job/beam_PostCommit_Python37/ws/src/sdks/python/apache_beam/io/gcp/bigquery.py>:2658: BeamDeprecationWarning: options is deprecated since First stable release. References to <pipeline>.options will not be supported
    job_name = pcoll.pipeline.options.view_as(GoogleCloudOptions).job_name

apache_beam/io/gcp/bigquery_read_it_test.py::ReadAllBQTests::test_read_queries
  <https://ci-beam.apache.org/job/beam_PostCommit_Python37/ws/src/sdks/python/apache_beam/io/gcp/bigquery.py>:2659: BeamDeprecationWarning: options is deprecated since First stable release. References to <pipeline>.options will not be supported
    project = pcoll.pipeline.options.view_as(GoogleCloudOptions).project

apache_beam/io/gcp/bigquery_read_it_test.py::ReadAllBQTests::test_read_queries
  <https://ci-beam.apache.org/job/beam_PostCommit_Python37/ws/src/sdks/python/apache_beam/io/gcp/bigquery.py>:2672: BeamDeprecationWarning: options is deprecated since First stable release. References to <pipeline>.options will not be supported
    options=pcoll.pipeline.options,

-- Docs: https://docs.pytest.org/en/stable/how-to/capture-warnings.html
- generated xml file: <https://ci-beam.apache.org/job/beam_PostCommit_Python37/ws/src/sdks/python/pytest_postCommitIT-df-py37.xml> -
========== 85 passed, 24 skipped, 576 warnings in 12316.48s (3:25:16) ==========

> Task :sdks:python:test-suites:dataflow:py37:spannerioIT

FAILURE: Build failed with an exception.

* What went wrong:
Execution failed for task ':sdks:java:container:pullLicenses'.
> Process 'command './license_scripts/license_script.sh'' finished with non-zero exit value 1

* Try:
> Run with --stacktrace option to get the stack trace.
> Run with --info or --debug option to get more log output.

* Get more help at https://help.gradle.org

Deprecated Gradle features were used in this build, making it incompatible with Gradle 8.0.

You can use '--warning-mode all' to show the individual deprecation warnings and determine if they come from your own scripts or plugins.

See https://docs.gradle.org/7.5.1/userguide/command_line_interface.html#sec:command_line_warnings

Execution optimizations have been disabled for 1 invalid unit(s) of work during this build to ensure correctness.
Please consult deprecation warnings for more details.

BUILD FAILED in 3h 58m 41s
207 actionable tasks: 145 executed, 56 from cache, 6 up-to-date

Publishing build scan...
https://gradle.com/s/r3qrxx2w4a2yg

Build step 'Invoke Gradle script' changed build result to FAILURE
Build step 'Invoke Gradle script' marked build as failure

---------------------------------------------------------------------
To unsubscribe, e-mail: builds-unsubscribe@beam.apache.org
For additional commands, e-mail: builds-help@beam.apache.org


Build failed in Jenkins: beam_PostCommit_Python37 #6327

Posted by Apache Jenkins Server <je...@builds.apache.org>.
See <https://ci-beam.apache.org/job/beam_PostCommit_Python37/6327/display/redirect?page=changes>

Changes:

[noreply] Remove python 3.6 references (#25445)


------------------------------------------
[...truncated 942.33 KB...]
apache_beam/dataframe/io_it_test.py: 2 warnings
apache_beam/io/gcp/bigquery_json_it_test.py: 1 warning
apache_beam/io/gcp/bigquery_read_it_test.py: 9 warnings
  <https://ci-beam.apache.org/job/beam_PostCommit_Python37/ws/src/sdks/python/apache_beam/io/gcp/bigquery.py>:2557: BeamDeprecationWarning: options is deprecated since First stable release. References to <pipeline>.options will not be supported
    | _PassThroughThenCleanupTempDatasets(project_to_cleanup_pcoll))

apache_beam/examples/cookbook/bigquery_tornadoes_it_test.py: 1 warning
apache_beam/io/gcp/big_query_query_to_table_it_test.py: 4 warnings
apache_beam/io/gcp/bigquery_write_it_test.py: 4 warnings
apache_beam/io/gcp/bigquery_test.py: 2 warnings
  <https://ci-beam.apache.org/job/beam_PostCommit_Python37/ws/src/sdks/python/apache_beam/io/gcp/bigquery.py>:1988: BeamDeprecationWarning: options is deprecated since First stable release. References to <pipeline>.options will not be supported
    self.table_reference.projectId = pcoll.pipeline.options.view_as(

apache_beam/examples/cookbook/bigquery_tornadoes_it_test.py: 1 warning
apache_beam/io/gcp/big_query_query_to_table_it_test.py: 4 warnings
apache_beam/io/gcp/bigquery_write_it_test.py: 3 warnings
apache_beam/io/gcp/bigquery_test.py: 3 warnings
apache_beam/io/gcp/bigquery_file_loads_test.py: 3 warnings
  <https://ci-beam.apache.org/job/beam_PostCommit_Python37/ws/src/sdks/python/apache_beam/io/gcp/bigquery_file_loads.py>:1166: BeamDeprecationWarning: options is deprecated since First stable release. References to <pipeline>.options will not be supported
    self.project = self.project or p.options.view_as(GoogleCloudOptions).project

apache_beam/examples/cookbook/bigquery_tornadoes_it_test.py: 1 warning
apache_beam/examples/complete/game/hourly_team_score_it_test.py: 1 warning
apache_beam/io/gcp/big_query_query_to_table_it_test.py: 4 warnings
apache_beam/io/gcp/bigquery_write_it_test.py: 3 warnings
apache_beam/io/gcp/bigquery_test.py: 3 warnings
apache_beam/io/gcp/bigquery_file_loads_test.py: 3 warnings
  <https://ci-beam.apache.org/job/beam_PostCommit_Python37/ws/src/sdks/python/apache_beam/io/gcp/bigquery_file_loads.py>:1173: BeamDeprecationWarning: options is deprecated since First stable release. References to <pipeline>.options will not be supported
    temp_location = p.options.view_as(GoogleCloudOptions).temp_location

apache_beam/examples/cookbook/bigquery_tornadoes_it_test.py: 1 warning
apache_beam/examples/complete/game/hourly_team_score_it_test.py: 1 warning
apache_beam/io/gcp/big_query_query_to_table_it_test.py: 4 warnings
apache_beam/io/gcp/bigquery_write_it_test.py: 3 warnings
apache_beam/io/gcp/bigquery_test.py: 3 warnings
apache_beam/io/gcp/bigquery_file_loads_test.py: 3 warnings
  <https://ci-beam.apache.org/job/beam_PostCommit_Python37/ws/src/sdks/python/apache_beam/io/gcp/bigquery_file_loads.py>:1175: BeamDeprecationWarning: options is deprecated since First stable release. References to <pipeline>.options will not be supported
    p.options.view_as(GoogleCloudOptions).job_name or 'AUTOMATIC_JOB_NAME')

apache_beam/examples/cookbook/bigquery_tornadoes_it_test.py::BigqueryTornadoesIT::test_bigquery_tornadoes_it
  <https://ci-beam.apache.org/job/beam_PostCommit_Python37/ws/src/sdks/python/apache_beam/io/gcp/tests/utils.py>:100: PendingDeprecationWarning: Client.dataset is deprecated and will be removed in a future version. Use a string like 'my_project.my_dataset' or a cloud.google.bigquery.DatasetReference object, instead.
    table_ref = client.dataset(dataset_id).table(table_id)

apache_beam/examples/dataframe/flight_delays_it_test.py::FlightDelaysTest::test_flight_delays
  <https://ci-beam.apache.org/job/beam_PostCommit_Python37/ws/src/sdks/python/apache_beam/examples/dataframe/flight_delays.py>:47: FutureWarning: Dropping of nuisance columns in DataFrame reductions (with 'numeric_only=None') is deprecated; in a future version this will raise TypeError.  Select only valid columns before calling the reduction.
    return airline_df[at_top_airports].mean()

apache_beam/examples/dataframe/flight_delays_it_test.py::FlightDelaysTest::test_flight_delays
apache_beam/examples/dataframe/taxiride_it_test.py::TaxirideIT::test_aggregation
apache_beam/examples/dataframe/taxiride_it_test.py::TaxirideIT::test_enrich
  <https://ci-beam.apache.org/job/beam_PostCommit_Python37/ws/src/sdks/python/apache_beam/dataframe/io.py>:664: FutureWarning: WriteToFiles is experimental.
    sink=lambda _: _WriteToPandasFileSink(

apache_beam/examples/dataframe/flight_delays_it_test.py::FlightDelaysTest::test_flight_delays
apache_beam/examples/dataframe/taxiride_it_test.py::TaxirideIT::test_aggregation
apache_beam/examples/dataframe/taxiride_it_test.py::TaxirideIT::test_enrich
  <https://ci-beam.apache.org/job/beam_PostCommit_Python37/ws/src/sdks/python/apache_beam/io/fileio.py>:593: BeamDeprecationWarning: options is deprecated since First stable release. References to <pipeline>.options will not be supported
    p.options.view_as(GoogleCloudOptions).temp_location or

apache_beam/io/gcp/bigquery_test.py::BigQueryStreamingInsertTransformIntegrationTests::test_multiple_destinations_transform
  <https://ci-beam.apache.org/job/beam_PostCommit_Python37/ws/src/sdks/python/apache_beam/io/gcp/bigquery_test.py>:1690: BeamDeprecationWarning: options is deprecated since First stable release. References to <pipeline>.options will not be supported
    streaming = self.test_pipeline.options.view_as(StandardOptions).streaming

apache_beam/io/gcp/bigquery_read_it_test.py::ReadTests::test_native_source
  <https://ci-beam.apache.org/job/beam_PostCommit_Python37/ws/src/sdks/python/apache_beam/io/gcp/bigquery_read_it_test.py>:170: BeamDeprecationWarning: BigQuerySource is deprecated since 2.25.0. Use ReadFromBigQuery instead.
    beam.io.BigQuerySource(query=self.query, use_standard_sql=True)))

apache_beam/ml/gcp/cloud_dlp_it_test.py::CloudDLPIT::test_deidentification
  <https://ci-beam.apache.org/job/beam_PostCommit_Python37/ws/src/sdks/python/apache_beam/ml/gcp/cloud_dlp_it_test.py>:77: FutureWarning: MaskDetectedDetails is experimental.
    inspection_config=INSPECT_CONFIG))

apache_beam/ml/gcp/cloud_dlp_it_test.py::CloudDLPIT::test_inspection
  <https://ci-beam.apache.org/job/beam_PostCommit_Python37/ws/src/sdks/python/apache_beam/ml/gcp/cloud_dlp_it_test.py>:87: FutureWarning: InspectForDetails is experimental.
    | beam.ParDo(extract_inspection_results).with_outputs(

apache_beam/ml/inference/sklearn_inference_it_test.py::SklearnInference::test_sklearn_regression
  <https://ci-beam.apache.org/job/beam_PostCommit_Python37/ws/src/sdks/python/apache_beam/examples/inference/sklearn_japanese_housing_regression.py>:129: FutureWarning: SklearnModelHandlerPandas is experimental. No backwards-compatibility guarantees.
    model_file_type=ModelFileType.PICKLE, model_uri=model_filename)

apache_beam/ml/inference/sklearn_inference_it_test.py::SklearnInference::test_sklearn_regression
  <https://ci-beam.apache.org/job/beam_PostCommit_Python37/ws/src/build/gradleenv/-1734967052/lib/python3.7/site-packages/dill/_dill.py>:472: FutureWarning: SklearnModelHandlerPandas is experimental. No backwards-compatibility guarantees.
    obj = StockUnpickler.load(self)

apache_beam/io/gcp/bigquery_read_it_test.py::ReadNewTypesTests::test_native_source
  <https://ci-beam.apache.org/job/beam_PostCommit_Python37/ws/src/sdks/python/apache_beam/io/gcp/bigquery_read_it_test.py>:693: BeamDeprecationWarning: BigQuerySource is deprecated since 2.25.0. Use ReadFromBigQuery instead.
    beam.io.BigQuerySource(query=self.query, use_standard_sql=True)))

apache_beam/io/gcp/bigquery_read_it_test.py::ReadAllBQTests::test_read_queries
  <https://ci-beam.apache.org/job/beam_PostCommit_Python37/ws/src/sdks/python/apache_beam/io/gcp/bigquery_read_it_test.py>:808: FutureWarning: ReadAllFromBigQuery is experimental.
    | beam.io.ReadAllFromBigQuery())

apache_beam/io/gcp/bigquery_read_it_test.py::ReadAllBQTests::test_read_queries
  <https://ci-beam.apache.org/job/beam_PostCommit_Python37/ws/src/sdks/python/apache_beam/io/gcp/bigquery.py>:2658: BeamDeprecationWarning: options is deprecated since First stable release. References to <pipeline>.options will not be supported
    job_name = pcoll.pipeline.options.view_as(GoogleCloudOptions).job_name

apache_beam/io/gcp/bigquery_read_it_test.py::ReadAllBQTests::test_read_queries
  <https://ci-beam.apache.org/job/beam_PostCommit_Python37/ws/src/sdks/python/apache_beam/io/gcp/bigquery.py>:2659: BeamDeprecationWarning: options is deprecated since First stable release. References to <pipeline>.options will not be supported
    project = pcoll.pipeline.options.view_as(GoogleCloudOptions).project

apache_beam/io/gcp/bigquery_read_it_test.py::ReadAllBQTests::test_read_queries
  <https://ci-beam.apache.org/job/beam_PostCommit_Python37/ws/src/sdks/python/apache_beam/io/gcp/bigquery.py>:2672: BeamDeprecationWarning: options is deprecated since First stable release. References to <pipeline>.options will not be supported
    options=pcoll.pipeline.options,

-- Docs: https://docs.pytest.org/en/stable/how-to/capture-warnings.html
- generated xml file: <https://ci-beam.apache.org/job/beam_PostCommit_Python37/ws/src/sdks/python/pytest_postCommitIT-df-py37.xml> -
=========================== short test summary info ============================
FAILED apache_beam/examples/streaming_wordcount_it_test.py::StreamingWordCountIT::test_streaming_wordcount_it - google.api_core.exceptions.DeadlineExceeded: 504 Deadline Exceeded
===== 1 failed, 84 passed, 24 skipped, 225 warnings in 11772.96s (3:16:12) =====

> Task :sdks:python:test-suites:dataflow:py37:postCommitIT FAILED

> Task :sdks:python:test-suites:dataflow:py37:spannerioIT
>>> RUNNING integration tests with pipeline options: --runner=TestDataflowRunner --project=apache-beam-testing --region=us-central1 --staging_location=gs://temp-storage-for-end-to-end-tests/staging-it --temp_location=gs://temp-storage-for-end-to-end-tests/temp-it --output=gs://temp-storage-for-end-to-end-tests/py-it-cloud/output --sdk_location=<https://ci-beam.apache.org/job/beam_PostCommit_Python37/ws/src/sdks/python/build/apache-beam.tar.gz> --requirements_file=postcommit_requirements.txt --num_workers=1 --sleep_secs=20 --kms_key_name=projects/apache-beam-testing/locations/global/keyRings/beam-it/cryptoKeys/test --dataflow_kms_key=projects/apache-beam-testing/locations/global/keyRings/beam-it/cryptoKeys/test
>>>   pytest options: --capture=no --timeout=4500 --color=yes --log-cli-level=INFO --numprocesses=8 --dist=loadfile
>>>   collect markers: -m=spannerio_it
============================= test session starts ==============================
platform linux -- Python 3.7.12, pytest-7.2.1, pluggy-1.0.0
rootdir: <https://ci-beam.apache.org/job/beam_PostCommit_Python37/ws/src/sdks/python,> configfile: pytest.ini
plugins: xdist-2.5.0, timeout-2.1.0, hypothesis-6.68.1, forked-1.6.0, requests-mock-1.10.0
timeout: 4500.0s
timeout method: signal
timeout func_only: False
gw0 I / gw1 I / gw2 I / gw3 I / gw4 I / gw5 I / gw6 I / gw7 I
[gw0] Python 3.7.12 (default, Jan 15 2022, 18:42:10)  -- [GCC 9.3.0]
[gw1] Python 3.7.12 (default, Jan 15 2022, 18:42:10)  -- [GCC 9.3.0]
[gw2] Python 3.7.12 (default, Jan 15 2022, 18:42:10)  -- [GCC 9.3.0]
[gw3] Python 3.7.12 (default, Jan 15 2022, 18:42:10)  -- [GCC 9.3.0]
[gw4] Python 3.7.12 (default, Jan 15 2022, 18:42:10)  -- [GCC 9.3.0]
[gw5] Python 3.7.12 (default, Jan 15 2022, 18:42:10)  -- [GCC 9.3.0]
[gw6] Python 3.7.12 (default, Jan 15 2022, 18:42:10)  -- [GCC 9.3.0]
[gw7] Python 3.7.12 (default, Jan 15 2022, 18:42:10)  -- [GCC 9.3.0]
gw0 [15] / gw1 [15] / gw2 [15] / gw3 [15] / gw4 [15] / gw5 [15] / gw6 [15] / gw7 [15]

scheduling tests via LoadFileScheduling

apache_beam/io/gcp/experimental/spannerio_read_it_test.py::SpannerReadIntegrationTest::test_read_via_sql 
apache_beam/io/gcp/experimental/spannerio_write_it_test.py::SpannerWriteIntegrationTest::test_metrics_error_call 
[gw1] SKIPPED apache_beam/io/gcp/experimental/spannerio_write_it_test.py::SpannerWriteIntegrationTest::test_metrics_error_call 
apache_beam/io/gcp/experimental/spannerio_write_it_test.py::SpannerWriteIntegrationTest::test_metrics_ok_call 
[gw1] SKIPPED apache_beam/io/gcp/experimental/spannerio_write_it_test.py::SpannerWriteIntegrationTest::test_metrics_ok_call 
apache_beam/io/gcp/experimental/spannerio_write_it_test.py::SpannerWriteIntegrationTest::test_spanner_error 
[gw0] PASSED apache_beam/io/gcp/experimental/spannerio_read_it_test.py::SpannerReadIntegrationTest::test_read_via_sql 
apache_beam/io/gcp/experimental/spannerio_read_it_test.py::SpannerReadIntegrationTest::test_read_via_table 
[gw1] PASSED apache_beam/io/gcp/experimental/spannerio_write_it_test.py::SpannerWriteIntegrationTest::test_spanner_error 
apache_beam/io/gcp/experimental/spannerio_write_it_test.py::SpannerWriteIntegrationTest::test_spanner_update 
[gw1] PASSED apache_beam/io/gcp/experimental/spannerio_write_it_test.py::SpannerWriteIntegrationTest::test_spanner_update 
apache_beam/io/gcp/experimental/spannerio_write_it_test.py::SpannerWriteIntegrationTest::test_write_batches 
[gw0] PASSED apache_beam/io/gcp/experimental/spannerio_read_it_test.py::SpannerReadIntegrationTest::test_read_via_table 
apache_beam/io/gcp/experimental/spannerio_read_it_test.py::SpannerReadIntegrationTest::test_sql_metrics_error_call 
[gw0] SKIPPED apache_beam/io/gcp/experimental/spannerio_read_it_test.py::SpannerReadIntegrationTest::test_sql_metrics_error_call 
apache_beam/io/gcp/experimental/spannerio_read_it_test.py::SpannerReadIntegrationTest::test_sql_metrics_ok_call 
[gw0] SKIPPED apache_beam/io/gcp/experimental/spannerio_read_it_test.py::SpannerReadIntegrationTest::test_sql_metrics_ok_call 
apache_beam/io/gcp/experimental/spannerio_read_it_test.py::SpannerReadIntegrationTest::test_table_metrics_error_call 
[gw0] SKIPPED apache_beam/io/gcp/experimental/spannerio_read_it_test.py::SpannerReadIntegrationTest::test_table_metrics_error_call 
apache_beam/io/gcp/experimental/spannerio_read_it_test.py::SpannerReadIntegrationTest::test_table_metrics_ok_call 
[gw0] SKIPPED apache_beam/io/gcp/experimental/spannerio_read_it_test.py::SpannerReadIntegrationTest::test_table_metrics_ok_call 
apache_beam/io/gcp/experimental/spannerio_read_it_test.py::SpannerReadIntegrationTest::test_transaction_sql_metrics_error_call 
[gw0] SKIPPED apache_beam/io/gcp/experimental/spannerio_read_it_test.py::SpannerReadIntegrationTest::test_transaction_sql_metrics_error_call 
apache_beam/io/gcp/experimental/spannerio_read_it_test.py::SpannerReadIntegrationTest::test_transaction_sql_metrics_ok_call 
[gw0] SKIPPED apache_beam/io/gcp/experimental/spannerio_read_it_test.py::SpannerReadIntegrationTest::test_transaction_sql_metrics_ok_call 
apache_beam/io/gcp/experimental/spannerio_read_it_test.py::SpannerReadIntegrationTest::test_transaction_table_metrics_error_call 
[gw0] SKIPPED apache_beam/io/gcp/experimental/spannerio_read_it_test.py::SpannerReadIntegrationTest::test_transaction_table_metrics_error_call 
apache_beam/io/gcp/experimental/spannerio_read_it_test.py::SpannerReadIntegrationTest::test_transaction_table_metrics_ok_call 
[gw0] SKIPPED apache_beam/io/gcp/experimental/spannerio_read_it_test.py::SpannerReadIntegrationTest::test_transaction_table_metrics_ok_call 
[gw1] PASSED apache_beam/io/gcp/experimental/spannerio_write_it_test.py::SpannerWriteIntegrationTest::test_write_batches 

=============================== warnings summary ===============================
../../build/gradleenv/-1734967052/lib/python3.7/site-packages/hdfs/config.py:15
../../build/gradleenv/-1734967052/lib/python3.7/site-packages/hdfs/config.py:15
../../build/gradleenv/-1734967052/lib/python3.7/site-packages/hdfs/config.py:15
../../build/gradleenv/-1734967052/lib/python3.7/site-packages/hdfs/config.py:15
../../build/gradleenv/-1734967052/lib/python3.7/site-packages/hdfs/config.py:15
../../build/gradleenv/-1734967052/lib/python3.7/site-packages/hdfs/config.py:15
../../build/gradleenv/-1734967052/lib/python3.7/site-packages/hdfs/config.py:15
../../build/gradleenv/-1734967052/lib/python3.7/site-packages/hdfs/config.py:15
../../build/gradleenv/-1734967052/lib/python3.7/site-packages/hdfs/config.py:15
  <https://ci-beam.apache.org/job/beam_PostCommit_Python37/ws/src/build/gradleenv/-1734967052/lib/python3.7/site-packages/hdfs/config.py>:15: DeprecationWarning: the imp module is deprecated in favour of importlib; see the module's documentation for alternative uses
    from imp import load_source

apache_beam/io/gcp/experimental/spannerio_read_it_test.py::SpannerReadIntegrationTest::test_read_via_sql
  <https://ci-beam.apache.org/job/beam_PostCommit_Python37/ws/src/sdks/python/apache_beam/io/gcp/experimental/spannerio_read_it_test.py>:128: FutureWarning: ReadFromSpanner is experimental. No backwards-compatibility guarantees.
    sql="select * from Users")

apache_beam/io/gcp/experimental/spannerio_write_it_test.py::SpannerWriteIntegrationTest::test_spanner_error
  <https://ci-beam.apache.org/job/beam_PostCommit_Python37/ws/src/sdks/python/apache_beam/io/gcp/experimental/spannerio_write_it_test.py>:190: FutureWarning: WriteToSpanner is experimental. No backwards-compatibility guarantees.
    database_id=self.TEST_DATABASE))

apache_beam/io/gcp/experimental/spannerio_write_it_test.py::SpannerWriteIntegrationTest::test_spanner_update
  <https://ci-beam.apache.org/job/beam_PostCommit_Python37/ws/src/sdks/python/apache_beam/io/gcp/experimental/spannerio_write_it_test.py>:171: FutureWarning: WriteToSpanner is experimental. No backwards-compatibility guarantees.
    database_id=self.TEST_DATABASE))

apache_beam/io/gcp/experimental/spannerio_read_it_test.py::SpannerReadIntegrationTest::test_read_via_table
  <https://ci-beam.apache.org/job/beam_PostCommit_Python37/ws/src/sdks/python/apache_beam/io/gcp/experimental/spannerio_read_it_test.py>:117: FutureWarning: ReadFromSpanner is experimental. No backwards-compatibility guarantees.
    columns=["UserId", "Key"])

apache_beam/io/gcp/experimental/spannerio_write_it_test.py::SpannerWriteIntegrationTest::test_write_batches
  <https://ci-beam.apache.org/job/beam_PostCommit_Python37/ws/src/sdks/python/apache_beam/io/gcp/experimental/spannerio_write_it_test.py>:135: FutureWarning: WriteToSpanner is experimental. No backwards-compatibility guarantees.
    max_batch_size_bytes=250))

-- Docs: https://docs.pytest.org/en/stable/how-to/capture-warnings.html
- generated xml file: <https://ci-beam.apache.org/job/beam_PostCommit_Python37/ws/src/sdks/python/pytest_postCommitIT-df-py37.xml> -
=========== 5 passed, 17 skipped, 14 warnings in 1637.28s (0:27:17) ============

FAILURE: Build completed with 2 failures.

1: Task failed with an exception.
-----------
* What went wrong:
Execution failed for task ':sdks:java:container:pullLicenses'.
> Process 'command './license_scripts/license_script.sh'' finished with non-zero exit value 1

* Try:
> Run with --stacktrace option to get the stack trace.
> Run with --info or --debug option to get more log output.
==============================================================================

2: Task failed with an exception.
-----------
* Where:
Script '<https://ci-beam.apache.org/job/beam_PostCommit_Python37/ws/src/sdks/python/test-suites/dataflow/common.gradle'> line: 111

* What went wrong:
Execution failed for task ':sdks:python:test-suites:dataflow:py37:postCommitIT'.
> Process 'command 'sh'' finished with non-zero exit value 1

* Try:
> Run with --stacktrace option to get the stack trace.
> Run with --info or --debug option to get more log output.
==============================================================================

* Get more help at https://help.gradle.org

Deprecated Gradle features were used in this build, making it incompatible with Gradle 8.0.

You can use '--warning-mode all' to show the individual deprecation warnings and determine if they come from your own scripts or plugins.

See https://docs.gradle.org/7.5.1/userguide/command_line_interface.html#sec:command_line_warnings

Execution optimizations have been disabled for 1 invalid unit(s) of work during this build to ensure correctness.
Please consult deprecation warnings for more details.

BUILD FAILED in 3h 45m 56s
207 actionable tasks: 143 executed, 58 from cache, 6 up-to-date

Publishing build scan...
https://gradle.com/s/gl6ulvcif6feg

Build step 'Invoke Gradle script' changed build result to FAILURE
Build step 'Invoke Gradle script' marked build as failure

---------------------------------------------------------------------
To unsubscribe, e-mail: builds-unsubscribe@beam.apache.org
For additional commands, e-mail: builds-help@beam.apache.org


Build failed in Jenkins: beam_PostCommit_Python37 #6326

Posted by Apache Jenkins Server <je...@builds.apache.org>.
See <https://ci-beam.apache.org/job/beam_PostCommit_Python37/6326/display/redirect?page=changes>

Changes:

[xqhu] Ignore flags for beam_sql magic

[xqhu] Raise the error when some functions are misused

[xqhu] change how to import

[noreply] Validate that GBK coders are always set correctly. (#25394)

[noreply] Fix tox error running hdfsIntegrationTest (#25446)

[noreply] Adding support for DLQ for ZetaSQL (#25426)


------------------------------------------
[...truncated 1.02 MB...]
  <https://ci-beam.apache.org/job/beam_PostCommit_Python37/ws/src/sdks/python/apache_beam/io/gcp/bigquery.py>:1992: BeamDeprecationWarning: options is deprecated since First stable release. References to <pipeline>.options will not be supported
    is_streaming_pipeline = p.options.view_as(StandardOptions).streaming

apache_beam/examples/complete/game/game_stats_it_test.py: 2 warnings
apache_beam/examples/cookbook/bigquery_tornadoes_it_test.py: 1 warning
apache_beam/examples/complete/game/hourly_team_score_it_test.py: 1 warning
apache_beam/io/gcp/bigquery_file_loads_test.py: 3 warnings
apache_beam/examples/complete/game/leader_board_it_test.py: 2 warnings
apache_beam/io/gcp/bigquery_test.py: 6 warnings
apache_beam/io/gcp/bigquery_write_it_test.py: 4 warnings
apache_beam/io/gcp/big_query_query_to_table_it_test.py: 4 warnings
apache_beam/io/gcp/bigquery_json_it_test.py: 2 warnings
  <https://ci-beam.apache.org/job/beam_PostCommit_Python37/ws/src/sdks/python/apache_beam/io/gcp/bigquery.py>:1998: BeamDeprecationWarning: options is deprecated since First stable release. References to <pipeline>.options will not be supported
    experiments = p.options.view_as(DebugOptions).experiments or []

apache_beam/dataframe/io_it_test.py: 2 warnings
apache_beam/io/gcp/bigquery_json_it_test.py: 1 warning
apache_beam/io/gcp/bigquery_read_it_test.py: 9 warnings
  <https://ci-beam.apache.org/job/beam_PostCommit_Python37/ws/src/sdks/python/apache_beam/io/gcp/bigquery.py>:2529: BeamDeprecationWarning: options is deprecated since First stable release. References to <pipeline>.options will not be supported
    project_id = pcoll.pipeline.options.view_as(GoogleCloudOptions).project

apache_beam/dataframe/io_it_test.py: 2 warnings
apache_beam/io/gcp/bigquery_json_it_test.py: 1 warning
apache_beam/io/gcp/bigquery_read_it_test.py: 9 warnings
  <https://ci-beam.apache.org/job/beam_PostCommit_Python37/ws/src/sdks/python/apache_beam/io/gcp/bigquery.py>:2557: BeamDeprecationWarning: options is deprecated since First stable release. References to <pipeline>.options will not be supported
    | _PassThroughThenCleanupTempDatasets(project_to_cleanup_pcoll))

apache_beam/examples/cookbook/bigquery_tornadoes_it_test.py: 1 warning
apache_beam/io/gcp/bigquery_write_it_test.py: 4 warnings
apache_beam/io/gcp/big_query_query_to_table_it_test.py: 4 warnings
apache_beam/io/gcp/bigquery_test.py: 2 warnings
  <https://ci-beam.apache.org/job/beam_PostCommit_Python37/ws/src/sdks/python/apache_beam/io/gcp/bigquery.py>:1988: BeamDeprecationWarning: options is deprecated since First stable release. References to <pipeline>.options will not be supported
    self.table_reference.projectId = pcoll.pipeline.options.view_as(

apache_beam/examples/cookbook/bigquery_tornadoes_it_test.py: 1 warning
apache_beam/io/gcp/bigquery_file_loads_test.py: 3 warnings
apache_beam/io/gcp/bigquery_write_it_test.py: 3 warnings
apache_beam/io/gcp/big_query_query_to_table_it_test.py: 4 warnings
apache_beam/io/gcp/bigquery_test.py: 3 warnings
  <https://ci-beam.apache.org/job/beam_PostCommit_Python37/ws/src/sdks/python/apache_beam/io/gcp/bigquery_file_loads.py>:1166: BeamDeprecationWarning: options is deprecated since First stable release. References to <pipeline>.options will not be supported
    self.project = self.project or p.options.view_as(GoogleCloudOptions).project

apache_beam/examples/cookbook/bigquery_tornadoes_it_test.py: 1 warning
apache_beam/examples/complete/game/hourly_team_score_it_test.py: 1 warning
apache_beam/io/gcp/bigquery_file_loads_test.py: 3 warnings
apache_beam/io/gcp/bigquery_write_it_test.py: 3 warnings
apache_beam/io/gcp/big_query_query_to_table_it_test.py: 4 warnings
apache_beam/io/gcp/bigquery_test.py: 3 warnings
  <https://ci-beam.apache.org/job/beam_PostCommit_Python37/ws/src/sdks/python/apache_beam/io/gcp/bigquery_file_loads.py>:1173: BeamDeprecationWarning: options is deprecated since First stable release. References to <pipeline>.options will not be supported
    temp_location = p.options.view_as(GoogleCloudOptions).temp_location

apache_beam/examples/cookbook/bigquery_tornadoes_it_test.py: 1 warning
apache_beam/examples/complete/game/hourly_team_score_it_test.py: 1 warning
apache_beam/io/gcp/bigquery_file_loads_test.py: 3 warnings
apache_beam/io/gcp/bigquery_write_it_test.py: 3 warnings
apache_beam/io/gcp/big_query_query_to_table_it_test.py: 4 warnings
apache_beam/io/gcp/bigquery_test.py: 3 warnings
  <https://ci-beam.apache.org/job/beam_PostCommit_Python37/ws/src/sdks/python/apache_beam/io/gcp/bigquery_file_loads.py>:1175: BeamDeprecationWarning: options is deprecated since First stable release. References to <pipeline>.options will not be supported
    p.options.view_as(GoogleCloudOptions).job_name or 'AUTOMATIC_JOB_NAME')

apache_beam/examples/cookbook/bigquery_tornadoes_it_test.py::BigqueryTornadoesIT::test_bigquery_tornadoes_it
  <https://ci-beam.apache.org/job/beam_PostCommit_Python37/ws/src/sdks/python/apache_beam/io/gcp/tests/utils.py>:100: PendingDeprecationWarning: Client.dataset is deprecated and will be removed in a future version. Use a string like 'my_project.my_dataset' or a cloud.google.bigquery.DatasetReference object, instead.
    table_ref = client.dataset(dataset_id).table(table_id)

apache_beam/examples/dataframe/flight_delays_it_test.py::FlightDelaysTest::test_flight_delays
  <https://ci-beam.apache.org/job/beam_PostCommit_Python37/ws/src/sdks/python/apache_beam/examples/dataframe/flight_delays.py>:47: FutureWarning: Dropping of nuisance columns in DataFrame reductions (with 'numeric_only=None') is deprecated; in a future version this will raise TypeError.  Select only valid columns before calling the reduction.
    return airline_df[at_top_airports].mean()

apache_beam/examples/dataframe/flight_delays_it_test.py::FlightDelaysTest::test_flight_delays
apache_beam/examples/dataframe/taxiride_it_test.py::TaxirideIT::test_aggregation
apache_beam/examples/dataframe/taxiride_it_test.py::TaxirideIT::test_enrich
  <https://ci-beam.apache.org/job/beam_PostCommit_Python37/ws/src/sdks/python/apache_beam/dataframe/io.py>:664: FutureWarning: WriteToFiles is experimental.
    sink=lambda _: _WriteToPandasFileSink(

apache_beam/examples/dataframe/flight_delays_it_test.py::FlightDelaysTest::test_flight_delays
apache_beam/examples/dataframe/taxiride_it_test.py::TaxirideIT::test_aggregation
apache_beam/examples/dataframe/taxiride_it_test.py::TaxirideIT::test_enrich
  <https://ci-beam.apache.org/job/beam_PostCommit_Python37/ws/src/sdks/python/apache_beam/io/fileio.py>:593: BeamDeprecationWarning: options is deprecated since First stable release. References to <pipeline>.options will not be supported
    p.options.view_as(GoogleCloudOptions).temp_location or

apache_beam/io/gcp/bigquery_test.py::BigQueryStreamingInsertTransformIntegrationTests::test_multiple_destinations_transform
  <https://ci-beam.apache.org/job/beam_PostCommit_Python37/ws/src/sdks/python/apache_beam/io/gcp/bigquery_test.py>:1690: BeamDeprecationWarning: options is deprecated since First stable release. References to <pipeline>.options will not be supported
    streaming = self.test_pipeline.options.view_as(StandardOptions).streaming

apache_beam/io/gcp/bigquery_read_it_test.py::ReadTests::test_native_source
  <https://ci-beam.apache.org/job/beam_PostCommit_Python37/ws/src/sdks/python/apache_beam/io/gcp/bigquery_read_it_test.py>:170: BeamDeprecationWarning: BigQuerySource is deprecated since 2.25.0. Use ReadFromBigQuery instead.
    beam.io.BigQuerySource(query=self.query, use_standard_sql=True)))

apache_beam/ml/gcp/cloud_dlp_it_test.py::CloudDLPIT::test_deidentification
  <https://ci-beam.apache.org/job/beam_PostCommit_Python37/ws/src/sdks/python/apache_beam/ml/gcp/cloud_dlp_it_test.py>:77: FutureWarning: MaskDetectedDetails is experimental.
    inspection_config=INSPECT_CONFIG))

apache_beam/ml/gcp/cloud_dlp_it_test.py::CloudDLPIT::test_inspection
  <https://ci-beam.apache.org/job/beam_PostCommit_Python37/ws/src/sdks/python/apache_beam/ml/gcp/cloud_dlp_it_test.py>:87: FutureWarning: InspectForDetails is experimental.
    | beam.ParDo(extract_inspection_results).with_outputs(

apache_beam/ml/inference/sklearn_inference_it_test.py::SklearnInference::test_sklearn_regression
  <https://ci-beam.apache.org/job/beam_PostCommit_Python37/ws/src/sdks/python/apache_beam/examples/inference/sklearn_japanese_housing_regression.py>:129: FutureWarning: SklearnModelHandlerPandas is experimental. No backwards-compatibility guarantees.
    model_file_type=ModelFileType.PICKLE, model_uri=model_filename)

apache_beam/ml/inference/sklearn_inference_it_test.py::SklearnInference::test_sklearn_regression
  <https://ci-beam.apache.org/job/beam_PostCommit_Python37/ws/src/build/gradleenv/-1734967052/lib/python3.7/site-packages/dill/_dill.py>:472: FutureWarning: SklearnModelHandlerPandas is experimental. No backwards-compatibility guarantees.
    obj = StockUnpickler.load(self)

apache_beam/io/gcp/bigquery_read_it_test.py::ReadNewTypesTests::test_native_source
  <https://ci-beam.apache.org/job/beam_PostCommit_Python37/ws/src/sdks/python/apache_beam/io/gcp/bigquery_read_it_test.py>:693: BeamDeprecationWarning: BigQuerySource is deprecated since 2.25.0. Use ReadFromBigQuery instead.
    beam.io.BigQuerySource(query=self.query, use_standard_sql=True)))

apache_beam/io/gcp/bigquery_read_it_test.py::ReadAllBQTests::test_read_queries
  <https://ci-beam.apache.org/job/beam_PostCommit_Python37/ws/src/sdks/python/apache_beam/io/gcp/bigquery_read_it_test.py>:808: FutureWarning: ReadAllFromBigQuery is experimental.
    | beam.io.ReadAllFromBigQuery())

apache_beam/io/gcp/bigquery_read_it_test.py::ReadAllBQTests::test_read_queries
  <https://ci-beam.apache.org/job/beam_PostCommit_Python37/ws/src/sdks/python/apache_beam/io/gcp/bigquery.py>:2658: BeamDeprecationWarning: options is deprecated since First stable release. References to <pipeline>.options will not be supported
    job_name = pcoll.pipeline.options.view_as(GoogleCloudOptions).job_name

apache_beam/io/gcp/bigquery_read_it_test.py::ReadAllBQTests::test_read_queries
  <https://ci-beam.apache.org/job/beam_PostCommit_Python37/ws/src/sdks/python/apache_beam/io/gcp/bigquery.py>:2659: BeamDeprecationWarning: options is deprecated since First stable release. References to <pipeline>.options will not be supported
    project = pcoll.pipeline.options.view_as(GoogleCloudOptions).project

apache_beam/io/gcp/bigquery_read_it_test.py::ReadAllBQTests::test_read_queries
  <https://ci-beam.apache.org/job/beam_PostCommit_Python37/ws/src/sdks/python/apache_beam/io/gcp/bigquery.py>:2672: BeamDeprecationWarning: options is deprecated since First stable release. References to <pipeline>.options will not be supported
    options=pcoll.pipeline.options,

-- Docs: https://docs.pytest.org/en/stable/how-to/capture-warnings.html
- generated xml file: <https://ci-beam.apache.org/job/beam_PostCommit_Python37/ws/src/sdks/python/pytest_postCommitIT-df-py37.xml> -
========== 85 passed, 24 skipped, 225 warnings in 11990.78s (3:19:50) ==========

> Task :sdks:python:test-suites:dataflow:py37:spannerioIT
>>> RUNNING integration tests with pipeline options: --runner=TestDataflowRunner --project=apache-beam-testing --region=us-central1 --staging_location=gs://temp-storage-for-end-to-end-tests/staging-it --temp_location=gs://temp-storage-for-end-to-end-tests/temp-it --output=gs://temp-storage-for-end-to-end-tests/py-it-cloud/output --sdk_location=<https://ci-beam.apache.org/job/beam_PostCommit_Python37/ws/src/sdks/python/build/apache-beam.tar.gz> --requirements_file=postcommit_requirements.txt --num_workers=1 --sleep_secs=20 --kms_key_name=projects/apache-beam-testing/locations/global/keyRings/beam-it/cryptoKeys/test --dataflow_kms_key=projects/apache-beam-testing/locations/global/keyRings/beam-it/cryptoKeys/test
>>>   pytest options: --capture=no --timeout=4500 --color=yes --log-cli-level=INFO --numprocesses=8 --dist=loadfile
>>>   collect markers: -m=spannerio_it
============================= test session starts ==============================
platform linux -- Python 3.7.12, pytest-7.2.1, pluggy-1.0.0
rootdir: <https://ci-beam.apache.org/job/beam_PostCommit_Python37/ws/src/sdks/python,> configfile: pytest.ini
plugins: xdist-2.5.0, timeout-2.1.0, hypothesis-6.68.1, forked-1.6.0, requests-mock-1.10.0
timeout: 4500.0s
timeout method: signal
timeout func_only: False
gw0 I / gw1 I / gw2 I / gw3 I / gw4 I / gw5 I / gw6 I / gw7 I
[gw0] Python 3.7.12 (default, Jan 15 2022, 18:42:10)  -- [GCC 9.3.0]
[gw2] Python 3.7.12 (default, Jan 15 2022, 18:42:10)  -- [GCC 9.3.0]
[gw4] Python 3.7.12 (default, Jan 15 2022, 18:42:10)  -- [GCC 9.3.0]
[gw1] Python 3.7.12 (default, Jan 15 2022, 18:42:10)  -- [GCC 9.3.0]
[gw3] Python 3.7.12 (default, Jan 15 2022, 18:42:10)  -- [GCC 9.3.0]
[gw6] Python 3.7.12 (default, Jan 15 2022, 18:42:10)  -- [GCC 9.3.0]
[gw5] Python 3.7.12 (default, Jan 15 2022, 18:42:10)  -- [GCC 9.3.0]
[gw7] Python 3.7.12 (default, Jan 15 2022, 18:42:10)  -- [GCC 9.3.0]
gw0 [15] / gw1 [15] / gw2 [15] / gw3 [15] / gw4 [15] / gw5 [15] / gw6 [15] / gw7 [15]

scheduling tests via LoadFileScheduling

apache_beam/io/gcp/experimental/spannerio_read_it_test.py::SpannerReadIntegrationTest::test_read_via_sql 
apache_beam/io/gcp/experimental/spannerio_write_it_test.py::SpannerWriteIntegrationTest::test_metrics_error_call 
[gw2] SKIPPED apache_beam/io/gcp/experimental/spannerio_write_it_test.py::SpannerWriteIntegrationTest::test_metrics_error_call 
apache_beam/io/gcp/experimental/spannerio_write_it_test.py::SpannerWriteIntegrationTest::test_metrics_ok_call 
[gw2] SKIPPED apache_beam/io/gcp/experimental/spannerio_write_it_test.py::SpannerWriteIntegrationTest::test_metrics_ok_call 
apache_beam/io/gcp/experimental/spannerio_write_it_test.py::SpannerWriteIntegrationTest::test_spanner_error 
[gw2] PASSED apache_beam/io/gcp/experimental/spannerio_write_it_test.py::SpannerWriteIntegrationTest::test_spanner_error 
apache_beam/io/gcp/experimental/spannerio_write_it_test.py::SpannerWriteIntegrationTest::test_spanner_update 
[gw0] PASSED apache_beam/io/gcp/experimental/spannerio_read_it_test.py::SpannerReadIntegrationTest::test_read_via_sql 
apache_beam/io/gcp/experimental/spannerio_read_it_test.py::SpannerReadIntegrationTest::test_read_via_table 
[gw2] PASSED apache_beam/io/gcp/experimental/spannerio_write_it_test.py::SpannerWriteIntegrationTest::test_spanner_update 
apache_beam/io/gcp/experimental/spannerio_write_it_test.py::SpannerWriteIntegrationTest::test_write_batches 
[gw0] PASSED apache_beam/io/gcp/experimental/spannerio_read_it_test.py::SpannerReadIntegrationTest::test_read_via_table 
apache_beam/io/gcp/experimental/spannerio_read_it_test.py::SpannerReadIntegrationTest::test_sql_metrics_error_call 
[gw0] SKIPPED apache_beam/io/gcp/experimental/spannerio_read_it_test.py::SpannerReadIntegrationTest::test_sql_metrics_error_call 
apache_beam/io/gcp/experimental/spannerio_read_it_test.py::SpannerReadIntegrationTest::test_sql_metrics_ok_call 
[gw0] SKIPPED apache_beam/io/gcp/experimental/spannerio_read_it_test.py::SpannerReadIntegrationTest::test_sql_metrics_ok_call 
apache_beam/io/gcp/experimental/spannerio_read_it_test.py::SpannerReadIntegrationTest::test_table_metrics_error_call 
[gw0] SKIPPED apache_beam/io/gcp/experimental/spannerio_read_it_test.py::SpannerReadIntegrationTest::test_table_metrics_error_call 
apache_beam/io/gcp/experimental/spannerio_read_it_test.py::SpannerReadIntegrationTest::test_table_metrics_ok_call 
[gw0] SKIPPED apache_beam/io/gcp/experimental/spannerio_read_it_test.py::SpannerReadIntegrationTest::test_table_metrics_ok_call 
apache_beam/io/gcp/experimental/spannerio_read_it_test.py::SpannerReadIntegrationTest::test_transaction_sql_metrics_error_call 
[gw0] SKIPPED apache_beam/io/gcp/experimental/spannerio_read_it_test.py::SpannerReadIntegrationTest::test_transaction_sql_metrics_error_call 
apache_beam/io/gcp/experimental/spannerio_read_it_test.py::SpannerReadIntegrationTest::test_transaction_sql_metrics_ok_call 
[gw0] SKIPPED apache_beam/io/gcp/experimental/spannerio_read_it_test.py::SpannerReadIntegrationTest::test_transaction_sql_metrics_ok_call 
apache_beam/io/gcp/experimental/spannerio_read_it_test.py::SpannerReadIntegrationTest::test_transaction_table_metrics_error_call 
[gw0] SKIPPED apache_beam/io/gcp/experimental/spannerio_read_it_test.py::SpannerReadIntegrationTest::test_transaction_table_metrics_error_call 
apache_beam/io/gcp/experimental/spannerio_read_it_test.py::SpannerReadIntegrationTest::test_transaction_table_metrics_ok_call 
[gw0] SKIPPED apache_beam/io/gcp/experimental/spannerio_read_it_test.py::SpannerReadIntegrationTest::test_transaction_table_metrics_ok_call 
[gw2] PASSED apache_beam/io/gcp/experimental/spannerio_write_it_test.py::SpannerWriteIntegrationTest::test_write_batches 

=============================== warnings summary ===============================
../../build/gradleenv/-1734967052/lib/python3.7/site-packages/hdfs/config.py:15
../../build/gradleenv/-1734967052/lib/python3.7/site-packages/hdfs/config.py:15
../../build/gradleenv/-1734967052/lib/python3.7/site-packages/hdfs/config.py:15
../../build/gradleenv/-1734967052/lib/python3.7/site-packages/hdfs/config.py:15
../../build/gradleenv/-1734967052/lib/python3.7/site-packages/hdfs/config.py:15
../../build/gradleenv/-1734967052/lib/python3.7/site-packages/hdfs/config.py:15
../../build/gradleenv/-1734967052/lib/python3.7/site-packages/hdfs/config.py:15
../../build/gradleenv/-1734967052/lib/python3.7/site-packages/hdfs/config.py:15
../../build/gradleenv/-1734967052/lib/python3.7/site-packages/hdfs/config.py:15
  <https://ci-beam.apache.org/job/beam_PostCommit_Python37/ws/src/build/gradleenv/-1734967052/lib/python3.7/site-packages/hdfs/config.py>:15: DeprecationWarning: the imp module is deprecated in favour of importlib; see the module's documentation for alternative uses
    from imp import load_source

apache_beam/io/gcp/experimental/spannerio_write_it_test.py::SpannerWriteIntegrationTest::test_spanner_error
  <https://ci-beam.apache.org/job/beam_PostCommit_Python37/ws/src/sdks/python/apache_beam/io/gcp/experimental/spannerio_write_it_test.py>:190: FutureWarning: WriteToSpanner is experimental. No backwards-compatibility guarantees.
    database_id=self.TEST_DATABASE))

apache_beam/io/gcp/experimental/spannerio_read_it_test.py::SpannerReadIntegrationTest::test_read_via_sql
  <https://ci-beam.apache.org/job/beam_PostCommit_Python37/ws/src/sdks/python/apache_beam/io/gcp/experimental/spannerio_read_it_test.py>:128: FutureWarning: ReadFromSpanner is experimental. No backwards-compatibility guarantees.
    sql="select * from Users")

apache_beam/io/gcp/experimental/spannerio_write_it_test.py::SpannerWriteIntegrationTest::test_spanner_update
  <https://ci-beam.apache.org/job/beam_PostCommit_Python37/ws/src/sdks/python/apache_beam/io/gcp/experimental/spannerio_write_it_test.py>:171: FutureWarning: WriteToSpanner is experimental. No backwards-compatibility guarantees.
    database_id=self.TEST_DATABASE))

apache_beam/io/gcp/experimental/spannerio_read_it_test.py::SpannerReadIntegrationTest::test_read_via_table
  <https://ci-beam.apache.org/job/beam_PostCommit_Python37/ws/src/sdks/python/apache_beam/io/gcp/experimental/spannerio_read_it_test.py>:117: FutureWarning: ReadFromSpanner is experimental. No backwards-compatibility guarantees.
    columns=["UserId", "Key"])

apache_beam/io/gcp/experimental/spannerio_write_it_test.py::SpannerWriteIntegrationTest::test_write_batches
  <https://ci-beam.apache.org/job/beam_PostCommit_Python37/ws/src/sdks/python/apache_beam/io/gcp/experimental/spannerio_write_it_test.py>:135: FutureWarning: WriteToSpanner is experimental. No backwards-compatibility guarantees.
    max_batch_size_bytes=250))

-- Docs: https://docs.pytest.org/en/stable/how-to/capture-warnings.html
- generated xml file: <https://ci-beam.apache.org/job/beam_PostCommit_Python37/ws/src/sdks/python/pytest_postCommitIT-df-py37.xml> -
=========== 5 passed, 17 skipped, 14 warnings in 1832.53s (0:30:32) ============

FAILURE: Build failed with an exception.

* What went wrong:
Execution failed for task ':sdks:java:container:pullLicenses'.
> Process 'command './license_scripts/license_script.sh'' finished with non-zero exit value 1

* Try:
> Run with --stacktrace option to get the stack trace.
> Run with --info or --debug option to get more log output.

* Get more help at https://help.gradle.org

Deprecated Gradle features were used in this build, making it incompatible with Gradle 8.0.

You can use '--warning-mode all' to show the individual deprecation warnings and determine if they come from your own scripts or plugins.

See https://docs.gradle.org/7.5.1/userguide/command_line_interface.html#sec:command_line_warnings

Execution optimizations have been disabled for 1 invalid unit(s) of work during this build to ensure correctness.
Please consult deprecation warnings for more details.

BUILD FAILED in 3h 52m 46s
207 actionable tasks: 155 executed, 46 from cache, 6 up-to-date

Publishing build scan...
https://gradle.com/s/pmowc5oobqufs

Build step 'Invoke Gradle script' changed build result to FAILURE
Build step 'Invoke Gradle script' marked build as failure

---------------------------------------------------------------------
To unsubscribe, e-mail: builds-unsubscribe@beam.apache.org
For additional commands, e-mail: builds-help@beam.apache.org


Build failed in Jenkins: beam_PostCommit_Python37 #6325

Posted by Apache Jenkins Server <je...@builds.apache.org>.
See <https://ci-beam.apache.org/job/beam_PostCommit_Python37/6325/display/redirect?page=changes>

Changes:

[noreply] (#25316) Enable LZMA compression in Python SDK I/O (#25317)

[noreply] Add WatchFilePattern  (#25393)

[noreply] Support gauge metrics in portable mode (#25396)


------------------------------------------
[...truncated 947.31 KB...]
  <https://ci-beam.apache.org/job/beam_PostCommit_Python37/ws/src/sdks/python/apache_beam/io/gcp/bigquery.py>:1988: BeamDeprecationWarning: options is deprecated since First stable release. References to <pipeline>.options will not be supported
    self.table_reference.projectId = pcoll.pipeline.options.view_as(

apache_beam/examples/cookbook/bigquery_tornadoes_it_test.py: 1 warning
apache_beam/io/gcp/bigquery_file_loads_test.py: 3 warnings
apache_beam/io/gcp/big_query_query_to_table_it_test.py: 4 warnings
apache_beam/io/gcp/bigquery_write_it_test.py: 3 warnings
apache_beam/io/gcp/bigquery_test.py: 3 warnings
  <https://ci-beam.apache.org/job/beam_PostCommit_Python37/ws/src/sdks/python/apache_beam/io/gcp/bigquery_file_loads.py>:1166: BeamDeprecationWarning: options is deprecated since First stable release. References to <pipeline>.options will not be supported
    self.project = self.project or p.options.view_as(GoogleCloudOptions).project

apache_beam/examples/cookbook/bigquery_tornadoes_it_test.py: 1 warning
apache_beam/examples/complete/game/hourly_team_score_it_test.py: 1 warning
apache_beam/io/gcp/bigquery_file_loads_test.py: 3 warnings
apache_beam/io/gcp/big_query_query_to_table_it_test.py: 4 warnings
apache_beam/io/gcp/bigquery_write_it_test.py: 3 warnings
apache_beam/io/gcp/bigquery_test.py: 3 warnings
  <https://ci-beam.apache.org/job/beam_PostCommit_Python37/ws/src/sdks/python/apache_beam/io/gcp/bigquery_file_loads.py>:1173: BeamDeprecationWarning: options is deprecated since First stable release. References to <pipeline>.options will not be supported
    temp_location = p.options.view_as(GoogleCloudOptions).temp_location

apache_beam/examples/cookbook/bigquery_tornadoes_it_test.py: 1 warning
apache_beam/examples/complete/game/hourly_team_score_it_test.py: 1 warning
apache_beam/io/gcp/bigquery_file_loads_test.py: 3 warnings
apache_beam/io/gcp/big_query_query_to_table_it_test.py: 4 warnings
apache_beam/io/gcp/bigquery_write_it_test.py: 3 warnings
apache_beam/io/gcp/bigquery_test.py: 3 warnings
  <https://ci-beam.apache.org/job/beam_PostCommit_Python37/ws/src/sdks/python/apache_beam/io/gcp/bigquery_file_loads.py>:1175: BeamDeprecationWarning: options is deprecated since First stable release. References to <pipeline>.options will not be supported
    p.options.view_as(GoogleCloudOptions).job_name or 'AUTOMATIC_JOB_NAME')

apache_beam/examples/cookbook/bigquery_tornadoes_it_test.py::BigqueryTornadoesIT::test_bigquery_tornadoes_it
  <https://ci-beam.apache.org/job/beam_PostCommit_Python37/ws/src/sdks/python/apache_beam/io/gcp/tests/utils.py>:100: PendingDeprecationWarning: Client.dataset is deprecated and will be removed in a future version. Use a string like 'my_project.my_dataset' or a cloud.google.bigquery.DatasetReference object, instead.
    table_ref = client.dataset(dataset_id).table(table_id)

apache_beam/examples/dataframe/flight_delays_it_test.py::FlightDelaysTest::test_flight_delays
  <https://ci-beam.apache.org/job/beam_PostCommit_Python37/ws/src/sdks/python/apache_beam/examples/dataframe/flight_delays.py>:47: FutureWarning: Dropping of nuisance columns in DataFrame reductions (with 'numeric_only=None') is deprecated; in a future version this will raise TypeError.  Select only valid columns before calling the reduction.
    return airline_df[at_top_airports].mean()

apache_beam/examples/dataframe/flight_delays_it_test.py::FlightDelaysTest::test_flight_delays
apache_beam/examples/dataframe/taxiride_it_test.py::TaxirideIT::test_aggregation
apache_beam/examples/dataframe/taxiride_it_test.py::TaxirideIT::test_enrich
  <https://ci-beam.apache.org/job/beam_PostCommit_Python37/ws/src/sdks/python/apache_beam/dataframe/io.py>:664: FutureWarning: WriteToFiles is experimental.
    sink=lambda _: _WriteToPandasFileSink(

apache_beam/examples/dataframe/flight_delays_it_test.py::FlightDelaysTest::test_flight_delays
apache_beam/examples/dataframe/taxiride_it_test.py::TaxirideIT::test_aggregation
apache_beam/examples/dataframe/taxiride_it_test.py::TaxirideIT::test_enrich
  <https://ci-beam.apache.org/job/beam_PostCommit_Python37/ws/src/sdks/python/apache_beam/io/fileio.py>:593: BeamDeprecationWarning: options is deprecated since First stable release. References to <pipeline>.options will not be supported
    p.options.view_as(GoogleCloudOptions).temp_location or

apache_beam/io/gcp/bigquery_test.py::BigQueryStreamingInsertTransformIntegrationTests::test_multiple_destinations_transform
  <https://ci-beam.apache.org/job/beam_PostCommit_Python37/ws/src/sdks/python/apache_beam/io/gcp/bigquery_test.py>:1690: BeamDeprecationWarning: options is deprecated since First stable release. References to <pipeline>.options will not be supported
    streaming = self.test_pipeline.options.view_as(StandardOptions).streaming

apache_beam/io/gcp/bigquery_read_it_test.py::ReadTests::test_native_source
  <https://ci-beam.apache.org/job/beam_PostCommit_Python37/ws/src/sdks/python/apache_beam/io/gcp/bigquery_read_it_test.py>:170: BeamDeprecationWarning: BigQuerySource is deprecated since 2.25.0. Use ReadFromBigQuery instead.
    beam.io.BigQuerySource(query=self.query, use_standard_sql=True)))

apache_beam/ml/gcp/cloud_dlp_it_test.py::CloudDLPIT::test_deidentification
  <https://ci-beam.apache.org/job/beam_PostCommit_Python37/ws/src/sdks/python/apache_beam/ml/gcp/cloud_dlp_it_test.py>:77: FutureWarning: MaskDetectedDetails is experimental.
    inspection_config=INSPECT_CONFIG))

apache_beam/ml/gcp/cloud_dlp_it_test.py::CloudDLPIT::test_inspection
  <https://ci-beam.apache.org/job/beam_PostCommit_Python37/ws/src/sdks/python/apache_beam/ml/gcp/cloud_dlp_it_test.py>:87: FutureWarning: InspectForDetails is experimental.
    | beam.ParDo(extract_inspection_results).with_outputs(

apache_beam/ml/inference/sklearn_inference_it_test.py::SklearnInference::test_sklearn_regression
  <https://ci-beam.apache.org/job/beam_PostCommit_Python37/ws/src/sdks/python/apache_beam/examples/inference/sklearn_japanese_housing_regression.py>:129: FutureWarning: SklearnModelHandlerPandas is experimental. No backwards-compatibility guarantees.
    model_file_type=ModelFileType.PICKLE, model_uri=model_filename)

apache_beam/ml/inference/sklearn_inference_it_test.py::SklearnInference::test_sklearn_regression
  <https://ci-beam.apache.org/job/beam_PostCommit_Python37/ws/src/build/gradleenv/-1734967052/lib/python3.7/site-packages/dill/_dill.py>:472: FutureWarning: SklearnModelHandlerPandas is experimental. No backwards-compatibility guarantees.
    obj = StockUnpickler.load(self)

apache_beam/io/gcp/bigquery_read_it_test.py::ReadNewTypesTests::test_native_source
  <https://ci-beam.apache.org/job/beam_PostCommit_Python37/ws/src/sdks/python/apache_beam/io/gcp/bigquery_read_it_test.py>:693: BeamDeprecationWarning: BigQuerySource is deprecated since 2.25.0. Use ReadFromBigQuery instead.
    beam.io.BigQuerySource(query=self.query, use_standard_sql=True)))

apache_beam/io/gcp/bigquery_read_it_test.py::ReadAllBQTests::test_read_queries
  <https://ci-beam.apache.org/job/beam_PostCommit_Python37/ws/src/sdks/python/apache_beam/io/gcp/bigquery_read_it_test.py>:808: FutureWarning: ReadAllFromBigQuery is experimental.
    | beam.io.ReadAllFromBigQuery())

apache_beam/io/gcp/bigquery_read_it_test.py::ReadAllBQTests::test_read_queries
  <https://ci-beam.apache.org/job/beam_PostCommit_Python37/ws/src/sdks/python/apache_beam/io/gcp/bigquery.py>:2658: BeamDeprecationWarning: options is deprecated since First stable release. References to <pipeline>.options will not be supported
    job_name = pcoll.pipeline.options.view_as(GoogleCloudOptions).job_name

apache_beam/io/gcp/bigquery_read_it_test.py::ReadAllBQTests::test_read_queries
  <https://ci-beam.apache.org/job/beam_PostCommit_Python37/ws/src/sdks/python/apache_beam/io/gcp/bigquery.py>:2659: BeamDeprecationWarning: options is deprecated since First stable release. References to <pipeline>.options will not be supported
    project = pcoll.pipeline.options.view_as(GoogleCloudOptions).project

apache_beam/io/gcp/bigquery_read_it_test.py::ReadAllBQTests::test_read_queries
  <https://ci-beam.apache.org/job/beam_PostCommit_Python37/ws/src/sdks/python/apache_beam/io/gcp/bigquery.py>:2672: BeamDeprecationWarning: options is deprecated since First stable release. References to <pipeline>.options will not be supported
    options=pcoll.pipeline.options,

-- Docs: https://docs.pytest.org/en/stable/how-to/capture-warnings.html
- generated xml file: <https://ci-beam.apache.org/job/beam_PostCommit_Python37/ws/src/sdks/python/pytest_postCommitIT-df-py37.xml> -
========== 85 passed, 24 skipped, 225 warnings in 11957.10s (3:19:17) ==========

> Task :sdks:python:test-suites:dataflow:py37:spannerioIT
>>> RUNNING integration tests with pipeline options: --runner=TestDataflowRunner --project=apache-beam-testing --region=us-central1 --staging_location=gs://temp-storage-for-end-to-end-tests/staging-it --temp_location=gs://temp-storage-for-end-to-end-tests/temp-it --output=gs://temp-storage-for-end-to-end-tests/py-it-cloud/output --sdk_location=<https://ci-beam.apache.org/job/beam_PostCommit_Python37/ws/src/sdks/python/build/apache-beam.tar.gz> --requirements_file=postcommit_requirements.txt --num_workers=1 --sleep_secs=20 --kms_key_name=projects/apache-beam-testing/locations/global/keyRings/beam-it/cryptoKeys/test --dataflow_kms_key=projects/apache-beam-testing/locations/global/keyRings/beam-it/cryptoKeys/test
>>>   pytest options: --capture=no --timeout=4500 --color=yes --log-cli-level=INFO --numprocesses=8 --dist=loadfile
>>>   collect markers: -m=spannerio_it
============================= test session starts ==============================
platform linux -- Python 3.7.12, pytest-7.2.1, pluggy-1.0.0
rootdir: <https://ci-beam.apache.org/job/beam_PostCommit_Python37/ws/src/sdks/python,> configfile: pytest.ini
plugins: xdist-2.5.0, timeout-2.1.0, hypothesis-6.68.1, forked-1.6.0, requests-mock-1.10.0
timeout: 4500.0s
timeout method: signal
timeout func_only: False
gw0 I / gw1 I / gw2 I / gw3 I / gw4 I / gw5 I / gw6 I / gw7 I
[gw1] Python 3.7.12 (default, Jan 15 2022, 18:42:10)  -- [GCC 9.3.0]
[gw0] Python 3.7.12 (default, Jan 15 2022, 18:42:10)  -- [GCC 9.3.0]
[gw3] Python 3.7.12 (default, Jan 15 2022, 18:42:10)  -- [GCC 9.3.0]
[gw2] Python 3.7.12 (default, Jan 15 2022, 18:42:10)  -- [GCC 9.3.0]
[gw5] Python 3.7.12 (default, Jan 15 2022, 18:42:10)  -- [GCC 9.3.0]
[gw6] Python 3.7.12 (default, Jan 15 2022, 18:42:10)  -- [GCC 9.3.0]
[gw4] Python 3.7.12 (default, Jan 15 2022, 18:42:10)  -- [GCC 9.3.0]
[gw7] Python 3.7.12 (default, Jan 15 2022, 18:42:10)  -- [GCC 9.3.0]
gw0 [15] / gw1 [15] / gw2 [15] / gw3 [15] / gw4 [15] / gw5 [15] / gw6 [15] / gw7 [15]

scheduling tests via LoadFileScheduling

apache_beam/io/gcp/experimental/spannerio_write_it_test.py::SpannerWriteIntegrationTest::test_metrics_error_call 
apache_beam/io/gcp/experimental/spannerio_read_it_test.py::SpannerReadIntegrationTest::test_read_via_sql 
[gw0] SKIPPED apache_beam/io/gcp/experimental/spannerio_write_it_test.py::SpannerWriteIntegrationTest::test_metrics_error_call 
apache_beam/io/gcp/experimental/spannerio_write_it_test.py::SpannerWriteIntegrationTest::test_metrics_ok_call 
[gw0] SKIPPED apache_beam/io/gcp/experimental/spannerio_write_it_test.py::SpannerWriteIntegrationTest::test_metrics_ok_call 
apache_beam/io/gcp/experimental/spannerio_write_it_test.py::SpannerWriteIntegrationTest::test_spanner_error 
[gw1] PASSED apache_beam/io/gcp/experimental/spannerio_read_it_test.py::SpannerReadIntegrationTest::test_read_via_sql 
apache_beam/io/gcp/experimental/spannerio_read_it_test.py::SpannerReadIntegrationTest::test_read_via_table 
[gw0] PASSED apache_beam/io/gcp/experimental/spannerio_write_it_test.py::SpannerWriteIntegrationTest::test_spanner_error 
apache_beam/io/gcp/experimental/spannerio_write_it_test.py::SpannerWriteIntegrationTest::test_spanner_update 
[gw1] PASSED apache_beam/io/gcp/experimental/spannerio_read_it_test.py::SpannerReadIntegrationTest::test_read_via_table 
apache_beam/io/gcp/experimental/spannerio_read_it_test.py::SpannerReadIntegrationTest::test_sql_metrics_error_call 
[gw1] SKIPPED apache_beam/io/gcp/experimental/spannerio_read_it_test.py::SpannerReadIntegrationTest::test_sql_metrics_error_call 
apache_beam/io/gcp/experimental/spannerio_read_it_test.py::SpannerReadIntegrationTest::test_sql_metrics_ok_call 
[gw1] SKIPPED apache_beam/io/gcp/experimental/spannerio_read_it_test.py::SpannerReadIntegrationTest::test_sql_metrics_ok_call 
apache_beam/io/gcp/experimental/spannerio_read_it_test.py::SpannerReadIntegrationTest::test_table_metrics_error_call 
[gw1] SKIPPED apache_beam/io/gcp/experimental/spannerio_read_it_test.py::SpannerReadIntegrationTest::test_table_metrics_error_call 
apache_beam/io/gcp/experimental/spannerio_read_it_test.py::SpannerReadIntegrationTest::test_table_metrics_ok_call 
[gw1] SKIPPED apache_beam/io/gcp/experimental/spannerio_read_it_test.py::SpannerReadIntegrationTest::test_table_metrics_ok_call 
apache_beam/io/gcp/experimental/spannerio_read_it_test.py::SpannerReadIntegrationTest::test_transaction_sql_metrics_error_call 
[gw1] SKIPPED apache_beam/io/gcp/experimental/spannerio_read_it_test.py::SpannerReadIntegrationTest::test_transaction_sql_metrics_error_call 
apache_beam/io/gcp/experimental/spannerio_read_it_test.py::SpannerReadIntegrationTest::test_transaction_sql_metrics_ok_call 
[gw1] SKIPPED apache_beam/io/gcp/experimental/spannerio_read_it_test.py::SpannerReadIntegrationTest::test_transaction_sql_metrics_ok_call 
apache_beam/io/gcp/experimental/spannerio_read_it_test.py::SpannerReadIntegrationTest::test_transaction_table_metrics_error_call 
[gw1] SKIPPED apache_beam/io/gcp/experimental/spannerio_read_it_test.py::SpannerReadIntegrationTest::test_transaction_table_metrics_error_call 
apache_beam/io/gcp/experimental/spannerio_read_it_test.py::SpannerReadIntegrationTest::test_transaction_table_metrics_ok_call 
[gw1] SKIPPED apache_beam/io/gcp/experimental/spannerio_read_it_test.py::SpannerReadIntegrationTest::test_transaction_table_metrics_ok_call 
[gw0] PASSED apache_beam/io/gcp/experimental/spannerio_write_it_test.py::SpannerWriteIntegrationTest::test_spanner_update 
apache_beam/io/gcp/experimental/spannerio_write_it_test.py::SpannerWriteIntegrationTest::test_write_batches 
[gw0] PASSED apache_beam/io/gcp/experimental/spannerio_write_it_test.py::SpannerWriteIntegrationTest::test_write_batches 

=============================== warnings summary ===============================
../../build/gradleenv/-1734967052/lib/python3.7/site-packages/hdfs/config.py:15
../../build/gradleenv/-1734967052/lib/python3.7/site-packages/hdfs/config.py:15
../../build/gradleenv/-1734967052/lib/python3.7/site-packages/hdfs/config.py:15
../../build/gradleenv/-1734967052/lib/python3.7/site-packages/hdfs/config.py:15
../../build/gradleenv/-1734967052/lib/python3.7/site-packages/hdfs/config.py:15
../../build/gradleenv/-1734967052/lib/python3.7/site-packages/hdfs/config.py:15
../../build/gradleenv/-1734967052/lib/python3.7/site-packages/hdfs/config.py:15
../../build/gradleenv/-1734967052/lib/python3.7/site-packages/hdfs/config.py:15
../../build/gradleenv/-1734967052/lib/python3.7/site-packages/hdfs/config.py:15
  <https://ci-beam.apache.org/job/beam_PostCommit_Python37/ws/src/build/gradleenv/-1734967052/lib/python3.7/site-packages/hdfs/config.py>:15: DeprecationWarning: the imp module is deprecated in favour of importlib; see the module's documentation for alternative uses
    from imp import load_source

apache_beam/io/gcp/experimental/spannerio_read_it_test.py::SpannerReadIntegrationTest::test_read_via_sql
  <https://ci-beam.apache.org/job/beam_PostCommit_Python37/ws/src/sdks/python/apache_beam/io/gcp/experimental/spannerio_read_it_test.py>:128: FutureWarning: ReadFromSpanner is experimental. No backwards-compatibility guarantees.
    sql="select * from Users")

apache_beam/io/gcp/experimental/spannerio_write_it_test.py::SpannerWriteIntegrationTest::test_spanner_error
  <https://ci-beam.apache.org/job/beam_PostCommit_Python37/ws/src/sdks/python/apache_beam/io/gcp/experimental/spannerio_write_it_test.py>:190: FutureWarning: WriteToSpanner is experimental. No backwards-compatibility guarantees.
    database_id=self.TEST_DATABASE))

apache_beam/io/gcp/experimental/spannerio_read_it_test.py::SpannerReadIntegrationTest::test_read_via_table
  <https://ci-beam.apache.org/job/beam_PostCommit_Python37/ws/src/sdks/python/apache_beam/io/gcp/experimental/spannerio_read_it_test.py>:117: FutureWarning: ReadFromSpanner is experimental. No backwards-compatibility guarantees.
    columns=["UserId", "Key"])

apache_beam/io/gcp/experimental/spannerio_write_it_test.py::SpannerWriteIntegrationTest::test_spanner_update
  <https://ci-beam.apache.org/job/beam_PostCommit_Python37/ws/src/sdks/python/apache_beam/io/gcp/experimental/spannerio_write_it_test.py>:171: FutureWarning: WriteToSpanner is experimental. No backwards-compatibility guarantees.
    database_id=self.TEST_DATABASE))

apache_beam/io/gcp/experimental/spannerio_write_it_test.py::SpannerWriteIntegrationTest::test_write_batches
  <https://ci-beam.apache.org/job/beam_PostCommit_Python37/ws/src/sdks/python/apache_beam/io/gcp/experimental/spannerio_write_it_test.py>:135: FutureWarning: WriteToSpanner is experimental. No backwards-compatibility guarantees.
    max_batch_size_bytes=250))

-- Docs: https://docs.pytest.org/en/stable/how-to/capture-warnings.html
- generated xml file: <https://ci-beam.apache.org/job/beam_PostCommit_Python37/ws/src/sdks/python/pytest_postCommitIT-df-py37.xml> -
=========== 5 passed, 17 skipped, 14 warnings in 2009.54s (0:33:29) ============

FAILURE: Build completed with 3 failures.

1: Task failed with an exception.
-----------
* Where:
Script '<https://ci-beam.apache.org/job/beam_PostCommit_Python37/ws/src/sdks/python/test-suites/direct/common.gradle'> line: 194

* What went wrong:
Execution failed for task ':sdks:python:test-suites:direct:py37:azureIntegrationTest'.
> Process 'command 'sh'' finished with non-zero exit value 1

* Try:
> Run with --stacktrace option to get the stack trace.
> Run with --info or --debug option to get more log output.
==============================================================================

2: Task failed with an exception.
-----------
* What went wrong:
Execution failed for task ':sdks:java:container:pullLicenses'.
> Process 'command './license_scripts/license_script.sh'' finished with non-zero exit value 1

* Try:
> Run with --stacktrace option to get the stack trace.
> Run with --info or --debug option to get more log output.
==============================================================================

3: Task failed with an exception.
-----------
* Where:
Script '<https://ci-beam.apache.org/job/beam_PostCommit_Python37/ws/src/sdks/python/test-suites/direct/common.gradle'> line: 185

* What went wrong:
Execution failed for task ':sdks:python:test-suites:direct:py37:hdfsIntegrationTest'.
> Process 'command 'sh'' finished with non-zero exit value 1

* Try:
> Run with --stacktrace option to get the stack trace.
> Run with --info or --debug option to get more log output.
==============================================================================

* Get more help at https://help.gradle.org

Deprecated Gradle features were used in this build, making it incompatible with Gradle 8.0.

You can use '--warning-mode all' to show the individual deprecation warnings and determine if they come from your own scripts or plugins.

See https://docs.gradle.org/7.5.1/userguide/command_line_interface.html#sec:command_line_warnings

Execution optimizations have been disabled for 1 invalid unit(s) of work during this build to ensure correctness.
Please consult deprecation warnings for more details.

BUILD FAILED in 3h 55m 38s
207 actionable tasks: 154 executed, 47 from cache, 6 up-to-date

Publishing build scan...
https://gradle.com/s/ruxwdvoues5nu

Build step 'Invoke Gradle script' changed build result to FAILURE
Build step 'Invoke Gradle script' marked build as failure

---------------------------------------------------------------------
To unsubscribe, e-mail: builds-unsubscribe@beam.apache.org
For additional commands, e-mail: builds-help@beam.apache.org


Build failed in Jenkins: beam_PostCommit_Python37 #6324

Posted by Apache Jenkins Server <je...@builds.apache.org>.
See <https://ci-beam.apache.org/job/beam_PostCommit_Python37/6324/display/redirect>

Changes:


------------------------------------------
[...truncated 16.11 MB...]

apache_beam/dataframe/io_it_test.py: 2 warnings
apache_beam/io/gcp/bigquery_json_it_test.py: 1 warning
apache_beam/io/gcp/bigquery_read_it_test.py: 9 warnings
  <https://ci-beam.apache.org/job/beam_PostCommit_Python37/ws/src/sdks/python/apache_beam/io/gcp/bigquery.py>:2557: BeamDeprecationWarning: options is deprecated since First stable release. References to <pipeline>.options will not be supported
    | _PassThroughThenCleanupTempDatasets(project_to_cleanup_pcoll))

apache_beam/examples/cookbook/bigquery_tornadoes_it_test.py: 1 warning
apache_beam/io/gcp/big_query_query_to_table_it_test.py: 4 warnings
apache_beam/io/gcp/bigquery_write_it_test.py: 4 warnings
apache_beam/io/gcp/bigquery_test.py: 2 warnings
  <https://ci-beam.apache.org/job/beam_PostCommit_Python37/ws/src/sdks/python/apache_beam/io/gcp/bigquery.py>:1988: BeamDeprecationWarning: options is deprecated since First stable release. References to <pipeline>.options will not be supported
    self.table_reference.projectId = pcoll.pipeline.options.view_as(

apache_beam/examples/cookbook/bigquery_tornadoes_it_test.py: 1 warning
apache_beam/io/gcp/big_query_query_to_table_it_test.py: 4 warnings
apache_beam/io/gcp/bigquery_write_it_test.py: 3 warnings
apache_beam/io/gcp/bigquery_test.py: 3 warnings
apache_beam/io/gcp/bigquery_file_loads_test.py: 3 warnings
  <https://ci-beam.apache.org/job/beam_PostCommit_Python37/ws/src/sdks/python/apache_beam/io/gcp/bigquery_file_loads.py>:1166: BeamDeprecationWarning: options is deprecated since First stable release. References to <pipeline>.options will not be supported
    self.project = self.project or p.options.view_as(GoogleCloudOptions).project

apache_beam/examples/cookbook/bigquery_tornadoes_it_test.py: 1 warning
apache_beam/examples/complete/game/hourly_team_score_it_test.py: 1 warning
apache_beam/io/gcp/big_query_query_to_table_it_test.py: 4 warnings
apache_beam/io/gcp/bigquery_write_it_test.py: 3 warnings
apache_beam/io/gcp/bigquery_test.py: 3 warnings
apache_beam/io/gcp/bigquery_file_loads_test.py: 3 warnings
  <https://ci-beam.apache.org/job/beam_PostCommit_Python37/ws/src/sdks/python/apache_beam/io/gcp/bigquery_file_loads.py>:1173: BeamDeprecationWarning: options is deprecated since First stable release. References to <pipeline>.options will not be supported
    temp_location = p.options.view_as(GoogleCloudOptions).temp_location

apache_beam/examples/cookbook/bigquery_tornadoes_it_test.py: 1 warning
apache_beam/examples/complete/game/hourly_team_score_it_test.py: 1 warning
apache_beam/io/gcp/big_query_query_to_table_it_test.py: 4 warnings
apache_beam/io/gcp/bigquery_write_it_test.py: 3 warnings
apache_beam/io/gcp/bigquery_test.py: 3 warnings
apache_beam/io/gcp/bigquery_file_loads_test.py: 3 warnings
  <https://ci-beam.apache.org/job/beam_PostCommit_Python37/ws/src/sdks/python/apache_beam/io/gcp/bigquery_file_loads.py>:1175: BeamDeprecationWarning: options is deprecated since First stable release. References to <pipeline>.options will not be supported
    p.options.view_as(GoogleCloudOptions).job_name or 'AUTOMATIC_JOB_NAME')

apache_beam/examples/cookbook/bigquery_tornadoes_it_test.py::BigqueryTornadoesIT::test_bigquery_tornadoes_it
  <https://ci-beam.apache.org/job/beam_PostCommit_Python37/ws/src/sdks/python/apache_beam/io/gcp/tests/utils.py>:100: PendingDeprecationWarning: Client.dataset is deprecated and will be removed in a future version. Use a string like 'my_project.my_dataset' or a cloud.google.bigquery.DatasetReference object, instead.
    table_ref = client.dataset(dataset_id).table(table_id)

apache_beam/examples/dataframe/flight_delays_it_test.py::FlightDelaysTest::test_flight_delays
  <https://ci-beam.apache.org/job/beam_PostCommit_Python37/ws/src/sdks/python/apache_beam/examples/dataframe/flight_delays.py>:47: FutureWarning: Dropping of nuisance columns in DataFrame reductions (with 'numeric_only=None') is deprecated; in a future version this will raise TypeError.  Select only valid columns before calling the reduction.
    return airline_df[at_top_airports].mean()

apache_beam/examples/dataframe/flight_delays_it_test.py::FlightDelaysTest::test_flight_delays
apache_beam/examples/dataframe/taxiride_it_test.py::TaxirideIT::test_aggregation
apache_beam/examples/dataframe/taxiride_it_test.py::TaxirideIT::test_enrich
  <https://ci-beam.apache.org/job/beam_PostCommit_Python37/ws/src/sdks/python/apache_beam/dataframe/io.py>:664: FutureWarning: WriteToFiles is experimental.
    sink=lambda _: _WriteToPandasFileSink(

apache_beam/examples/dataframe/flight_delays_it_test.py::FlightDelaysTest::test_flight_delays
apache_beam/examples/dataframe/taxiride_it_test.py::TaxirideIT::test_aggregation
apache_beam/examples/dataframe/taxiride_it_test.py::TaxirideIT::test_enrich
  <https://ci-beam.apache.org/job/beam_PostCommit_Python37/ws/src/sdks/python/apache_beam/io/fileio.py>:591: BeamDeprecationWarning: options is deprecated since First stable release. References to <pipeline>.options will not be supported
    p.options.view_as(GoogleCloudOptions).temp_location or

apache_beam/io/gcp/bigquery_test.py::BigQueryStreamingInsertTransformIntegrationTests::test_multiple_destinations_transform
  <https://ci-beam.apache.org/job/beam_PostCommit_Python37/ws/src/sdks/python/apache_beam/io/gcp/bigquery_test.py>:1690: BeamDeprecationWarning: options is deprecated since First stable release. References to <pipeline>.options will not be supported
    streaming = self.test_pipeline.options.view_as(StandardOptions).streaming

apache_beam/io/gcp/bigquery_read_it_test.py::ReadTests::test_native_source
  <https://ci-beam.apache.org/job/beam_PostCommit_Python37/ws/src/sdks/python/apache_beam/io/gcp/bigquery_read_it_test.py>:170: BeamDeprecationWarning: BigQuerySource is deprecated since 2.25.0. Use ReadFromBigQuery instead.
    beam.io.BigQuerySource(query=self.query, use_standard_sql=True)))

apache_beam/ml/gcp/cloud_dlp_it_test.py::CloudDLPIT::test_deidentification
  <https://ci-beam.apache.org/job/beam_PostCommit_Python37/ws/src/sdks/python/apache_beam/ml/gcp/cloud_dlp_it_test.py>:77: FutureWarning: MaskDetectedDetails is experimental.
    inspection_config=INSPECT_CONFIG))

apache_beam/ml/gcp/cloud_dlp_it_test.py::CloudDLPIT::test_inspection
  <https://ci-beam.apache.org/job/beam_PostCommit_Python37/ws/src/sdks/python/apache_beam/ml/gcp/cloud_dlp_it_test.py>:87: FutureWarning: InspectForDetails is experimental.
    | beam.ParDo(extract_inspection_results).with_outputs(

apache_beam/ml/inference/sklearn_inference_it_test.py::SklearnInference::test_sklearn_regression
  <https://ci-beam.apache.org/job/beam_PostCommit_Python37/ws/src/sdks/python/apache_beam/examples/inference/sklearn_japanese_housing_regression.py>:129: FutureWarning: SklearnModelHandlerPandas is experimental. No backwards-compatibility guarantees.
    model_file_type=ModelFileType.PICKLE, model_uri=model_filename)

apache_beam/ml/inference/sklearn_inference_it_test.py::SklearnInference::test_sklearn_regression
  <https://ci-beam.apache.org/job/beam_PostCommit_Python37/ws/src/build/gradleenv/-1734967052/lib/python3.7/site-packages/dill/_dill.py>:472: FutureWarning: SklearnModelHandlerPandas is experimental. No backwards-compatibility guarantees.
    obj = StockUnpickler.load(self)

apache_beam/io/gcp/bigquery_read_it_test.py::ReadNewTypesTests::test_native_source
  <https://ci-beam.apache.org/job/beam_PostCommit_Python37/ws/src/sdks/python/apache_beam/io/gcp/bigquery_read_it_test.py>:693: BeamDeprecationWarning: BigQuerySource is deprecated since 2.25.0. Use ReadFromBigQuery instead.
    beam.io.BigQuerySource(query=self.query, use_standard_sql=True)))

apache_beam/io/gcp/bigquery_read_it_test.py::ReadAllBQTests::test_read_queries
  <https://ci-beam.apache.org/job/beam_PostCommit_Python37/ws/src/sdks/python/apache_beam/io/gcp/bigquery_read_it_test.py>:808: FutureWarning: ReadAllFromBigQuery is experimental.
    | beam.io.ReadAllFromBigQuery())

apache_beam/io/gcp/bigquery_read_it_test.py::ReadAllBQTests::test_read_queries
  <https://ci-beam.apache.org/job/beam_PostCommit_Python37/ws/src/sdks/python/apache_beam/io/gcp/bigquery.py>:2658: BeamDeprecationWarning: options is deprecated since First stable release. References to <pipeline>.options will not be supported
    job_name = pcoll.pipeline.options.view_as(GoogleCloudOptions).job_name

apache_beam/io/gcp/bigquery_read_it_test.py::ReadAllBQTests::test_read_queries
  <https://ci-beam.apache.org/job/beam_PostCommit_Python37/ws/src/sdks/python/apache_beam/io/gcp/bigquery.py>:2659: BeamDeprecationWarning: options is deprecated since First stable release. References to <pipeline>.options will not be supported
    project = pcoll.pipeline.options.view_as(GoogleCloudOptions).project

apache_beam/io/gcp/bigquery_read_it_test.py::ReadAllBQTests::test_read_queries
  <https://ci-beam.apache.org/job/beam_PostCommit_Python37/ws/src/sdks/python/apache_beam/io/gcp/bigquery.py>:2672: BeamDeprecationWarning: options is deprecated since First stable release. References to <pipeline>.options will not be supported
    options=pcoll.pipeline.options,

-- Docs: https://docs.pytest.org/en/stable/how-to/capture-warnings.html
- generated xml file: <https://ci-beam.apache.org/job/beam_PostCommit_Python37/ws/src/sdks/python/pytest_postCommitIT-df-py37.xml> -
========== 85 passed, 24 skipped, 225 warnings in 12172.19s (3:22:52) ==========

> Task :sdks:python:test-suites:dataflow:py37:spannerioIT
>>> RUNNING integration tests with pipeline options: --runner=TestDataflowRunner --project=apache-beam-testing --region=us-central1 --staging_location=gs://temp-storage-for-end-to-end-tests/staging-it --temp_location=gs://temp-storage-for-end-to-end-tests/temp-it --output=gs://temp-storage-for-end-to-end-tests/py-it-cloud/output --sdk_location=<https://ci-beam.apache.org/job/beam_PostCommit_Python37/ws/src/sdks/python/build/apache-beam.tar.gz> --requirements_file=postcommit_requirements.txt --num_workers=1 --sleep_secs=20 --kms_key_name=projects/apache-beam-testing/locations/global/keyRings/beam-it/cryptoKeys/test --dataflow_kms_key=projects/apache-beam-testing/locations/global/keyRings/beam-it/cryptoKeys/test
>>>   pytest options: --capture=no --timeout=4500 --color=yes --log-cli-level=INFO --numprocesses=8 --dist=loadfile
>>>   collect markers: -m=spannerio_it
============================= test session starts ==============================
platform linux -- Python 3.7.12, pytest-7.2.1, pluggy-1.0.0
rootdir: <https://ci-beam.apache.org/job/beam_PostCommit_Python37/ws/src/sdks/python,> configfile: pytest.ini
plugins: xdist-2.5.0, timeout-2.1.0, hypothesis-6.68.1, forked-1.6.0, requests-mock-1.10.0
timeout: 4500.0s
timeout method: signal
timeout func_only: False
gw0 I / gw1 I / gw2 I / gw3 I / gw4 I / gw5 I / gw6 I / gw7 I
[gw0] Python 3.7.12 (default, Jan 15 2022, 18:42:10)  -- [GCC 9.3.0]
[gw1] Python 3.7.12 (default, Jan 15 2022, 18:42:10)  -- [GCC 9.3.0]
[gw2] Python 3.7.12 (default, Jan 15 2022, 18:42:10)  -- [GCC 9.3.0]
[gw3] Python 3.7.12 (default, Jan 15 2022, 18:42:10)  -- [GCC 9.3.0]
[gw5] Python 3.7.12 (default, Jan 15 2022, 18:42:10)  -- [GCC 9.3.0]
[gw4] Python 3.7.12 (default, Jan 15 2022, 18:42:10)  -- [GCC 9.3.0]
[gw6] Python 3.7.12 (default, Jan 15 2022, 18:42:10)  -- [GCC 9.3.0]
[gw7] Python 3.7.12 (default, Jan 15 2022, 18:42:10)  -- [GCC 9.3.0]
gw0 [15] / gw1 [15] / gw2 [15] / gw3 [15] / gw4 [15] / gw5 [15] / gw6 [15] / gw7 [15]

scheduling tests via LoadFileScheduling

apache_beam/io/gcp/experimental/spannerio_read_it_test.py::SpannerReadIntegrationTest::test_read_via_sql 
apache_beam/io/gcp/experimental/spannerio_write_it_test.py::SpannerWriteIntegrationTest::test_metrics_error_call 
[gw1] SKIPPED apache_beam/io/gcp/experimental/spannerio_write_it_test.py::SpannerWriteIntegrationTest::test_metrics_error_call 
apache_beam/io/gcp/experimental/spannerio_write_it_test.py::SpannerWriteIntegrationTest::test_metrics_ok_call 
[gw1] SKIPPED apache_beam/io/gcp/experimental/spannerio_write_it_test.py::SpannerWriteIntegrationTest::test_metrics_ok_call 
apache_beam/io/gcp/experimental/spannerio_write_it_test.py::SpannerWriteIntegrationTest::test_spanner_error 
[gw1] PASSED apache_beam/io/gcp/experimental/spannerio_write_it_test.py::SpannerWriteIntegrationTest::test_spanner_error 
apache_beam/io/gcp/experimental/spannerio_write_it_test.py::SpannerWriteIntegrationTest::test_spanner_update 
[gw0] PASSED apache_beam/io/gcp/experimental/spannerio_read_it_test.py::SpannerReadIntegrationTest::test_read_via_sql 
apache_beam/io/gcp/experimental/spannerio_read_it_test.py::SpannerReadIntegrationTest::test_read_via_table 
[gw1] PASSED apache_beam/io/gcp/experimental/spannerio_write_it_test.py::SpannerWriteIntegrationTest::test_spanner_update 
apache_beam/io/gcp/experimental/spannerio_write_it_test.py::SpannerWriteIntegrationTest::test_write_batches 
[gw0] PASSED apache_beam/io/gcp/experimental/spannerio_read_it_test.py::SpannerReadIntegrationTest::test_read_via_table 
apache_beam/io/gcp/experimental/spannerio_read_it_test.py::SpannerReadIntegrationTest::test_sql_metrics_error_call 
[gw0] SKIPPED apache_beam/io/gcp/experimental/spannerio_read_it_test.py::SpannerReadIntegrationTest::test_sql_metrics_error_call 
apache_beam/io/gcp/experimental/spannerio_read_it_test.py::SpannerReadIntegrationTest::test_sql_metrics_ok_call 
[gw0] SKIPPED apache_beam/io/gcp/experimental/spannerio_read_it_test.py::SpannerReadIntegrationTest::test_sql_metrics_ok_call 
apache_beam/io/gcp/experimental/spannerio_read_it_test.py::SpannerReadIntegrationTest::test_table_metrics_error_call 
[gw0] SKIPPED apache_beam/io/gcp/experimental/spannerio_read_it_test.py::SpannerReadIntegrationTest::test_table_metrics_error_call 
apache_beam/io/gcp/experimental/spannerio_read_it_test.py::SpannerReadIntegrationTest::test_table_metrics_ok_call 
[gw0] SKIPPED apache_beam/io/gcp/experimental/spannerio_read_it_test.py::SpannerReadIntegrationTest::test_table_metrics_ok_call 
apache_beam/io/gcp/experimental/spannerio_read_it_test.py::SpannerReadIntegrationTest::test_transaction_sql_metrics_error_call 
[gw0] SKIPPED apache_beam/io/gcp/experimental/spannerio_read_it_test.py::SpannerReadIntegrationTest::test_transaction_sql_metrics_error_call 
apache_beam/io/gcp/experimental/spannerio_read_it_test.py::SpannerReadIntegrationTest::test_transaction_sql_metrics_ok_call 
[gw0] SKIPPED apache_beam/io/gcp/experimental/spannerio_read_it_test.py::SpannerReadIntegrationTest::test_transaction_sql_metrics_ok_call 
apache_beam/io/gcp/experimental/spannerio_read_it_test.py::SpannerReadIntegrationTest::test_transaction_table_metrics_error_call 
[gw0] SKIPPED apache_beam/io/gcp/experimental/spannerio_read_it_test.py::SpannerReadIntegrationTest::test_transaction_table_metrics_error_call 
apache_beam/io/gcp/experimental/spannerio_read_it_test.py::SpannerReadIntegrationTest::test_transaction_table_metrics_ok_call 
[gw0] SKIPPED apache_beam/io/gcp/experimental/spannerio_read_it_test.py::SpannerReadIntegrationTest::test_transaction_table_metrics_ok_call 
[gw1] PASSED apache_beam/io/gcp/experimental/spannerio_write_it_test.py::SpannerWriteIntegrationTest::test_write_batches 

=============================== warnings summary ===============================
../../build/gradleenv/-1734967052/lib/python3.7/site-packages/hdfs/config.py:15
../../build/gradleenv/-1734967052/lib/python3.7/site-packages/hdfs/config.py:15
../../build/gradleenv/-1734967052/lib/python3.7/site-packages/hdfs/config.py:15
../../build/gradleenv/-1734967052/lib/python3.7/site-packages/hdfs/config.py:15
../../build/gradleenv/-1734967052/lib/python3.7/site-packages/hdfs/config.py:15
../../build/gradleenv/-1734967052/lib/python3.7/site-packages/hdfs/config.py:15
../../build/gradleenv/-1734967052/lib/python3.7/site-packages/hdfs/config.py:15
../../build/gradleenv/-1734967052/lib/python3.7/site-packages/hdfs/config.py:15
../../build/gradleenv/-1734967052/lib/python3.7/site-packages/hdfs/config.py:15
  <https://ci-beam.apache.org/job/beam_PostCommit_Python37/ws/src/build/gradleenv/-1734967052/lib/python3.7/site-packages/hdfs/config.py>:15: DeprecationWarning: the imp module is deprecated in favour of importlib; see the module's documentation for alternative uses
    from imp import load_source

apache_beam/io/gcp/experimental/spannerio_write_it_test.py::SpannerWriteIntegrationTest::test_spanner_error
  <https://ci-beam.apache.org/job/beam_PostCommit_Python37/ws/src/sdks/python/apache_beam/io/gcp/experimental/spannerio_write_it_test.py>:190: FutureWarning: WriteToSpanner is experimental. No backwards-compatibility guarantees.
    database_id=self.TEST_DATABASE))

apache_beam/io/gcp/experimental/spannerio_read_it_test.py::SpannerReadIntegrationTest::test_read_via_sql
  <https://ci-beam.apache.org/job/beam_PostCommit_Python37/ws/src/sdks/python/apache_beam/io/gcp/experimental/spannerio_read_it_test.py>:128: FutureWarning: ReadFromSpanner is experimental. No backwards-compatibility guarantees.
    sql="select * from Users")

apache_beam/io/gcp/experimental/spannerio_write_it_test.py::SpannerWriteIntegrationTest::test_spanner_update
  <https://ci-beam.apache.org/job/beam_PostCommit_Python37/ws/src/sdks/python/apache_beam/io/gcp/experimental/spannerio_write_it_test.py>:171: FutureWarning: WriteToSpanner is experimental. No backwards-compatibility guarantees.
    database_id=self.TEST_DATABASE))

apache_beam/io/gcp/experimental/spannerio_read_it_test.py::SpannerReadIntegrationTest::test_read_via_table
  <https://ci-beam.apache.org/job/beam_PostCommit_Python37/ws/src/sdks/python/apache_beam/io/gcp/experimental/spannerio_read_it_test.py>:117: FutureWarning: ReadFromSpanner is experimental. No backwards-compatibility guarantees.
    columns=["UserId", "Key"])

apache_beam/io/gcp/experimental/spannerio_write_it_test.py::SpannerWriteIntegrationTest::test_write_batches
  <https://ci-beam.apache.org/job/beam_PostCommit_Python37/ws/src/sdks/python/apache_beam/io/gcp/experimental/spannerio_write_it_test.py>:135: FutureWarning: WriteToSpanner is experimental. No backwards-compatibility guarantees.
    max_batch_size_bytes=250))

-- Docs: https://docs.pytest.org/en/stable/how-to/capture-warnings.html
- generated xml file: <https://ci-beam.apache.org/job/beam_PostCommit_Python37/ws/src/sdks/python/pytest_postCommitIT-df-py37.xml> -
=========== 5 passed, 17 skipped, 14 warnings in 1843.89s (0:30:43) ============

FAILURE: Build completed with 2 failures.

1: Task failed with an exception.
-----------
* Where:
Script '<https://ci-beam.apache.org/job/beam_PostCommit_Python37/ws/src/sdks/python/test-suites/direct/common.gradle'> line: 194

* What went wrong:
Execution failed for task ':sdks:python:test-suites:direct:py37:azureIntegrationTest'.
> Process 'command 'sh'' finished with non-zero exit value 1

* Try:
> Run with --stacktrace option to get the stack trace.
> Run with --info or --debug option to get more log output.
==============================================================================

2: Task failed with an exception.
-----------
* Where:
Script '<https://ci-beam.apache.org/job/beam_PostCommit_Python37/ws/src/sdks/python/test-suites/direct/common.gradle'> line: 185

* What went wrong:
Execution failed for task ':sdks:python:test-suites:direct:py37:hdfsIntegrationTest'.
> Process 'command 'sh'' finished with non-zero exit value 1

* Try:
> Run with --stacktrace option to get the stack trace.
> Run with --info or --debug option to get more log output.
==============================================================================

* Get more help at https://help.gradle.org

Deprecated Gradle features were used in this build, making it incompatible with Gradle 8.0.

You can use '--warning-mode all' to show the individual deprecation warnings and determine if they come from your own scripts or plugins.

See https://docs.gradle.org/7.5.1/userguide/command_line_interface.html#sec:command_line_warnings

Execution optimizations have been disabled for 1 invalid unit(s) of work during this build to ensure correctness.
Please consult deprecation warnings for more details.

BUILD FAILED in 3h 55m 59s
212 actionable tasks: 148 executed, 58 from cache, 6 up-to-date

Publishing build scan...
https://gradle.com/s/kd57hb2fiuk2c

Build step 'Invoke Gradle script' changed build result to FAILURE
Build step 'Invoke Gradle script' marked build as failure

---------------------------------------------------------------------
To unsubscribe, e-mail: builds-unsubscribe@beam.apache.org
For additional commands, e-mail: builds-help@beam.apache.org


Build failed in Jenkins: beam_PostCommit_Python37 #6323

Posted by Apache Jenkins Server <je...@builds.apache.org>.
See <https://ci-beam.apache.org/job/beam_PostCommit_Python37/6323/display/redirect>

Changes:


------------------------------------------
[...truncated 15.69 MB...]

apache_beam/dataframe/io_it_test.py: 2 warnings
apache_beam/io/gcp/bigquery_json_it_test.py: 1 warning
apache_beam/io/gcp/bigquery_read_it_test.py: 9 warnings
  <https://ci-beam.apache.org/job/beam_PostCommit_Python37/ws/src/sdks/python/apache_beam/io/gcp/bigquery.py>:2557: BeamDeprecationWarning: options is deprecated since First stable release. References to <pipeline>.options will not be supported
    | _PassThroughThenCleanupTempDatasets(project_to_cleanup_pcoll))

apache_beam/examples/cookbook/bigquery_tornadoes_it_test.py: 1 warning
apache_beam/io/gcp/big_query_query_to_table_it_test.py: 4 warnings
apache_beam/io/gcp/bigquery_write_it_test.py: 4 warnings
apache_beam/io/gcp/bigquery_test.py: 2 warnings
  <https://ci-beam.apache.org/job/beam_PostCommit_Python37/ws/src/sdks/python/apache_beam/io/gcp/bigquery.py>:1988: BeamDeprecationWarning: options is deprecated since First stable release. References to <pipeline>.options will not be supported
    self.table_reference.projectId = pcoll.pipeline.options.view_as(

apache_beam/examples/cookbook/bigquery_tornadoes_it_test.py: 1 warning
apache_beam/io/gcp/big_query_query_to_table_it_test.py: 4 warnings
apache_beam/io/gcp/bigquery_write_it_test.py: 3 warnings
apache_beam/io/gcp/bigquery_test.py: 3 warnings
apache_beam/io/gcp/bigquery_file_loads_test.py: 3 warnings
  <https://ci-beam.apache.org/job/beam_PostCommit_Python37/ws/src/sdks/python/apache_beam/io/gcp/bigquery_file_loads.py>:1166: BeamDeprecationWarning: options is deprecated since First stable release. References to <pipeline>.options will not be supported
    self.project = self.project or p.options.view_as(GoogleCloudOptions).project

apache_beam/examples/cookbook/bigquery_tornadoes_it_test.py: 1 warning
apache_beam/examples/complete/game/hourly_team_score_it_test.py: 1 warning
apache_beam/io/gcp/big_query_query_to_table_it_test.py: 4 warnings
apache_beam/io/gcp/bigquery_write_it_test.py: 3 warnings
apache_beam/io/gcp/bigquery_test.py: 3 warnings
apache_beam/io/gcp/bigquery_file_loads_test.py: 3 warnings
  <https://ci-beam.apache.org/job/beam_PostCommit_Python37/ws/src/sdks/python/apache_beam/io/gcp/bigquery_file_loads.py>:1173: BeamDeprecationWarning: options is deprecated since First stable release. References to <pipeline>.options will not be supported
    temp_location = p.options.view_as(GoogleCloudOptions).temp_location

apache_beam/examples/cookbook/bigquery_tornadoes_it_test.py: 1 warning
apache_beam/examples/complete/game/hourly_team_score_it_test.py: 1 warning
apache_beam/io/gcp/big_query_query_to_table_it_test.py: 4 warnings
apache_beam/io/gcp/bigquery_write_it_test.py: 3 warnings
apache_beam/io/gcp/bigquery_test.py: 3 warnings
apache_beam/io/gcp/bigquery_file_loads_test.py: 3 warnings
  <https://ci-beam.apache.org/job/beam_PostCommit_Python37/ws/src/sdks/python/apache_beam/io/gcp/bigquery_file_loads.py>:1175: BeamDeprecationWarning: options is deprecated since First stable release. References to <pipeline>.options will not be supported
    p.options.view_as(GoogleCloudOptions).job_name or 'AUTOMATIC_JOB_NAME')

apache_beam/examples/cookbook/bigquery_tornadoes_it_test.py::BigqueryTornadoesIT::test_bigquery_tornadoes_it
  <https://ci-beam.apache.org/job/beam_PostCommit_Python37/ws/src/sdks/python/apache_beam/io/gcp/tests/utils.py>:100: PendingDeprecationWarning: Client.dataset is deprecated and will be removed in a future version. Use a string like 'my_project.my_dataset' or a cloud.google.bigquery.DatasetReference object, instead.
    table_ref = client.dataset(dataset_id).table(table_id)

apache_beam/examples/dataframe/flight_delays_it_test.py::FlightDelaysTest::test_flight_delays
  <https://ci-beam.apache.org/job/beam_PostCommit_Python37/ws/src/sdks/python/apache_beam/examples/dataframe/flight_delays.py>:47: FutureWarning: Dropping of nuisance columns in DataFrame reductions (with 'numeric_only=None') is deprecated; in a future version this will raise TypeError.  Select only valid columns before calling the reduction.
    return airline_df[at_top_airports].mean()

apache_beam/examples/dataframe/flight_delays_it_test.py::FlightDelaysTest::test_flight_delays
apache_beam/examples/dataframe/taxiride_it_test.py::TaxirideIT::test_aggregation
apache_beam/examples/dataframe/taxiride_it_test.py::TaxirideIT::test_enrich
  <https://ci-beam.apache.org/job/beam_PostCommit_Python37/ws/src/sdks/python/apache_beam/dataframe/io.py>:664: FutureWarning: WriteToFiles is experimental.
    sink=lambda _: _WriteToPandasFileSink(

apache_beam/examples/dataframe/flight_delays_it_test.py::FlightDelaysTest::test_flight_delays
apache_beam/examples/dataframe/taxiride_it_test.py::TaxirideIT::test_aggregation
apache_beam/examples/dataframe/taxiride_it_test.py::TaxirideIT::test_enrich
  <https://ci-beam.apache.org/job/beam_PostCommit_Python37/ws/src/sdks/python/apache_beam/io/fileio.py>:591: BeamDeprecationWarning: options is deprecated since First stable release. References to <pipeline>.options will not be supported
    p.options.view_as(GoogleCloudOptions).temp_location or

apache_beam/io/gcp/bigquery_test.py::BigQueryStreamingInsertTransformIntegrationTests::test_multiple_destinations_transform
  <https://ci-beam.apache.org/job/beam_PostCommit_Python37/ws/src/sdks/python/apache_beam/io/gcp/bigquery_test.py>:1690: BeamDeprecationWarning: options is deprecated since First stable release. References to <pipeline>.options will not be supported
    streaming = self.test_pipeline.options.view_as(StandardOptions).streaming

apache_beam/io/gcp/bigquery_read_it_test.py::ReadTests::test_native_source
  <https://ci-beam.apache.org/job/beam_PostCommit_Python37/ws/src/sdks/python/apache_beam/io/gcp/bigquery_read_it_test.py>:170: BeamDeprecationWarning: BigQuerySource is deprecated since 2.25.0. Use ReadFromBigQuery instead.
    beam.io.BigQuerySource(query=self.query, use_standard_sql=True)))

apache_beam/ml/gcp/cloud_dlp_it_test.py::CloudDLPIT::test_deidentification
  <https://ci-beam.apache.org/job/beam_PostCommit_Python37/ws/src/sdks/python/apache_beam/ml/gcp/cloud_dlp_it_test.py>:77: FutureWarning: MaskDetectedDetails is experimental.
    inspection_config=INSPECT_CONFIG))

apache_beam/ml/gcp/cloud_dlp_it_test.py::CloudDLPIT::test_inspection
  <https://ci-beam.apache.org/job/beam_PostCommit_Python37/ws/src/sdks/python/apache_beam/ml/gcp/cloud_dlp_it_test.py>:87: FutureWarning: InspectForDetails is experimental.
    | beam.ParDo(extract_inspection_results).with_outputs(

apache_beam/ml/inference/sklearn_inference_it_test.py::SklearnInference::test_sklearn_regression
  <https://ci-beam.apache.org/job/beam_PostCommit_Python37/ws/src/sdks/python/apache_beam/examples/inference/sklearn_japanese_housing_regression.py>:129: FutureWarning: SklearnModelHandlerPandas is experimental. No backwards-compatibility guarantees.
    model_file_type=ModelFileType.PICKLE, model_uri=model_filename)

apache_beam/ml/inference/sklearn_inference_it_test.py::SklearnInference::test_sklearn_regression
  <https://ci-beam.apache.org/job/beam_PostCommit_Python37/ws/src/build/gradleenv/-1734967052/lib/python3.7/site-packages/dill/_dill.py>:472: FutureWarning: SklearnModelHandlerPandas is experimental. No backwards-compatibility guarantees.
    obj = StockUnpickler.load(self)

apache_beam/io/gcp/bigquery_read_it_test.py::ReadNewTypesTests::test_native_source
  <https://ci-beam.apache.org/job/beam_PostCommit_Python37/ws/src/sdks/python/apache_beam/io/gcp/bigquery_read_it_test.py>:693: BeamDeprecationWarning: BigQuerySource is deprecated since 2.25.0. Use ReadFromBigQuery instead.
    beam.io.BigQuerySource(query=self.query, use_standard_sql=True)))

apache_beam/io/gcp/bigquery_read_it_test.py::ReadAllBQTests::test_read_queries
  <https://ci-beam.apache.org/job/beam_PostCommit_Python37/ws/src/sdks/python/apache_beam/io/gcp/bigquery_read_it_test.py>:808: FutureWarning: ReadAllFromBigQuery is experimental.
    | beam.io.ReadAllFromBigQuery())

apache_beam/io/gcp/bigquery_read_it_test.py::ReadAllBQTests::test_read_queries
  <https://ci-beam.apache.org/job/beam_PostCommit_Python37/ws/src/sdks/python/apache_beam/io/gcp/bigquery.py>:2658: BeamDeprecationWarning: options is deprecated since First stable release. References to <pipeline>.options will not be supported
    job_name = pcoll.pipeline.options.view_as(GoogleCloudOptions).job_name

apache_beam/io/gcp/bigquery_read_it_test.py::ReadAllBQTests::test_read_queries
  <https://ci-beam.apache.org/job/beam_PostCommit_Python37/ws/src/sdks/python/apache_beam/io/gcp/bigquery.py>:2659: BeamDeprecationWarning: options is deprecated since First stable release. References to <pipeline>.options will not be supported
    project = pcoll.pipeline.options.view_as(GoogleCloudOptions).project

apache_beam/io/gcp/bigquery_read_it_test.py::ReadAllBQTests::test_read_queries
  <https://ci-beam.apache.org/job/beam_PostCommit_Python37/ws/src/sdks/python/apache_beam/io/gcp/bigquery.py>:2672: BeamDeprecationWarning: options is deprecated since First stable release. References to <pipeline>.options will not be supported
    options=pcoll.pipeline.options,

-- Docs: https://docs.pytest.org/en/stable/how-to/capture-warnings.html
- generated xml file: <https://ci-beam.apache.org/job/beam_PostCommit_Python37/ws/src/sdks/python/pytest_postCommitIT-df-py37.xml> -
========== 85 passed, 24 skipped, 225 warnings in 11702.96s (3:15:02) ==========

> Task :sdks:python:test-suites:dataflow:py37:spannerioIT
>>> RUNNING integration tests with pipeline options: --runner=TestDataflowRunner --project=apache-beam-testing --region=us-central1 --staging_location=gs://temp-storage-for-end-to-end-tests/staging-it --temp_location=gs://temp-storage-for-end-to-end-tests/temp-it --output=gs://temp-storage-for-end-to-end-tests/py-it-cloud/output --sdk_location=<https://ci-beam.apache.org/job/beam_PostCommit_Python37/ws/src/sdks/python/build/apache-beam.tar.gz> --requirements_file=postcommit_requirements.txt --num_workers=1 --sleep_secs=20 --kms_key_name=projects/apache-beam-testing/locations/global/keyRings/beam-it/cryptoKeys/test --dataflow_kms_key=projects/apache-beam-testing/locations/global/keyRings/beam-it/cryptoKeys/test
>>>   pytest options: --capture=no --timeout=4500 --color=yes --log-cli-level=INFO --numprocesses=8 --dist=loadfile
>>>   collect markers: -m=spannerio_it
============================= test session starts ==============================
platform linux -- Python 3.7.12, pytest-7.2.1, pluggy-1.0.0
rootdir: <https://ci-beam.apache.org/job/beam_PostCommit_Python37/ws/src/sdks/python,> configfile: pytest.ini
plugins: xdist-2.5.0, timeout-2.1.0, hypothesis-6.68.1, forked-1.6.0, requests-mock-1.10.0
timeout: 4500.0s
timeout method: signal
timeout func_only: False
gw0 I / gw1 I / gw2 I / gw3 I / gw4 I / gw5 I / gw6 I / gw7 I
[gw1] Python 3.7.12 (default, Jan 15 2022, 18:42:10)  -- [GCC 9.3.0]
[gw0] Python 3.7.12 (default, Jan 15 2022, 18:42:10)  -- [GCC 9.3.0]
[gw2] Python 3.7.12 (default, Jan 15 2022, 18:42:10)  -- [GCC 9.3.0]
[gw4] Python 3.7.12 (default, Jan 15 2022, 18:42:10)  -- [GCC 9.3.0]
[gw3] Python 3.7.12 (default, Jan 15 2022, 18:42:10)  -- [GCC 9.3.0]
[gw5] Python 3.7.12 (default, Jan 15 2022, 18:42:10)  -- [GCC 9.3.0]
[gw6] Python 3.7.12 (default, Jan 15 2022, 18:42:10)  -- [GCC 9.3.0]
[gw7] Python 3.7.12 (default, Jan 15 2022, 18:42:10)  -- [GCC 9.3.0]
gw0 [15] / gw1 [15] / gw2 [15] / gw3 [15] / gw4 [15] / gw5 [15] / gw6 [15] / gw7 [15]

scheduling tests via LoadFileScheduling

apache_beam/io/gcp/experimental/spannerio_read_it_test.py::SpannerReadIntegrationTest::test_read_via_sql 
apache_beam/io/gcp/experimental/spannerio_write_it_test.py::SpannerWriteIntegrationTest::test_metrics_error_call 
[gw0] SKIPPED apache_beam/io/gcp/experimental/spannerio_write_it_test.py::SpannerWriteIntegrationTest::test_metrics_error_call 
apache_beam/io/gcp/experimental/spannerio_write_it_test.py::SpannerWriteIntegrationTest::test_metrics_ok_call 
[gw0] SKIPPED apache_beam/io/gcp/experimental/spannerio_write_it_test.py::SpannerWriteIntegrationTest::test_metrics_ok_call 
apache_beam/io/gcp/experimental/spannerio_write_it_test.py::SpannerWriteIntegrationTest::test_spanner_error 
[gw0] PASSED apache_beam/io/gcp/experimental/spannerio_write_it_test.py::SpannerWriteIntegrationTest::test_spanner_error 
apache_beam/io/gcp/experimental/spannerio_write_it_test.py::SpannerWriteIntegrationTest::test_spanner_update 
[gw1] PASSED apache_beam/io/gcp/experimental/spannerio_read_it_test.py::SpannerReadIntegrationTest::test_read_via_sql 
apache_beam/io/gcp/experimental/spannerio_read_it_test.py::SpannerReadIntegrationTest::test_read_via_table 
[gw0] PASSED apache_beam/io/gcp/experimental/spannerio_write_it_test.py::SpannerWriteIntegrationTest::test_spanner_update 
apache_beam/io/gcp/experimental/spannerio_write_it_test.py::SpannerWriteIntegrationTest::test_write_batches 
[gw1] PASSED apache_beam/io/gcp/experimental/spannerio_read_it_test.py::SpannerReadIntegrationTest::test_read_via_table 
apache_beam/io/gcp/experimental/spannerio_read_it_test.py::SpannerReadIntegrationTest::test_sql_metrics_error_call 
[gw1] SKIPPED apache_beam/io/gcp/experimental/spannerio_read_it_test.py::SpannerReadIntegrationTest::test_sql_metrics_error_call 
apache_beam/io/gcp/experimental/spannerio_read_it_test.py::SpannerReadIntegrationTest::test_sql_metrics_ok_call 
[gw1] SKIPPED apache_beam/io/gcp/experimental/spannerio_read_it_test.py::SpannerReadIntegrationTest::test_sql_metrics_ok_call 
apache_beam/io/gcp/experimental/spannerio_read_it_test.py::SpannerReadIntegrationTest::test_table_metrics_error_call 
[gw1] SKIPPED apache_beam/io/gcp/experimental/spannerio_read_it_test.py::SpannerReadIntegrationTest::test_table_metrics_error_call 
apache_beam/io/gcp/experimental/spannerio_read_it_test.py::SpannerReadIntegrationTest::test_table_metrics_ok_call 
[gw1] SKIPPED apache_beam/io/gcp/experimental/spannerio_read_it_test.py::SpannerReadIntegrationTest::test_table_metrics_ok_call 
apache_beam/io/gcp/experimental/spannerio_read_it_test.py::SpannerReadIntegrationTest::test_transaction_sql_metrics_error_call 
[gw1] SKIPPED apache_beam/io/gcp/experimental/spannerio_read_it_test.py::SpannerReadIntegrationTest::test_transaction_sql_metrics_error_call 
apache_beam/io/gcp/experimental/spannerio_read_it_test.py::SpannerReadIntegrationTest::test_transaction_sql_metrics_ok_call 
[gw1] SKIPPED apache_beam/io/gcp/experimental/spannerio_read_it_test.py::SpannerReadIntegrationTest::test_transaction_sql_metrics_ok_call 
apache_beam/io/gcp/experimental/spannerio_read_it_test.py::SpannerReadIntegrationTest::test_transaction_table_metrics_error_call 
[gw1] SKIPPED apache_beam/io/gcp/experimental/spannerio_read_it_test.py::SpannerReadIntegrationTest::test_transaction_table_metrics_error_call 
apache_beam/io/gcp/experimental/spannerio_read_it_test.py::SpannerReadIntegrationTest::test_transaction_table_metrics_ok_call 
[gw1] SKIPPED apache_beam/io/gcp/experimental/spannerio_read_it_test.py::SpannerReadIntegrationTest::test_transaction_table_metrics_ok_call 
[gw0] PASSED apache_beam/io/gcp/experimental/spannerio_write_it_test.py::SpannerWriteIntegrationTest::test_write_batches 

=============================== warnings summary ===============================
../../build/gradleenv/-1734967052/lib/python3.7/site-packages/hdfs/config.py:15
../../build/gradleenv/-1734967052/lib/python3.7/site-packages/hdfs/config.py:15
../../build/gradleenv/-1734967052/lib/python3.7/site-packages/hdfs/config.py:15
../../build/gradleenv/-1734967052/lib/python3.7/site-packages/hdfs/config.py:15
../../build/gradleenv/-1734967052/lib/python3.7/site-packages/hdfs/config.py:15
../../build/gradleenv/-1734967052/lib/python3.7/site-packages/hdfs/config.py:15
../../build/gradleenv/-1734967052/lib/python3.7/site-packages/hdfs/config.py:15
../../build/gradleenv/-1734967052/lib/python3.7/site-packages/hdfs/config.py:15
../../build/gradleenv/-1734967052/lib/python3.7/site-packages/hdfs/config.py:15
  <https://ci-beam.apache.org/job/beam_PostCommit_Python37/ws/src/build/gradleenv/-1734967052/lib/python3.7/site-packages/hdfs/config.py>:15: DeprecationWarning: the imp module is deprecated in favour of importlib; see the module's documentation for alternative uses
    from imp import load_source

apache_beam/io/gcp/experimental/spannerio_write_it_test.py::SpannerWriteIntegrationTest::test_spanner_error
  <https://ci-beam.apache.org/job/beam_PostCommit_Python37/ws/src/sdks/python/apache_beam/io/gcp/experimental/spannerio_write_it_test.py>:190: FutureWarning: WriteToSpanner is experimental. No backwards-compatibility guarantees.
    database_id=self.TEST_DATABASE))

apache_beam/io/gcp/experimental/spannerio_read_it_test.py::SpannerReadIntegrationTest::test_read_via_sql
  <https://ci-beam.apache.org/job/beam_PostCommit_Python37/ws/src/sdks/python/apache_beam/io/gcp/experimental/spannerio_read_it_test.py>:128: FutureWarning: ReadFromSpanner is experimental. No backwards-compatibility guarantees.
    sql="select * from Users")

apache_beam/io/gcp/experimental/spannerio_write_it_test.py::SpannerWriteIntegrationTest::test_spanner_update
  <https://ci-beam.apache.org/job/beam_PostCommit_Python37/ws/src/sdks/python/apache_beam/io/gcp/experimental/spannerio_write_it_test.py>:171: FutureWarning: WriteToSpanner is experimental. No backwards-compatibility guarantees.
    database_id=self.TEST_DATABASE))

apache_beam/io/gcp/experimental/spannerio_read_it_test.py::SpannerReadIntegrationTest::test_read_via_table
  <https://ci-beam.apache.org/job/beam_PostCommit_Python37/ws/src/sdks/python/apache_beam/io/gcp/experimental/spannerio_read_it_test.py>:117: FutureWarning: ReadFromSpanner is experimental. No backwards-compatibility guarantees.
    columns=["UserId", "Key"])

apache_beam/io/gcp/experimental/spannerio_write_it_test.py::SpannerWriteIntegrationTest::test_write_batches
  <https://ci-beam.apache.org/job/beam_PostCommit_Python37/ws/src/sdks/python/apache_beam/io/gcp/experimental/spannerio_write_it_test.py>:135: FutureWarning: WriteToSpanner is experimental. No backwards-compatibility guarantees.
    max_batch_size_bytes=250))

-- Docs: https://docs.pytest.org/en/stable/how-to/capture-warnings.html
- generated xml file: <https://ci-beam.apache.org/job/beam_PostCommit_Python37/ws/src/sdks/python/pytest_postCommitIT-df-py37.xml> -
=========== 5 passed, 17 skipped, 14 warnings in 1781.49s (0:29:41) ============

FAILURE: Build completed with 2 failures.

1: Task failed with an exception.
-----------
* Where:
Script '<https://ci-beam.apache.org/job/beam_PostCommit_Python37/ws/src/sdks/python/test-suites/direct/common.gradle'> line: 194

* What went wrong:
Execution failed for task ':sdks:python:test-suites:direct:py37:azureIntegrationTest'.
> Process 'command 'sh'' finished with non-zero exit value 1

* Try:
> Run with --stacktrace option to get the stack trace.
> Run with --info or --debug option to get more log output.
==============================================================================

2: Task failed with an exception.
-----------
* Where:
Script '<https://ci-beam.apache.org/job/beam_PostCommit_Python37/ws/src/sdks/python/test-suites/direct/common.gradle'> line: 185

* What went wrong:
Execution failed for task ':sdks:python:test-suites:direct:py37:hdfsIntegrationTest'.
> Process 'command 'sh'' finished with non-zero exit value 1

* Try:
> Run with --stacktrace option to get the stack trace.
> Run with --info or --debug option to get more log output.
==============================================================================

* Get more help at https://help.gradle.org

Deprecated Gradle features were used in this build, making it incompatible with Gradle 8.0.

You can use '--warning-mode all' to show the individual deprecation warnings and determine if they come from your own scripts or plugins.

See https://docs.gradle.org/7.5.1/userguide/command_line_interface.html#sec:command_line_warnings

Execution optimizations have been disabled for 1 invalid unit(s) of work during this build to ensure correctness.
Please consult deprecation warnings for more details.

BUILD FAILED in 3h 46m 50s
212 actionable tasks: 148 executed, 58 from cache, 6 up-to-date

Publishing build scan...
https://gradle.com/s/lk2n4fo6ynxl6

Build step 'Invoke Gradle script' changed build result to FAILURE
Build step 'Invoke Gradle script' marked build as failure

---------------------------------------------------------------------
To unsubscribe, e-mail: builds-unsubscribe@beam.apache.org
For additional commands, e-mail: builds-help@beam.apache.org


Build failed in Jenkins: beam_PostCommit_Python37 #6322

Posted by Apache Jenkins Server <je...@builds.apache.org>.
See <https://ci-beam.apache.org/job/beam_PostCommit_Python37/6322/display/redirect>

Changes:


------------------------------------------
[...truncated 16.11 MB...]

apache_beam/dataframe/io_it_test.py: 2 warnings
apache_beam/io/gcp/bigquery_json_it_test.py: 1 warning
apache_beam/io/gcp/bigquery_read_it_test.py: 9 warnings
  <https://ci-beam.apache.org/job/beam_PostCommit_Python37/ws/src/sdks/python/apache_beam/io/gcp/bigquery.py>:2557: BeamDeprecationWarning: options is deprecated since First stable release. References to <pipeline>.options will not be supported
    | _PassThroughThenCleanupTempDatasets(project_to_cleanup_pcoll))

apache_beam/examples/cookbook/bigquery_tornadoes_it_test.py: 1 warning
apache_beam/io/gcp/big_query_query_to_table_it_test.py: 4 warnings
apache_beam/io/gcp/bigquery_write_it_test.py: 4 warnings
apache_beam/io/gcp/bigquery_test.py: 2 warnings
  <https://ci-beam.apache.org/job/beam_PostCommit_Python37/ws/src/sdks/python/apache_beam/io/gcp/bigquery.py>:1988: BeamDeprecationWarning: options is deprecated since First stable release. References to <pipeline>.options will not be supported
    self.table_reference.projectId = pcoll.pipeline.options.view_as(

apache_beam/examples/cookbook/bigquery_tornadoes_it_test.py: 1 warning
apache_beam/io/gcp/big_query_query_to_table_it_test.py: 4 warnings
apache_beam/io/gcp/bigquery_file_loads_test.py: 3 warnings
apache_beam/io/gcp/bigquery_test.py: 3 warnings
apache_beam/io/gcp/bigquery_write_it_test.py: 3 warnings
  <https://ci-beam.apache.org/job/beam_PostCommit_Python37/ws/src/sdks/python/apache_beam/io/gcp/bigquery_file_loads.py>:1166: BeamDeprecationWarning: options is deprecated since First stable release. References to <pipeline>.options will not be supported
    self.project = self.project or p.options.view_as(GoogleCloudOptions).project

apache_beam/examples/cookbook/bigquery_tornadoes_it_test.py: 1 warning
apache_beam/examples/complete/game/hourly_team_score_it_test.py: 1 warning
apache_beam/io/gcp/big_query_query_to_table_it_test.py: 4 warnings
apache_beam/io/gcp/bigquery_file_loads_test.py: 3 warnings
apache_beam/io/gcp/bigquery_test.py: 3 warnings
apache_beam/io/gcp/bigquery_write_it_test.py: 3 warnings
  <https://ci-beam.apache.org/job/beam_PostCommit_Python37/ws/src/sdks/python/apache_beam/io/gcp/bigquery_file_loads.py>:1173: BeamDeprecationWarning: options is deprecated since First stable release. References to <pipeline>.options will not be supported
    temp_location = p.options.view_as(GoogleCloudOptions).temp_location

apache_beam/examples/cookbook/bigquery_tornadoes_it_test.py: 1 warning
apache_beam/examples/complete/game/hourly_team_score_it_test.py: 1 warning
apache_beam/io/gcp/big_query_query_to_table_it_test.py: 4 warnings
apache_beam/io/gcp/bigquery_file_loads_test.py: 3 warnings
apache_beam/io/gcp/bigquery_test.py: 3 warnings
apache_beam/io/gcp/bigquery_write_it_test.py: 3 warnings
  <https://ci-beam.apache.org/job/beam_PostCommit_Python37/ws/src/sdks/python/apache_beam/io/gcp/bigquery_file_loads.py>:1175: BeamDeprecationWarning: options is deprecated since First stable release. References to <pipeline>.options will not be supported
    p.options.view_as(GoogleCloudOptions).job_name or 'AUTOMATIC_JOB_NAME')

apache_beam/examples/cookbook/bigquery_tornadoes_it_test.py::BigqueryTornadoesIT::test_bigquery_tornadoes_it
  <https://ci-beam.apache.org/job/beam_PostCommit_Python37/ws/src/sdks/python/apache_beam/io/gcp/tests/utils.py>:100: PendingDeprecationWarning: Client.dataset is deprecated and will be removed in a future version. Use a string like 'my_project.my_dataset' or a cloud.google.bigquery.DatasetReference object, instead.
    table_ref = client.dataset(dataset_id).table(table_id)

apache_beam/examples/dataframe/flight_delays_it_test.py::FlightDelaysTest::test_flight_delays
  <https://ci-beam.apache.org/job/beam_PostCommit_Python37/ws/src/sdks/python/apache_beam/examples/dataframe/flight_delays.py>:47: FutureWarning: Dropping of nuisance columns in DataFrame reductions (with 'numeric_only=None') is deprecated; in a future version this will raise TypeError.  Select only valid columns before calling the reduction.
    return airline_df[at_top_airports].mean()

apache_beam/examples/dataframe/flight_delays_it_test.py::FlightDelaysTest::test_flight_delays
apache_beam/examples/dataframe/taxiride_it_test.py::TaxirideIT::test_aggregation
apache_beam/examples/dataframe/taxiride_it_test.py::TaxirideIT::test_enrich
  <https://ci-beam.apache.org/job/beam_PostCommit_Python37/ws/src/sdks/python/apache_beam/dataframe/io.py>:664: FutureWarning: WriteToFiles is experimental.
    sink=lambda _: _WriteToPandasFileSink(

apache_beam/examples/dataframe/flight_delays_it_test.py::FlightDelaysTest::test_flight_delays
apache_beam/examples/dataframe/taxiride_it_test.py::TaxirideIT::test_aggregation
apache_beam/examples/dataframe/taxiride_it_test.py::TaxirideIT::test_enrich
  <https://ci-beam.apache.org/job/beam_PostCommit_Python37/ws/src/sdks/python/apache_beam/io/fileio.py>:591: BeamDeprecationWarning: options is deprecated since First stable release. References to <pipeline>.options will not be supported
    p.options.view_as(GoogleCloudOptions).temp_location or

apache_beam/io/gcp/bigquery_test.py::BigQueryStreamingInsertTransformIntegrationTests::test_multiple_destinations_transform
  <https://ci-beam.apache.org/job/beam_PostCommit_Python37/ws/src/sdks/python/apache_beam/io/gcp/bigquery_test.py>:1690: BeamDeprecationWarning: options is deprecated since First stable release. References to <pipeline>.options will not be supported
    streaming = self.test_pipeline.options.view_as(StandardOptions).streaming

apache_beam/io/gcp/bigquery_read_it_test.py::ReadTests::test_native_source
  <https://ci-beam.apache.org/job/beam_PostCommit_Python37/ws/src/sdks/python/apache_beam/io/gcp/bigquery_read_it_test.py>:170: BeamDeprecationWarning: BigQuerySource is deprecated since 2.25.0. Use ReadFromBigQuery instead.
    beam.io.BigQuerySource(query=self.query, use_standard_sql=True)))

apache_beam/ml/gcp/cloud_dlp_it_test.py::CloudDLPIT::test_deidentification
  <https://ci-beam.apache.org/job/beam_PostCommit_Python37/ws/src/sdks/python/apache_beam/ml/gcp/cloud_dlp_it_test.py>:77: FutureWarning: MaskDetectedDetails is experimental.
    inspection_config=INSPECT_CONFIG))

apache_beam/ml/inference/sklearn_inference_it_test.py::SklearnInference::test_sklearn_regression
  <https://ci-beam.apache.org/job/beam_PostCommit_Python37/ws/src/sdks/python/apache_beam/examples/inference/sklearn_japanese_housing_regression.py>:129: FutureWarning: SklearnModelHandlerPandas is experimental. No backwards-compatibility guarantees.
    model_file_type=ModelFileType.PICKLE, model_uri=model_filename)

apache_beam/ml/inference/sklearn_inference_it_test.py::SklearnInference::test_sklearn_regression
  <https://ci-beam.apache.org/job/beam_PostCommit_Python37/ws/src/build/gradleenv/-1734967052/lib/python3.7/site-packages/dill/_dill.py>:472: FutureWarning: SklearnModelHandlerPandas is experimental. No backwards-compatibility guarantees.
    obj = StockUnpickler.load(self)

apache_beam/ml/gcp/cloud_dlp_it_test.py::CloudDLPIT::test_inspection
  <https://ci-beam.apache.org/job/beam_PostCommit_Python37/ws/src/sdks/python/apache_beam/ml/gcp/cloud_dlp_it_test.py>:87: FutureWarning: InspectForDetails is experimental.
    | beam.ParDo(extract_inspection_results).with_outputs(

apache_beam/io/gcp/bigquery_read_it_test.py::ReadNewTypesTests::test_native_source
  <https://ci-beam.apache.org/job/beam_PostCommit_Python37/ws/src/sdks/python/apache_beam/io/gcp/bigquery_read_it_test.py>:693: BeamDeprecationWarning: BigQuerySource is deprecated since 2.25.0. Use ReadFromBigQuery instead.
    beam.io.BigQuerySource(query=self.query, use_standard_sql=True)))

apache_beam/io/gcp/bigquery_read_it_test.py::ReadAllBQTests::test_read_queries
  <https://ci-beam.apache.org/job/beam_PostCommit_Python37/ws/src/sdks/python/apache_beam/io/gcp/bigquery_read_it_test.py>:808: FutureWarning: ReadAllFromBigQuery is experimental.
    | beam.io.ReadAllFromBigQuery())

apache_beam/io/gcp/bigquery_read_it_test.py::ReadAllBQTests::test_read_queries
  <https://ci-beam.apache.org/job/beam_PostCommit_Python37/ws/src/sdks/python/apache_beam/io/gcp/bigquery.py>:2658: BeamDeprecationWarning: options is deprecated since First stable release. References to <pipeline>.options will not be supported
    job_name = pcoll.pipeline.options.view_as(GoogleCloudOptions).job_name

apache_beam/io/gcp/bigquery_read_it_test.py::ReadAllBQTests::test_read_queries
  <https://ci-beam.apache.org/job/beam_PostCommit_Python37/ws/src/sdks/python/apache_beam/io/gcp/bigquery.py>:2659: BeamDeprecationWarning: options is deprecated since First stable release. References to <pipeline>.options will not be supported
    project = pcoll.pipeline.options.view_as(GoogleCloudOptions).project

apache_beam/io/gcp/bigquery_read_it_test.py::ReadAllBQTests::test_read_queries
  <https://ci-beam.apache.org/job/beam_PostCommit_Python37/ws/src/sdks/python/apache_beam/io/gcp/bigquery.py>:2672: BeamDeprecationWarning: options is deprecated since First stable release. References to <pipeline>.options will not be supported
    options=pcoll.pipeline.options,

-- Docs: https://docs.pytest.org/en/stable/how-to/capture-warnings.html
- generated xml file: <https://ci-beam.apache.org/job/beam_PostCommit_Python37/ws/src/sdks/python/pytest_postCommitIT-df-py37.xml> -
========== 85 passed, 24 skipped, 225 warnings in 11893.58s (3:18:13) ==========

> Task :sdks:python:test-suites:dataflow:py37:spannerioIT
>>> RUNNING integration tests with pipeline options: --runner=TestDataflowRunner --project=apache-beam-testing --region=us-central1 --staging_location=gs://temp-storage-for-end-to-end-tests/staging-it --temp_location=gs://temp-storage-for-end-to-end-tests/temp-it --output=gs://temp-storage-for-end-to-end-tests/py-it-cloud/output --sdk_location=<https://ci-beam.apache.org/job/beam_PostCommit_Python37/ws/src/sdks/python/build/apache-beam.tar.gz> --requirements_file=postcommit_requirements.txt --num_workers=1 --sleep_secs=20 --kms_key_name=projects/apache-beam-testing/locations/global/keyRings/beam-it/cryptoKeys/test --dataflow_kms_key=projects/apache-beam-testing/locations/global/keyRings/beam-it/cryptoKeys/test
>>>   pytest options: --capture=no --timeout=4500 --color=yes --log-cli-level=INFO --numprocesses=8 --dist=loadfile
>>>   collect markers: -m=spannerio_it
============================= test session starts ==============================
platform linux -- Python 3.7.12, pytest-7.2.1, pluggy-1.0.0
rootdir: <https://ci-beam.apache.org/job/beam_PostCommit_Python37/ws/src/sdks/python,> configfile: pytest.ini
plugins: xdist-2.5.0, timeout-2.1.0, hypothesis-6.68.1, forked-1.6.0, requests-mock-1.10.0
timeout: 4500.0s
timeout method: signal
timeout func_only: False
gw0 I / gw1 I / gw2 I / gw3 I / gw4 I / gw5 I / gw6 I / gw7 I
[gw0] Python 3.7.12 (default, Jan 15 2022, 18:42:10)  -- [GCC 9.3.0]
[gw1] Python 3.7.12 (default, Jan 15 2022, 18:42:10)  -- [GCC 9.3.0]
[gw2] Python 3.7.12 (default, Jan 15 2022, 18:42:10)  -- [GCC 9.3.0]
[gw3] Python 3.7.12 (default, Jan 15 2022, 18:42:10)  -- [GCC 9.3.0]
[gw4] Python 3.7.12 (default, Jan 15 2022, 18:42:10)  -- [GCC 9.3.0]
[gw5] Python 3.7.12 (default, Jan 15 2022, 18:42:10)  -- [GCC 9.3.0]
[gw6] Python 3.7.12 (default, Jan 15 2022, 18:42:10)  -- [GCC 9.3.0]
[gw7] Python 3.7.12 (default, Jan 15 2022, 18:42:10)  -- [GCC 9.3.0]
gw0 [15] / gw1 [15] / gw2 [15] / gw3 [15] / gw4 [15] / gw5 [15] / gw6 [15] / gw7 [15]

scheduling tests via LoadFileScheduling

apache_beam/io/gcp/experimental/spannerio_read_it_test.py::SpannerReadIntegrationTest::test_read_via_sql 
apache_beam/io/gcp/experimental/spannerio_write_it_test.py::SpannerWriteIntegrationTest::test_metrics_error_call 
[gw1] SKIPPED apache_beam/io/gcp/experimental/spannerio_write_it_test.py::SpannerWriteIntegrationTest::test_metrics_error_call 
apache_beam/io/gcp/experimental/spannerio_write_it_test.py::SpannerWriteIntegrationTest::test_metrics_ok_call 
[gw1] SKIPPED apache_beam/io/gcp/experimental/spannerio_write_it_test.py::SpannerWriteIntegrationTest::test_metrics_ok_call 
apache_beam/io/gcp/experimental/spannerio_write_it_test.py::SpannerWriteIntegrationTest::test_spanner_error 
[gw0] PASSED apache_beam/io/gcp/experimental/spannerio_read_it_test.py::SpannerReadIntegrationTest::test_read_via_sql 
apache_beam/io/gcp/experimental/spannerio_read_it_test.py::SpannerReadIntegrationTest::test_read_via_table 
[gw1] PASSED apache_beam/io/gcp/experimental/spannerio_write_it_test.py::SpannerWriteIntegrationTest::test_spanner_error 
apache_beam/io/gcp/experimental/spannerio_write_it_test.py::SpannerWriteIntegrationTest::test_spanner_update 
[gw0] PASSED apache_beam/io/gcp/experimental/spannerio_read_it_test.py::SpannerReadIntegrationTest::test_read_via_table 
apache_beam/io/gcp/experimental/spannerio_read_it_test.py::SpannerReadIntegrationTest::test_sql_metrics_error_call 
[gw0] SKIPPED apache_beam/io/gcp/experimental/spannerio_read_it_test.py::SpannerReadIntegrationTest::test_sql_metrics_error_call 
apache_beam/io/gcp/experimental/spannerio_read_it_test.py::SpannerReadIntegrationTest::test_sql_metrics_ok_call 
[gw0] SKIPPED apache_beam/io/gcp/experimental/spannerio_read_it_test.py::SpannerReadIntegrationTest::test_sql_metrics_ok_call 
apache_beam/io/gcp/experimental/spannerio_read_it_test.py::SpannerReadIntegrationTest::test_table_metrics_error_call 
[gw0] SKIPPED apache_beam/io/gcp/experimental/spannerio_read_it_test.py::SpannerReadIntegrationTest::test_table_metrics_error_call 
apache_beam/io/gcp/experimental/spannerio_read_it_test.py::SpannerReadIntegrationTest::test_table_metrics_ok_call 
[gw0] SKIPPED apache_beam/io/gcp/experimental/spannerio_read_it_test.py::SpannerReadIntegrationTest::test_table_metrics_ok_call 
apache_beam/io/gcp/experimental/spannerio_read_it_test.py::SpannerReadIntegrationTest::test_transaction_sql_metrics_error_call 
[gw0] SKIPPED apache_beam/io/gcp/experimental/spannerio_read_it_test.py::SpannerReadIntegrationTest::test_transaction_sql_metrics_error_call 
apache_beam/io/gcp/experimental/spannerio_read_it_test.py::SpannerReadIntegrationTest::test_transaction_sql_metrics_ok_call 
[gw0] SKIPPED apache_beam/io/gcp/experimental/spannerio_read_it_test.py::SpannerReadIntegrationTest::test_transaction_sql_metrics_ok_call 
apache_beam/io/gcp/experimental/spannerio_read_it_test.py::SpannerReadIntegrationTest::test_transaction_table_metrics_error_call 
[gw0] SKIPPED apache_beam/io/gcp/experimental/spannerio_read_it_test.py::SpannerReadIntegrationTest::test_transaction_table_metrics_error_call 
apache_beam/io/gcp/experimental/spannerio_read_it_test.py::SpannerReadIntegrationTest::test_transaction_table_metrics_ok_call 
[gw0] SKIPPED apache_beam/io/gcp/experimental/spannerio_read_it_test.py::SpannerReadIntegrationTest::test_transaction_table_metrics_ok_call 
[gw1] PASSED apache_beam/io/gcp/experimental/spannerio_write_it_test.py::SpannerWriteIntegrationTest::test_spanner_update 
apache_beam/io/gcp/experimental/spannerio_write_it_test.py::SpannerWriteIntegrationTest::test_write_batches 
[gw1] PASSED apache_beam/io/gcp/experimental/spannerio_write_it_test.py::SpannerWriteIntegrationTest::test_write_batches 

=============================== warnings summary ===============================
../../build/gradleenv/-1734967052/lib/python3.7/site-packages/hdfs/config.py:15
../../build/gradleenv/-1734967052/lib/python3.7/site-packages/hdfs/config.py:15
../../build/gradleenv/-1734967052/lib/python3.7/site-packages/hdfs/config.py:15
../../build/gradleenv/-1734967052/lib/python3.7/site-packages/hdfs/config.py:15
../../build/gradleenv/-1734967052/lib/python3.7/site-packages/hdfs/config.py:15
../../build/gradleenv/-1734967052/lib/python3.7/site-packages/hdfs/config.py:15
../../build/gradleenv/-1734967052/lib/python3.7/site-packages/hdfs/config.py:15
../../build/gradleenv/-1734967052/lib/python3.7/site-packages/hdfs/config.py:15
../../build/gradleenv/-1734967052/lib/python3.7/site-packages/hdfs/config.py:15
  <https://ci-beam.apache.org/job/beam_PostCommit_Python37/ws/src/build/gradleenv/-1734967052/lib/python3.7/site-packages/hdfs/config.py>:15: DeprecationWarning: the imp module is deprecated in favour of importlib; see the module's documentation for alternative uses
    from imp import load_source

apache_beam/io/gcp/experimental/spannerio_read_it_test.py::SpannerReadIntegrationTest::test_read_via_sql
  <https://ci-beam.apache.org/job/beam_PostCommit_Python37/ws/src/sdks/python/apache_beam/io/gcp/experimental/spannerio_read_it_test.py>:128: FutureWarning: ReadFromSpanner is experimental. No backwards-compatibility guarantees.
    sql="select * from Users")

apache_beam/io/gcp/experimental/spannerio_write_it_test.py::SpannerWriteIntegrationTest::test_spanner_error
  <https://ci-beam.apache.org/job/beam_PostCommit_Python37/ws/src/sdks/python/apache_beam/io/gcp/experimental/spannerio_write_it_test.py>:190: FutureWarning: WriteToSpanner is experimental. No backwards-compatibility guarantees.
    database_id=self.TEST_DATABASE))

apache_beam/io/gcp/experimental/spannerio_read_it_test.py::SpannerReadIntegrationTest::test_read_via_table
  <https://ci-beam.apache.org/job/beam_PostCommit_Python37/ws/src/sdks/python/apache_beam/io/gcp/experimental/spannerio_read_it_test.py>:117: FutureWarning: ReadFromSpanner is experimental. No backwards-compatibility guarantees.
    columns=["UserId", "Key"])

apache_beam/io/gcp/experimental/spannerio_write_it_test.py::SpannerWriteIntegrationTest::test_spanner_update
  <https://ci-beam.apache.org/job/beam_PostCommit_Python37/ws/src/sdks/python/apache_beam/io/gcp/experimental/spannerio_write_it_test.py>:171: FutureWarning: WriteToSpanner is experimental. No backwards-compatibility guarantees.
    database_id=self.TEST_DATABASE))

apache_beam/io/gcp/experimental/spannerio_write_it_test.py::SpannerWriteIntegrationTest::test_write_batches
  <https://ci-beam.apache.org/job/beam_PostCommit_Python37/ws/src/sdks/python/apache_beam/io/gcp/experimental/spannerio_write_it_test.py>:135: FutureWarning: WriteToSpanner is experimental. No backwards-compatibility guarantees.
    max_batch_size_bytes=250))

-- Docs: https://docs.pytest.org/en/stable/how-to/capture-warnings.html
- generated xml file: <https://ci-beam.apache.org/job/beam_PostCommit_Python37/ws/src/sdks/python/pytest_postCommitIT-df-py37.xml> -
=========== 5 passed, 17 skipped, 14 warnings in 1689.78s (0:28:09) ============

FAILURE: Build completed with 2 failures.

1: Task failed with an exception.
-----------
* Where:
Script '<https://ci-beam.apache.org/job/beam_PostCommit_Python37/ws/src/sdks/python/test-suites/direct/common.gradle'> line: 194

* What went wrong:
Execution failed for task ':sdks:python:test-suites:direct:py37:azureIntegrationTest'.
> Process 'command 'sh'' finished with non-zero exit value 1

* Try:
> Run with --stacktrace option to get the stack trace.
> Run with --info or --debug option to get more log output.
==============================================================================

2: Task failed with an exception.
-----------
* Where:
Script '<https://ci-beam.apache.org/job/beam_PostCommit_Python37/ws/src/sdks/python/test-suites/direct/common.gradle'> line: 185

* What went wrong:
Execution failed for task ':sdks:python:test-suites:direct:py37:hdfsIntegrationTest'.
> Process 'command 'sh'' finished with non-zero exit value 1

* Try:
> Run with --stacktrace option to get the stack trace.
> Run with --info or --debug option to get more log output.
==============================================================================

* Get more help at https://help.gradle.org

Deprecated Gradle features were used in this build, making it incompatible with Gradle 8.0.

You can use '--warning-mode all' to show the individual deprecation warnings and determine if they come from your own scripts or plugins.

See https://docs.gradle.org/7.5.1/userguide/command_line_interface.html#sec:command_line_warnings

Execution optimizations have been disabled for 1 invalid unit(s) of work during this build to ensure correctness.
Please consult deprecation warnings for more details.

BUILD FAILED in 3h 48m 21s
212 actionable tasks: 148 executed, 58 from cache, 6 up-to-date

Publishing build scan...
https://gradle.com/s/rwpiykzbwz7ty

Build step 'Invoke Gradle script' changed build result to FAILURE
Build step 'Invoke Gradle script' marked build as failure

---------------------------------------------------------------------
To unsubscribe, e-mail: builds-unsubscribe@beam.apache.org
For additional commands, e-mail: builds-help@beam.apache.org


Build failed in Jenkins: beam_PostCommit_Python37 #6321

Posted by Apache Jenkins Server <je...@builds.apache.org>.
See <https://ci-beam.apache.org/job/beam_PostCommit_Python37/6321/display/redirect>

Changes:


------------------------------------------
[...truncated 16.03 MB...]

apache_beam/dataframe/io_it_test.py: 2 warnings
apache_beam/io/gcp/bigquery_json_it_test.py: 1 warning
apache_beam/io/gcp/bigquery_read_it_test.py: 9 warnings
  <https://ci-beam.apache.org/job/beam_PostCommit_Python37/ws/src/sdks/python/apache_beam/io/gcp/bigquery.py>:2557: BeamDeprecationWarning: options is deprecated since First stable release. References to <pipeline>.options will not be supported
    | _PassThroughThenCleanupTempDatasets(project_to_cleanup_pcoll))

apache_beam/examples/cookbook/bigquery_tornadoes_it_test.py: 1 warning
apache_beam/io/gcp/big_query_query_to_table_it_test.py: 4 warnings
apache_beam/io/gcp/bigquery_write_it_test.py: 4 warnings
apache_beam/io/gcp/bigquery_test.py: 2 warnings
  <https://ci-beam.apache.org/job/beam_PostCommit_Python37/ws/src/sdks/python/apache_beam/io/gcp/bigquery.py>:1988: BeamDeprecationWarning: options is deprecated since First stable release. References to <pipeline>.options will not be supported
    self.table_reference.projectId = pcoll.pipeline.options.view_as(

apache_beam/examples/cookbook/bigquery_tornadoes_it_test.py: 1 warning
apache_beam/io/gcp/big_query_query_to_table_it_test.py: 4 warnings
apache_beam/io/gcp/bigquery_write_it_test.py: 3 warnings
apache_beam/io/gcp/bigquery_test.py: 3 warnings
apache_beam/io/gcp/bigquery_file_loads_test.py: 3 warnings
  <https://ci-beam.apache.org/job/beam_PostCommit_Python37/ws/src/sdks/python/apache_beam/io/gcp/bigquery_file_loads.py>:1166: BeamDeprecationWarning: options is deprecated since First stable release. References to <pipeline>.options will not be supported
    self.project = self.project or p.options.view_as(GoogleCloudOptions).project

apache_beam/examples/cookbook/bigquery_tornadoes_it_test.py: 1 warning
apache_beam/examples/complete/game/hourly_team_score_it_test.py: 1 warning
apache_beam/io/gcp/big_query_query_to_table_it_test.py: 4 warnings
apache_beam/io/gcp/bigquery_write_it_test.py: 3 warnings
apache_beam/io/gcp/bigquery_test.py: 3 warnings
apache_beam/io/gcp/bigquery_file_loads_test.py: 3 warnings
  <https://ci-beam.apache.org/job/beam_PostCommit_Python37/ws/src/sdks/python/apache_beam/io/gcp/bigquery_file_loads.py>:1173: BeamDeprecationWarning: options is deprecated since First stable release. References to <pipeline>.options will not be supported
    temp_location = p.options.view_as(GoogleCloudOptions).temp_location

apache_beam/examples/cookbook/bigquery_tornadoes_it_test.py: 1 warning
apache_beam/examples/complete/game/hourly_team_score_it_test.py: 1 warning
apache_beam/io/gcp/big_query_query_to_table_it_test.py: 4 warnings
apache_beam/io/gcp/bigquery_write_it_test.py: 3 warnings
apache_beam/io/gcp/bigquery_test.py: 3 warnings
apache_beam/io/gcp/bigquery_file_loads_test.py: 3 warnings
  <https://ci-beam.apache.org/job/beam_PostCommit_Python37/ws/src/sdks/python/apache_beam/io/gcp/bigquery_file_loads.py>:1175: BeamDeprecationWarning: options is deprecated since First stable release. References to <pipeline>.options will not be supported
    p.options.view_as(GoogleCloudOptions).job_name or 'AUTOMATIC_JOB_NAME')

apache_beam/examples/cookbook/bigquery_tornadoes_it_test.py::BigqueryTornadoesIT::test_bigquery_tornadoes_it
  <https://ci-beam.apache.org/job/beam_PostCommit_Python37/ws/src/sdks/python/apache_beam/io/gcp/tests/utils.py>:100: PendingDeprecationWarning: Client.dataset is deprecated and will be removed in a future version. Use a string like 'my_project.my_dataset' or a cloud.google.bigquery.DatasetReference object, instead.
    table_ref = client.dataset(dataset_id).table(table_id)

apache_beam/examples/dataframe/flight_delays_it_test.py::FlightDelaysTest::test_flight_delays
  <https://ci-beam.apache.org/job/beam_PostCommit_Python37/ws/src/sdks/python/apache_beam/examples/dataframe/flight_delays.py>:47: FutureWarning: Dropping of nuisance columns in DataFrame reductions (with 'numeric_only=None') is deprecated; in a future version this will raise TypeError.  Select only valid columns before calling the reduction.
    return airline_df[at_top_airports].mean()

apache_beam/examples/dataframe/flight_delays_it_test.py::FlightDelaysTest::test_flight_delays
apache_beam/examples/dataframe/taxiride_it_test.py::TaxirideIT::test_aggregation
apache_beam/examples/dataframe/taxiride_it_test.py::TaxirideIT::test_enrich
  <https://ci-beam.apache.org/job/beam_PostCommit_Python37/ws/src/sdks/python/apache_beam/dataframe/io.py>:664: FutureWarning: WriteToFiles is experimental.
    sink=lambda _: _WriteToPandasFileSink(

apache_beam/examples/dataframe/flight_delays_it_test.py::FlightDelaysTest::test_flight_delays
apache_beam/examples/dataframe/taxiride_it_test.py::TaxirideIT::test_aggregation
apache_beam/examples/dataframe/taxiride_it_test.py::TaxirideIT::test_enrich
  <https://ci-beam.apache.org/job/beam_PostCommit_Python37/ws/src/sdks/python/apache_beam/io/fileio.py>:591: BeamDeprecationWarning: options is deprecated since First stable release. References to <pipeline>.options will not be supported
    p.options.view_as(GoogleCloudOptions).temp_location or

apache_beam/io/gcp/bigquery_test.py::BigQueryStreamingInsertTransformIntegrationTests::test_multiple_destinations_transform
  <https://ci-beam.apache.org/job/beam_PostCommit_Python37/ws/src/sdks/python/apache_beam/io/gcp/bigquery_test.py>:1690: BeamDeprecationWarning: options is deprecated since First stable release. References to <pipeline>.options will not be supported
    streaming = self.test_pipeline.options.view_as(StandardOptions).streaming

apache_beam/io/gcp/bigquery_read_it_test.py::ReadTests::test_native_source
  <https://ci-beam.apache.org/job/beam_PostCommit_Python37/ws/src/sdks/python/apache_beam/io/gcp/bigquery_read_it_test.py>:170: BeamDeprecationWarning: BigQuerySource is deprecated since 2.25.0. Use ReadFromBigQuery instead.
    beam.io.BigQuerySource(query=self.query, use_standard_sql=True)))

apache_beam/ml/inference/sklearn_inference_it_test.py::SklearnInference::test_sklearn_regression
  <https://ci-beam.apache.org/job/beam_PostCommit_Python37/ws/src/sdks/python/apache_beam/examples/inference/sklearn_japanese_housing_regression.py>:129: FutureWarning: SklearnModelHandlerPandas is experimental. No backwards-compatibility guarantees.
    model_file_type=ModelFileType.PICKLE, model_uri=model_filename)

apache_beam/ml/inference/sklearn_inference_it_test.py::SklearnInference::test_sklearn_regression
  <https://ci-beam.apache.org/job/beam_PostCommit_Python37/ws/src/build/gradleenv/-1734967052/lib/python3.7/site-packages/dill/_dill.py>:472: FutureWarning: SklearnModelHandlerPandas is experimental. No backwards-compatibility guarantees.
    obj = StockUnpickler.load(self)

apache_beam/ml/gcp/cloud_dlp_it_test.py::CloudDLPIT::test_deidentification
  <https://ci-beam.apache.org/job/beam_PostCommit_Python37/ws/src/sdks/python/apache_beam/ml/gcp/cloud_dlp_it_test.py>:77: FutureWarning: MaskDetectedDetails is experimental.
    inspection_config=INSPECT_CONFIG))

apache_beam/ml/gcp/cloud_dlp_it_test.py::CloudDLPIT::test_inspection
  <https://ci-beam.apache.org/job/beam_PostCommit_Python37/ws/src/sdks/python/apache_beam/ml/gcp/cloud_dlp_it_test.py>:87: FutureWarning: InspectForDetails is experimental.
    | beam.ParDo(extract_inspection_results).with_outputs(

apache_beam/io/gcp/bigquery_read_it_test.py::ReadNewTypesTests::test_native_source
  <https://ci-beam.apache.org/job/beam_PostCommit_Python37/ws/src/sdks/python/apache_beam/io/gcp/bigquery_read_it_test.py>:693: BeamDeprecationWarning: BigQuerySource is deprecated since 2.25.0. Use ReadFromBigQuery instead.
    beam.io.BigQuerySource(query=self.query, use_standard_sql=True)))

apache_beam/io/gcp/bigquery_read_it_test.py::ReadAllBQTests::test_read_queries
  <https://ci-beam.apache.org/job/beam_PostCommit_Python37/ws/src/sdks/python/apache_beam/io/gcp/bigquery_read_it_test.py>:808: FutureWarning: ReadAllFromBigQuery is experimental.
    | beam.io.ReadAllFromBigQuery())

apache_beam/io/gcp/bigquery_read_it_test.py::ReadAllBQTests::test_read_queries
  <https://ci-beam.apache.org/job/beam_PostCommit_Python37/ws/src/sdks/python/apache_beam/io/gcp/bigquery.py>:2658: BeamDeprecationWarning: options is deprecated since First stable release. References to <pipeline>.options will not be supported
    job_name = pcoll.pipeline.options.view_as(GoogleCloudOptions).job_name

apache_beam/io/gcp/bigquery_read_it_test.py::ReadAllBQTests::test_read_queries
  <https://ci-beam.apache.org/job/beam_PostCommit_Python37/ws/src/sdks/python/apache_beam/io/gcp/bigquery.py>:2659: BeamDeprecationWarning: options is deprecated since First stable release. References to <pipeline>.options will not be supported
    project = pcoll.pipeline.options.view_as(GoogleCloudOptions).project

apache_beam/io/gcp/bigquery_read_it_test.py::ReadAllBQTests::test_read_queries
  <https://ci-beam.apache.org/job/beam_PostCommit_Python37/ws/src/sdks/python/apache_beam/io/gcp/bigquery.py>:2672: BeamDeprecationWarning: options is deprecated since First stable release. References to <pipeline>.options will not be supported
    options=pcoll.pipeline.options,

-- Docs: https://docs.pytest.org/en/stable/how-to/capture-warnings.html
- generated xml file: <https://ci-beam.apache.org/job/beam_PostCommit_Python37/ws/src/sdks/python/pytest_postCommitIT-df-py37.xml> -
========== 85 passed, 24 skipped, 225 warnings in 11581.27s (3:13:01) ==========

> Task :sdks:python:test-suites:dataflow:py37:spannerioIT
>>> RUNNING integration tests with pipeline options: --runner=TestDataflowRunner --project=apache-beam-testing --region=us-central1 --staging_location=gs://temp-storage-for-end-to-end-tests/staging-it --temp_location=gs://temp-storage-for-end-to-end-tests/temp-it --output=gs://temp-storage-for-end-to-end-tests/py-it-cloud/output --sdk_location=<https://ci-beam.apache.org/job/beam_PostCommit_Python37/ws/src/sdks/python/build/apache-beam.tar.gz> --requirements_file=postcommit_requirements.txt --num_workers=1 --sleep_secs=20 --kms_key_name=projects/apache-beam-testing/locations/global/keyRings/beam-it/cryptoKeys/test --dataflow_kms_key=projects/apache-beam-testing/locations/global/keyRings/beam-it/cryptoKeys/test
>>>   pytest options: --capture=no --timeout=4500 --color=yes --log-cli-level=INFO --numprocesses=8 --dist=loadfile
>>>   collect markers: -m=spannerio_it
============================= test session starts ==============================
platform linux -- Python 3.7.12, pytest-7.2.1, pluggy-1.0.0
rootdir: <https://ci-beam.apache.org/job/beam_PostCommit_Python37/ws/src/sdks/python,> configfile: pytest.ini
plugins: xdist-2.5.0, timeout-2.1.0, forked-1.5.0, hypothesis-6.68.1, requests-mock-1.10.0
timeout: 4500.0s
timeout method: signal
timeout func_only: False
gw0 I / gw1 I / gw2 I / gw3 I / gw4 I / gw5 I / gw6 I / gw7 I
[gw0] Python 3.7.12 (default, Jan 15 2022, 18:42:10)  -- [GCC 9.3.0]
[gw1] Python 3.7.12 (default, Jan 15 2022, 18:42:10)  -- [GCC 9.3.0]
[gw3] Python 3.7.12 (default, Jan 15 2022, 18:42:10)  -- [GCC 9.3.0]
[gw2] Python 3.7.12 (default, Jan 15 2022, 18:42:10)  -- [GCC 9.3.0]
[gw4] Python 3.7.12 (default, Jan 15 2022, 18:42:10)  -- [GCC 9.3.0]
[gw5] Python 3.7.12 (default, Jan 15 2022, 18:42:10)  -- [GCC 9.3.0]
[gw6] Python 3.7.12 (default, Jan 15 2022, 18:42:10)  -- [GCC 9.3.0]
[gw7] Python 3.7.12 (default, Jan 15 2022, 18:42:10)  -- [GCC 9.3.0]
gw0 [15] / gw1 [15] / gw2 [15] / gw3 [15] / gw4 [15] / gw5 [15] / gw6 [15] / gw7 [15]

scheduling tests via LoadFileScheduling

apache_beam/io/gcp/experimental/spannerio_read_it_test.py::SpannerReadIntegrationTest::test_read_via_sql 
apache_beam/io/gcp/experimental/spannerio_write_it_test.py::SpannerWriteIntegrationTest::test_metrics_error_call 
[gw1] SKIPPED apache_beam/io/gcp/experimental/spannerio_write_it_test.py::SpannerWriteIntegrationTest::test_metrics_error_call 
apache_beam/io/gcp/experimental/spannerio_write_it_test.py::SpannerWriteIntegrationTest::test_metrics_ok_call 
[gw1] SKIPPED apache_beam/io/gcp/experimental/spannerio_write_it_test.py::SpannerWriteIntegrationTest::test_metrics_ok_call 
apache_beam/io/gcp/experimental/spannerio_write_it_test.py::SpannerWriteIntegrationTest::test_spanner_error 
[gw1] PASSED apache_beam/io/gcp/experimental/spannerio_write_it_test.py::SpannerWriteIntegrationTest::test_spanner_error 
apache_beam/io/gcp/experimental/spannerio_write_it_test.py::SpannerWriteIntegrationTest::test_spanner_update 
[gw0] PASSED apache_beam/io/gcp/experimental/spannerio_read_it_test.py::SpannerReadIntegrationTest::test_read_via_sql 
apache_beam/io/gcp/experimental/spannerio_read_it_test.py::SpannerReadIntegrationTest::test_read_via_table 
[gw1] PASSED apache_beam/io/gcp/experimental/spannerio_write_it_test.py::SpannerWriteIntegrationTest::test_spanner_update 
apache_beam/io/gcp/experimental/spannerio_write_it_test.py::SpannerWriteIntegrationTest::test_write_batches 
[gw0] PASSED apache_beam/io/gcp/experimental/spannerio_read_it_test.py::SpannerReadIntegrationTest::test_read_via_table 
apache_beam/io/gcp/experimental/spannerio_read_it_test.py::SpannerReadIntegrationTest::test_sql_metrics_error_call 
[gw0] SKIPPED apache_beam/io/gcp/experimental/spannerio_read_it_test.py::SpannerReadIntegrationTest::test_sql_metrics_error_call 
apache_beam/io/gcp/experimental/spannerio_read_it_test.py::SpannerReadIntegrationTest::test_sql_metrics_ok_call 
[gw0] SKIPPED apache_beam/io/gcp/experimental/spannerio_read_it_test.py::SpannerReadIntegrationTest::test_sql_metrics_ok_call 
apache_beam/io/gcp/experimental/spannerio_read_it_test.py::SpannerReadIntegrationTest::test_table_metrics_error_call 
[gw0] SKIPPED apache_beam/io/gcp/experimental/spannerio_read_it_test.py::SpannerReadIntegrationTest::test_table_metrics_error_call 
apache_beam/io/gcp/experimental/spannerio_read_it_test.py::SpannerReadIntegrationTest::test_table_metrics_ok_call 
[gw0] SKIPPED apache_beam/io/gcp/experimental/spannerio_read_it_test.py::SpannerReadIntegrationTest::test_table_metrics_ok_call 
apache_beam/io/gcp/experimental/spannerio_read_it_test.py::SpannerReadIntegrationTest::test_transaction_sql_metrics_error_call 
[gw0] SKIPPED apache_beam/io/gcp/experimental/spannerio_read_it_test.py::SpannerReadIntegrationTest::test_transaction_sql_metrics_error_call 
apache_beam/io/gcp/experimental/spannerio_read_it_test.py::SpannerReadIntegrationTest::test_transaction_sql_metrics_ok_call 
[gw0] SKIPPED apache_beam/io/gcp/experimental/spannerio_read_it_test.py::SpannerReadIntegrationTest::test_transaction_sql_metrics_ok_call 
apache_beam/io/gcp/experimental/spannerio_read_it_test.py::SpannerReadIntegrationTest::test_transaction_table_metrics_error_call 
[gw0] SKIPPED apache_beam/io/gcp/experimental/spannerio_read_it_test.py::SpannerReadIntegrationTest::test_transaction_table_metrics_error_call 
apache_beam/io/gcp/experimental/spannerio_read_it_test.py::SpannerReadIntegrationTest::test_transaction_table_metrics_ok_call 
[gw0] SKIPPED apache_beam/io/gcp/experimental/spannerio_read_it_test.py::SpannerReadIntegrationTest::test_transaction_table_metrics_ok_call 
[gw1] PASSED apache_beam/io/gcp/experimental/spannerio_write_it_test.py::SpannerWriteIntegrationTest::test_write_batches 

=============================== warnings summary ===============================
../../build/gradleenv/-1734967052/lib/python3.7/site-packages/hdfs/config.py:15
../../build/gradleenv/-1734967052/lib/python3.7/site-packages/hdfs/config.py:15
../../build/gradleenv/-1734967052/lib/python3.7/site-packages/hdfs/config.py:15
../../build/gradleenv/-1734967052/lib/python3.7/site-packages/hdfs/config.py:15
../../build/gradleenv/-1734967052/lib/python3.7/site-packages/hdfs/config.py:15
../../build/gradleenv/-1734967052/lib/python3.7/site-packages/hdfs/config.py:15
../../build/gradleenv/-1734967052/lib/python3.7/site-packages/hdfs/config.py:15
../../build/gradleenv/-1734967052/lib/python3.7/site-packages/hdfs/config.py:15
../../build/gradleenv/-1734967052/lib/python3.7/site-packages/hdfs/config.py:15
  <https://ci-beam.apache.org/job/beam_PostCommit_Python37/ws/src/build/gradleenv/-1734967052/lib/python3.7/site-packages/hdfs/config.py>:15: DeprecationWarning: the imp module is deprecated in favour of importlib; see the module's documentation for alternative uses
    from imp import load_source

apache_beam/io/gcp/experimental/spannerio_write_it_test.py::SpannerWriteIntegrationTest::test_spanner_error
  <https://ci-beam.apache.org/job/beam_PostCommit_Python37/ws/src/sdks/python/apache_beam/io/gcp/experimental/spannerio_write_it_test.py>:190: FutureWarning: WriteToSpanner is experimental. No backwards-compatibility guarantees.
    database_id=self.TEST_DATABASE))

apache_beam/io/gcp/experimental/spannerio_read_it_test.py::SpannerReadIntegrationTest::test_read_via_sql
  <https://ci-beam.apache.org/job/beam_PostCommit_Python37/ws/src/sdks/python/apache_beam/io/gcp/experimental/spannerio_read_it_test.py>:128: FutureWarning: ReadFromSpanner is experimental. No backwards-compatibility guarantees.
    sql="select * from Users")

apache_beam/io/gcp/experimental/spannerio_write_it_test.py::SpannerWriteIntegrationTest::test_spanner_update
  <https://ci-beam.apache.org/job/beam_PostCommit_Python37/ws/src/sdks/python/apache_beam/io/gcp/experimental/spannerio_write_it_test.py>:171: FutureWarning: WriteToSpanner is experimental. No backwards-compatibility guarantees.
    database_id=self.TEST_DATABASE))

apache_beam/io/gcp/experimental/spannerio_read_it_test.py::SpannerReadIntegrationTest::test_read_via_table
  <https://ci-beam.apache.org/job/beam_PostCommit_Python37/ws/src/sdks/python/apache_beam/io/gcp/experimental/spannerio_read_it_test.py>:117: FutureWarning: ReadFromSpanner is experimental. No backwards-compatibility guarantees.
    columns=["UserId", "Key"])

apache_beam/io/gcp/experimental/spannerio_write_it_test.py::SpannerWriteIntegrationTest::test_write_batches
  <https://ci-beam.apache.org/job/beam_PostCommit_Python37/ws/src/sdks/python/apache_beam/io/gcp/experimental/spannerio_write_it_test.py>:135: FutureWarning: WriteToSpanner is experimental. No backwards-compatibility guarantees.
    max_batch_size_bytes=250))

-- Docs: https://docs.pytest.org/en/stable/how-to/capture-warnings.html
- generated xml file: <https://ci-beam.apache.org/job/beam_PostCommit_Python37/ws/src/sdks/python/pytest_postCommitIT-df-py37.xml> -
=========== 5 passed, 17 skipped, 14 warnings in 1739.50s (0:28:59) ============

FAILURE: Build completed with 2 failures.

1: Task failed with an exception.
-----------
* Where:
Script '<https://ci-beam.apache.org/job/beam_PostCommit_Python37/ws/src/sdks/python/test-suites/direct/common.gradle'> line: 194

* What went wrong:
Execution failed for task ':sdks:python:test-suites:direct:py37:azureIntegrationTest'.
> Process 'command 'sh'' finished with non-zero exit value 1

* Try:
> Run with --stacktrace option to get the stack trace.
> Run with --info or --debug option to get more log output.
==============================================================================

2: Task failed with an exception.
-----------
* Where:
Script '<https://ci-beam.apache.org/job/beam_PostCommit_Python37/ws/src/sdks/python/test-suites/direct/common.gradle'> line: 185

* What went wrong:
Execution failed for task ':sdks:python:test-suites:direct:py37:hdfsIntegrationTest'.
> Process 'command 'sh'' finished with non-zero exit value 1

* Try:
> Run with --stacktrace option to get the stack trace.
> Run with --info or --debug option to get more log output.
==============================================================================

* Get more help at https://help.gradle.org

Deprecated Gradle features were used in this build, making it incompatible with Gradle 8.0.

You can use '--warning-mode all' to show the individual deprecation warnings and determine if they come from your own scripts or plugins.

See https://docs.gradle.org/7.5.1/userguide/command_line_interface.html#sec:command_line_warnings

Execution optimizations have been disabled for 1 invalid unit(s) of work during this build to ensure correctness.
Please consult deprecation warnings for more details.

BUILD FAILED in 3h 44m 6s
212 actionable tasks: 148 executed, 58 from cache, 6 up-to-date

Publishing build scan...
https://gradle.com/s/n6pbrwio2h3sc

Build step 'Invoke Gradle script' changed build result to FAILURE
Build step 'Invoke Gradle script' marked build as failure

---------------------------------------------------------------------
To unsubscribe, e-mail: builds-unsubscribe@beam.apache.org
For additional commands, e-mail: builds-help@beam.apache.org


Build failed in Jenkins: beam_PostCommit_Python37 #6320

Posted by Apache Jenkins Server <je...@builds.apache.org>.
See <https://ci-beam.apache.org/job/beam_PostCommit_Python37/6320/display/redirect>

Changes:


------------------------------------------
[...truncated 16.15 MB...]

apache_beam/dataframe/io_it_test.py: 2 warnings
apache_beam/io/gcp/bigquery_json_it_test.py: 1 warning
apache_beam/io/gcp/bigquery_read_it_test.py: 9 warnings
  <https://ci-beam.apache.org/job/beam_PostCommit_Python37/ws/src/sdks/python/apache_beam/io/gcp/bigquery.py>:2557: BeamDeprecationWarning: options is deprecated since First stable release. References to <pipeline>.options will not be supported
    | _PassThroughThenCleanupTempDatasets(project_to_cleanup_pcoll))

apache_beam/examples/cookbook/bigquery_tornadoes_it_test.py: 1 warning
apache_beam/io/gcp/bigquery_write_it_test.py: 4 warnings
apache_beam/io/gcp/bigquery_test.py: 2 warnings
apache_beam/io/gcp/big_query_query_to_table_it_test.py: 4 warnings
  <https://ci-beam.apache.org/job/beam_PostCommit_Python37/ws/src/sdks/python/apache_beam/io/gcp/bigquery.py>:1988: BeamDeprecationWarning: options is deprecated since First stable release. References to <pipeline>.options will not be supported
    self.table_reference.projectId = pcoll.pipeline.options.view_as(

apache_beam/examples/cookbook/bigquery_tornadoes_it_test.py: 1 warning
apache_beam/io/gcp/bigquery_file_loads_test.py: 3 warnings
apache_beam/io/gcp/bigquery_write_it_test.py: 3 warnings
apache_beam/io/gcp/bigquery_test.py: 3 warnings
apache_beam/io/gcp/big_query_query_to_table_it_test.py: 4 warnings
  <https://ci-beam.apache.org/job/beam_PostCommit_Python37/ws/src/sdks/python/apache_beam/io/gcp/bigquery_file_loads.py>:1166: BeamDeprecationWarning: options is deprecated since First stable release. References to <pipeline>.options will not be supported
    self.project = self.project or p.options.view_as(GoogleCloudOptions).project

apache_beam/examples/cookbook/bigquery_tornadoes_it_test.py: 1 warning
apache_beam/examples/complete/game/hourly_team_score_it_test.py: 1 warning
apache_beam/io/gcp/bigquery_file_loads_test.py: 3 warnings
apache_beam/io/gcp/bigquery_write_it_test.py: 3 warnings
apache_beam/io/gcp/bigquery_test.py: 3 warnings
apache_beam/io/gcp/big_query_query_to_table_it_test.py: 4 warnings
  <https://ci-beam.apache.org/job/beam_PostCommit_Python37/ws/src/sdks/python/apache_beam/io/gcp/bigquery_file_loads.py>:1173: BeamDeprecationWarning: options is deprecated since First stable release. References to <pipeline>.options will not be supported
    temp_location = p.options.view_as(GoogleCloudOptions).temp_location

apache_beam/examples/cookbook/bigquery_tornadoes_it_test.py: 1 warning
apache_beam/examples/complete/game/hourly_team_score_it_test.py: 1 warning
apache_beam/io/gcp/bigquery_file_loads_test.py: 3 warnings
apache_beam/io/gcp/bigquery_write_it_test.py: 3 warnings
apache_beam/io/gcp/bigquery_test.py: 3 warnings
apache_beam/io/gcp/big_query_query_to_table_it_test.py: 4 warnings
  <https://ci-beam.apache.org/job/beam_PostCommit_Python37/ws/src/sdks/python/apache_beam/io/gcp/bigquery_file_loads.py>:1175: BeamDeprecationWarning: options is deprecated since First stable release. References to <pipeline>.options will not be supported
    p.options.view_as(GoogleCloudOptions).job_name or 'AUTOMATIC_JOB_NAME')

apache_beam/examples/cookbook/bigquery_tornadoes_it_test.py::BigqueryTornadoesIT::test_bigquery_tornadoes_it
  <https://ci-beam.apache.org/job/beam_PostCommit_Python37/ws/src/sdks/python/apache_beam/io/gcp/tests/utils.py>:100: PendingDeprecationWarning: Client.dataset is deprecated and will be removed in a future version. Use a string like 'my_project.my_dataset' or a cloud.google.bigquery.DatasetReference object, instead.
    table_ref = client.dataset(dataset_id).table(table_id)

apache_beam/examples/dataframe/flight_delays_it_test.py::FlightDelaysTest::test_flight_delays
  <https://ci-beam.apache.org/job/beam_PostCommit_Python37/ws/src/sdks/python/apache_beam/examples/dataframe/flight_delays.py>:47: FutureWarning: Dropping of nuisance columns in DataFrame reductions (with 'numeric_only=None') is deprecated; in a future version this will raise TypeError.  Select only valid columns before calling the reduction.
    return airline_df[at_top_airports].mean()

apache_beam/examples/dataframe/flight_delays_it_test.py::FlightDelaysTest::test_flight_delays
apache_beam/examples/dataframe/taxiride_it_test.py::TaxirideIT::test_aggregation
apache_beam/examples/dataframe/taxiride_it_test.py::TaxirideIT::test_enrich
  <https://ci-beam.apache.org/job/beam_PostCommit_Python37/ws/src/sdks/python/apache_beam/dataframe/io.py>:664: FutureWarning: WriteToFiles is experimental.
    sink=lambda _: _WriteToPandasFileSink(

apache_beam/examples/dataframe/flight_delays_it_test.py::FlightDelaysTest::test_flight_delays
apache_beam/examples/dataframe/taxiride_it_test.py::TaxirideIT::test_aggregation
apache_beam/examples/dataframe/taxiride_it_test.py::TaxirideIT::test_enrich
  <https://ci-beam.apache.org/job/beam_PostCommit_Python37/ws/src/sdks/python/apache_beam/io/fileio.py>:591: BeamDeprecationWarning: options is deprecated since First stable release. References to <pipeline>.options will not be supported
    p.options.view_as(GoogleCloudOptions).temp_location or

apache_beam/io/gcp/bigquery_test.py::BigQueryStreamingInsertTransformIntegrationTests::test_multiple_destinations_transform
  <https://ci-beam.apache.org/job/beam_PostCommit_Python37/ws/src/sdks/python/apache_beam/io/gcp/bigquery_test.py>:1690: BeamDeprecationWarning: options is deprecated since First stable release. References to <pipeline>.options will not be supported
    streaming = self.test_pipeline.options.view_as(StandardOptions).streaming

apache_beam/io/gcp/bigquery_read_it_test.py::ReadTests::test_native_source
  <https://ci-beam.apache.org/job/beam_PostCommit_Python37/ws/src/sdks/python/apache_beam/io/gcp/bigquery_read_it_test.py>:170: BeamDeprecationWarning: BigQuerySource is deprecated since 2.25.0. Use ReadFromBigQuery instead.
    beam.io.BigQuerySource(query=self.query, use_standard_sql=True)))

apache_beam/ml/gcp/cloud_dlp_it_test.py::CloudDLPIT::test_deidentification
  <https://ci-beam.apache.org/job/beam_PostCommit_Python37/ws/src/sdks/python/apache_beam/ml/gcp/cloud_dlp_it_test.py>:77: FutureWarning: MaskDetectedDetails is experimental.
    inspection_config=INSPECT_CONFIG))

apache_beam/ml/inference/sklearn_inference_it_test.py::SklearnInference::test_sklearn_regression
  <https://ci-beam.apache.org/job/beam_PostCommit_Python37/ws/src/sdks/python/apache_beam/examples/inference/sklearn_japanese_housing_regression.py>:129: FutureWarning: SklearnModelHandlerPandas is experimental. No backwards-compatibility guarantees.
    model_file_type=ModelFileType.PICKLE, model_uri=model_filename)

apache_beam/ml/inference/sklearn_inference_it_test.py::SklearnInference::test_sklearn_regression
  <https://ci-beam.apache.org/job/beam_PostCommit_Python37/ws/src/build/gradleenv/-1734967052/lib/python3.7/site-packages/dill/_dill.py>:472: FutureWarning: SklearnModelHandlerPandas is experimental. No backwards-compatibility guarantees.
    obj = StockUnpickler.load(self)

apache_beam/ml/gcp/cloud_dlp_it_test.py::CloudDLPIT::test_inspection
  <https://ci-beam.apache.org/job/beam_PostCommit_Python37/ws/src/sdks/python/apache_beam/ml/gcp/cloud_dlp_it_test.py>:87: FutureWarning: InspectForDetails is experimental.
    | beam.ParDo(extract_inspection_results).with_outputs(

apache_beam/io/gcp/bigquery_read_it_test.py::ReadNewTypesTests::test_native_source
  <https://ci-beam.apache.org/job/beam_PostCommit_Python37/ws/src/sdks/python/apache_beam/io/gcp/bigquery_read_it_test.py>:693: BeamDeprecationWarning: BigQuerySource is deprecated since 2.25.0. Use ReadFromBigQuery instead.
    beam.io.BigQuerySource(query=self.query, use_standard_sql=True)))

apache_beam/io/gcp/bigquery_read_it_test.py::ReadAllBQTests::test_read_queries
  <https://ci-beam.apache.org/job/beam_PostCommit_Python37/ws/src/sdks/python/apache_beam/io/gcp/bigquery_read_it_test.py>:808: FutureWarning: ReadAllFromBigQuery is experimental.
    | beam.io.ReadAllFromBigQuery())

apache_beam/io/gcp/bigquery_read_it_test.py::ReadAllBQTests::test_read_queries
  <https://ci-beam.apache.org/job/beam_PostCommit_Python37/ws/src/sdks/python/apache_beam/io/gcp/bigquery.py>:2658: BeamDeprecationWarning: options is deprecated since First stable release. References to <pipeline>.options will not be supported
    job_name = pcoll.pipeline.options.view_as(GoogleCloudOptions).job_name

apache_beam/io/gcp/bigquery_read_it_test.py::ReadAllBQTests::test_read_queries
  <https://ci-beam.apache.org/job/beam_PostCommit_Python37/ws/src/sdks/python/apache_beam/io/gcp/bigquery.py>:2659: BeamDeprecationWarning: options is deprecated since First stable release. References to <pipeline>.options will not be supported
    project = pcoll.pipeline.options.view_as(GoogleCloudOptions).project

apache_beam/io/gcp/bigquery_read_it_test.py::ReadAllBQTests::test_read_queries
  <https://ci-beam.apache.org/job/beam_PostCommit_Python37/ws/src/sdks/python/apache_beam/io/gcp/bigquery.py>:2672: BeamDeprecationWarning: options is deprecated since First stable release. References to <pipeline>.options will not be supported
    options=pcoll.pipeline.options,

-- Docs: https://docs.pytest.org/en/stable/how-to/capture-warnings.html
- generated xml file: <https://ci-beam.apache.org/job/beam_PostCommit_Python37/ws/src/sdks/python/pytest_postCommitIT-df-py37.xml> -
========== 85 passed, 24 skipped, 225 warnings in 11615.21s (3:13:35) ==========

> Task :sdks:python:test-suites:dataflow:py37:spannerioIT
>>> RUNNING integration tests with pipeline options: --runner=TestDataflowRunner --project=apache-beam-testing --region=us-central1 --staging_location=gs://temp-storage-for-end-to-end-tests/staging-it --temp_location=gs://temp-storage-for-end-to-end-tests/temp-it --output=gs://temp-storage-for-end-to-end-tests/py-it-cloud/output --sdk_location=<https://ci-beam.apache.org/job/beam_PostCommit_Python37/ws/src/sdks/python/build/apache-beam.tar.gz> --requirements_file=postcommit_requirements.txt --num_workers=1 --sleep_secs=20 --kms_key_name=projects/apache-beam-testing/locations/global/keyRings/beam-it/cryptoKeys/test --dataflow_kms_key=projects/apache-beam-testing/locations/global/keyRings/beam-it/cryptoKeys/test
>>>   pytest options: --capture=no --timeout=4500 --color=yes --log-cli-level=INFO --numprocesses=8 --dist=loadfile
>>>   collect markers: -m=spannerio_it
============================= test session starts ==============================
platform linux -- Python 3.7.12, pytest-7.2.1, pluggy-1.0.0
rootdir: <https://ci-beam.apache.org/job/beam_PostCommit_Python37/ws/src/sdks/python,> configfile: pytest.ini
plugins: xdist-2.5.0, timeout-2.1.0, forked-1.4.0, hypothesis-6.68.1, requests-mock-1.10.0
timeout: 4500.0s
timeout method: signal
timeout func_only: False
gw0 I / gw1 I / gw2 I / gw3 I / gw4 I / gw5 I / gw6 I / gw7 I
[gw0] Python 3.7.12 (default, Jan 15 2022, 18:42:10)  -- [GCC 9.3.0]
[gw1] Python 3.7.12 (default, Jan 15 2022, 18:42:10)  -- [GCC 9.3.0]
[gw2] Python 3.7.12 (default, Jan 15 2022, 18:42:10)  -- [GCC 9.3.0]
[gw3] Python 3.7.12 (default, Jan 15 2022, 18:42:10)  -- [GCC 9.3.0]
[gw4] Python 3.7.12 (default, Jan 15 2022, 18:42:10)  -- [GCC 9.3.0]
[gw5] Python 3.7.12 (default, Jan 15 2022, 18:42:10)  -- [GCC 9.3.0]
[gw6] Python 3.7.12 (default, Jan 15 2022, 18:42:10)  -- [GCC 9.3.0]
[gw7] Python 3.7.12 (default, Jan 15 2022, 18:42:10)  -- [GCC 9.3.0]
gw0 [15] / gw1 [15] / gw2 [15] / gw3 [15] / gw4 [15] / gw5 [15] / gw6 [15] / gw7 [15]

scheduling tests via LoadFileScheduling

apache_beam/io/gcp/experimental/spannerio_write_it_test.py::SpannerWriteIntegrationTest::test_metrics_error_call 
apache_beam/io/gcp/experimental/spannerio_read_it_test.py::SpannerReadIntegrationTest::test_read_via_sql 
[gw1] SKIPPED apache_beam/io/gcp/experimental/spannerio_write_it_test.py::SpannerWriteIntegrationTest::test_metrics_error_call 
apache_beam/io/gcp/experimental/spannerio_write_it_test.py::SpannerWriteIntegrationTest::test_metrics_ok_call 
[gw1] SKIPPED apache_beam/io/gcp/experimental/spannerio_write_it_test.py::SpannerWriteIntegrationTest::test_metrics_ok_call 
apache_beam/io/gcp/experimental/spannerio_write_it_test.py::SpannerWriteIntegrationTest::test_spanner_error 
[gw1] PASSED apache_beam/io/gcp/experimental/spannerio_write_it_test.py::SpannerWriteIntegrationTest::test_spanner_error 
apache_beam/io/gcp/experimental/spannerio_write_it_test.py::SpannerWriteIntegrationTest::test_spanner_update 
[gw0] PASSED apache_beam/io/gcp/experimental/spannerio_read_it_test.py::SpannerReadIntegrationTest::test_read_via_sql 
apache_beam/io/gcp/experimental/spannerio_read_it_test.py::SpannerReadIntegrationTest::test_read_via_table 
[gw1] PASSED apache_beam/io/gcp/experimental/spannerio_write_it_test.py::SpannerWriteIntegrationTest::test_spanner_update 
apache_beam/io/gcp/experimental/spannerio_write_it_test.py::SpannerWriteIntegrationTest::test_write_batches 
[gw0] PASSED apache_beam/io/gcp/experimental/spannerio_read_it_test.py::SpannerReadIntegrationTest::test_read_via_table 
apache_beam/io/gcp/experimental/spannerio_read_it_test.py::SpannerReadIntegrationTest::test_sql_metrics_error_call 
[gw0] SKIPPED apache_beam/io/gcp/experimental/spannerio_read_it_test.py::SpannerReadIntegrationTest::test_sql_metrics_error_call 
apache_beam/io/gcp/experimental/spannerio_read_it_test.py::SpannerReadIntegrationTest::test_sql_metrics_ok_call 
[gw0] SKIPPED apache_beam/io/gcp/experimental/spannerio_read_it_test.py::SpannerReadIntegrationTest::test_sql_metrics_ok_call 
apache_beam/io/gcp/experimental/spannerio_read_it_test.py::SpannerReadIntegrationTest::test_table_metrics_error_call 
[gw0] SKIPPED apache_beam/io/gcp/experimental/spannerio_read_it_test.py::SpannerReadIntegrationTest::test_table_metrics_error_call 
apache_beam/io/gcp/experimental/spannerio_read_it_test.py::SpannerReadIntegrationTest::test_table_metrics_ok_call 
[gw0] SKIPPED apache_beam/io/gcp/experimental/spannerio_read_it_test.py::SpannerReadIntegrationTest::test_table_metrics_ok_call 
apache_beam/io/gcp/experimental/spannerio_read_it_test.py::SpannerReadIntegrationTest::test_transaction_sql_metrics_error_call 
[gw0] SKIPPED apache_beam/io/gcp/experimental/spannerio_read_it_test.py::SpannerReadIntegrationTest::test_transaction_sql_metrics_error_call 
apache_beam/io/gcp/experimental/spannerio_read_it_test.py::SpannerReadIntegrationTest::test_transaction_sql_metrics_ok_call 
[gw0] SKIPPED apache_beam/io/gcp/experimental/spannerio_read_it_test.py::SpannerReadIntegrationTest::test_transaction_sql_metrics_ok_call 
apache_beam/io/gcp/experimental/spannerio_read_it_test.py::SpannerReadIntegrationTest::test_transaction_table_metrics_error_call 
[gw0] SKIPPED apache_beam/io/gcp/experimental/spannerio_read_it_test.py::SpannerReadIntegrationTest::test_transaction_table_metrics_error_call 
apache_beam/io/gcp/experimental/spannerio_read_it_test.py::SpannerReadIntegrationTest::test_transaction_table_metrics_ok_call 
[gw0] SKIPPED apache_beam/io/gcp/experimental/spannerio_read_it_test.py::SpannerReadIntegrationTest::test_transaction_table_metrics_ok_call 
[gw1] PASSED apache_beam/io/gcp/experimental/spannerio_write_it_test.py::SpannerWriteIntegrationTest::test_write_batches 

=============================== warnings summary ===============================
../../build/gradleenv/-1734967052/lib/python3.7/site-packages/hdfs/config.py:15
../../build/gradleenv/-1734967052/lib/python3.7/site-packages/hdfs/config.py:15
../../build/gradleenv/-1734967052/lib/python3.7/site-packages/hdfs/config.py:15
../../build/gradleenv/-1734967052/lib/python3.7/site-packages/hdfs/config.py:15
../../build/gradleenv/-1734967052/lib/python3.7/site-packages/hdfs/config.py:15
../../build/gradleenv/-1734967052/lib/python3.7/site-packages/hdfs/config.py:15
../../build/gradleenv/-1734967052/lib/python3.7/site-packages/hdfs/config.py:15
../../build/gradleenv/-1734967052/lib/python3.7/site-packages/hdfs/config.py:15
../../build/gradleenv/-1734967052/lib/python3.7/site-packages/hdfs/config.py:15
  <https://ci-beam.apache.org/job/beam_PostCommit_Python37/ws/src/build/gradleenv/-1734967052/lib/python3.7/site-packages/hdfs/config.py>:15: DeprecationWarning: the imp module is deprecated in favour of importlib; see the module's documentation for alternative uses
    from imp import load_source

apache_beam/io/gcp/experimental/spannerio_write_it_test.py::SpannerWriteIntegrationTest::test_spanner_error
  <https://ci-beam.apache.org/job/beam_PostCommit_Python37/ws/src/sdks/python/apache_beam/io/gcp/experimental/spannerio_write_it_test.py>:190: FutureWarning: WriteToSpanner is experimental. No backwards-compatibility guarantees.
    database_id=self.TEST_DATABASE))

apache_beam/io/gcp/experimental/spannerio_read_it_test.py::SpannerReadIntegrationTest::test_read_via_sql
  <https://ci-beam.apache.org/job/beam_PostCommit_Python37/ws/src/sdks/python/apache_beam/io/gcp/experimental/spannerio_read_it_test.py>:128: FutureWarning: ReadFromSpanner is experimental. No backwards-compatibility guarantees.
    sql="select * from Users")

apache_beam/io/gcp/experimental/spannerio_write_it_test.py::SpannerWriteIntegrationTest::test_spanner_update
  <https://ci-beam.apache.org/job/beam_PostCommit_Python37/ws/src/sdks/python/apache_beam/io/gcp/experimental/spannerio_write_it_test.py>:171: FutureWarning: WriteToSpanner is experimental. No backwards-compatibility guarantees.
    database_id=self.TEST_DATABASE))

apache_beam/io/gcp/experimental/spannerio_read_it_test.py::SpannerReadIntegrationTest::test_read_via_table
  <https://ci-beam.apache.org/job/beam_PostCommit_Python37/ws/src/sdks/python/apache_beam/io/gcp/experimental/spannerio_read_it_test.py>:117: FutureWarning: ReadFromSpanner is experimental. No backwards-compatibility guarantees.
    columns=["UserId", "Key"])

apache_beam/io/gcp/experimental/spannerio_write_it_test.py::SpannerWriteIntegrationTest::test_write_batches
  <https://ci-beam.apache.org/job/beam_PostCommit_Python37/ws/src/sdks/python/apache_beam/io/gcp/experimental/spannerio_write_it_test.py>:135: FutureWarning: WriteToSpanner is experimental. No backwards-compatibility guarantees.
    max_batch_size_bytes=250))

-- Docs: https://docs.pytest.org/en/stable/how-to/capture-warnings.html
- generated xml file: <https://ci-beam.apache.org/job/beam_PostCommit_Python37/ws/src/sdks/python/pytest_postCommitIT-df-py37.xml> -
=========== 5 passed, 17 skipped, 14 warnings in 1570.70s (0:26:10) ============

FAILURE: Build completed with 2 failures.

1: Task failed with an exception.
-----------
* Where:
Script '<https://ci-beam.apache.org/job/beam_PostCommit_Python37/ws/src/sdks/python/test-suites/direct/common.gradle'> line: 194

* What went wrong:
Execution failed for task ':sdks:python:test-suites:direct:py37:azureIntegrationTest'.
> Process 'command 'sh'' finished with non-zero exit value 1

* Try:
> Run with --stacktrace option to get the stack trace.
> Run with --info or --debug option to get more log output.
==============================================================================

2: Task failed with an exception.
-----------
* Where:
Script '<https://ci-beam.apache.org/job/beam_PostCommit_Python37/ws/src/sdks/python/test-suites/direct/common.gradle'> line: 185

* What went wrong:
Execution failed for task ':sdks:python:test-suites:direct:py37:hdfsIntegrationTest'.
> Process 'command 'sh'' finished with non-zero exit value 1

* Try:
> Run with --stacktrace option to get the stack trace.
> Run with --info or --debug option to get more log output.
==============================================================================

* Get more help at https://help.gradle.org

Deprecated Gradle features were used in this build, making it incompatible with Gradle 8.0.

You can use '--warning-mode all' to show the individual deprecation warnings and determine if they come from your own scripts or plugins.

See https://docs.gradle.org/7.5.1/userguide/command_line_interface.html#sec:command_line_warnings

Execution optimizations have been disabled for 1 invalid unit(s) of work during this build to ensure correctness.
Please consult deprecation warnings for more details.

BUILD FAILED in 3h 42m 2s
212 actionable tasks: 148 executed, 58 from cache, 6 up-to-date

Publishing build scan...
https://gradle.com/s/ghn6dehfdorwm

Build step 'Invoke Gradle script' changed build result to FAILURE
Build step 'Invoke Gradle script' marked build as failure

---------------------------------------------------------------------
To unsubscribe, e-mail: builds-unsubscribe@beam.apache.org
For additional commands, e-mail: builds-help@beam.apache.org