You are viewing a plain text version of this content. The canonical link for it is here.
Posted to notifications@commons.apache.org by Apache Jenkins Server <je...@builds.apache.org> on 2025/08/10 12:19:44 UTC
Build failed in Jenkins: Commons » commons-compress-windows » Windows,jdk_1.8_latest #244
See <https://ci-builds.apache.org/job/Commons/job/commons-compress-windows/OS=Windows,jdk=jdk_1.8_latest/244/display/redirect?page=changes>
Changes:
[Gary D. Gregory] Refactor for reuse
[Gary D. Gregory] Add org.apache.commons.compress.archivers.tar.TarArchiveInputStreamTest.testGetNextTarEntry()
[Gary D. Gregory] Sort members
[Gary D. Gregory] Add assertions to
------------------------------------------
[...truncated 68.50 KiB...]
at java.util.stream.ForEachOps$ForEachOp$OfRef.accept(ForEachOps.java:183)
at java.util.ArrayList.forEach(ArrayList.java:1259)
at java.util.stream.SortedOps$RefSortingSink.end(SortedOps.java:395)
at java.util.stream.Sink$ChainedReference.end(Sink.java:258)
at java.util.stream.Sink$ChainedReference.end(Sink.java:258)
at java.util.stream.AbstractPipeline.copyInto(AbstractPipeline.java:483)
at java.util.stream.AbstractPipeline.wrapAndCopyInto(AbstractPipeline.java:472)
at java.util.stream.ForEachOps$ForEachOp.evaluateSequential(ForEachOps.java:150)
at java.util.stream.ForEachOps$ForEachOp$OfRef.evaluateSequential(ForEachOps.java:173)
at java.util.stream.AbstractPipeline.evaluate(AbstractPipeline.java:234)
at java.util.stream.ReferencePipeline.forEach(ReferencePipeline.java:485)
... 2 more
Suppressed: java.nio.file.DirectoryNotEmptyException: C:\Users\jenkins\AppData\Local\Temp\junit-3235359956059637603
at sun.nio.fs.WindowsFileSystemProvider.implDelete(WindowsFileSystemProvider.java:266)
at sun.nio.fs.AbstractFileSystemProvider.delete(AbstractFileSystemProvider.java:103)
at java.nio.file.Files.delete(Files.java:1126)
at java.nio.file.Files.walkFileTree(Files.java:2688)
at java.nio.file.Files.walkFileTree(Files.java:2742)
... 13 more
[ERROR] org.apache.commons.compress.harmony.pack200.PackingOptionsTest.testPassFiles -- Time elapsed: 0.502 s <<< ERROR!
org.junit.platform.commons.JUnitException: Failed to close extension context
at java.util.ArrayList.forEach(ArrayList.java:1259)
at java.util.ArrayList.forEach(ArrayList.java:1259)
Caused by: java.io.IOException: Failed to delete temp directory C:\Users\jenkins\AppData\Local\Temp\junit-6348404345921672297. The following paths could not be deleted (see suppressed exceptions for details): <root>
at java.util.stream.ForEachOps$ForEachOp$OfRef.accept(ForEachOps.java:183)
at java.util.ArrayList.forEach(ArrayList.java:1259)
at java.util.stream.SortedOps$RefSortingSink.end(SortedOps.java:395)
at java.util.stream.Sink$ChainedReference.end(Sink.java:258)
at java.util.stream.Sink$ChainedReference.end(Sink.java:258)
at java.util.stream.AbstractPipeline.copyInto(AbstractPipeline.java:483)
at java.util.stream.AbstractPipeline.wrapAndCopyInto(AbstractPipeline.java:472)
at java.util.stream.ForEachOps$ForEachOp.evaluateSequential(ForEachOps.java:150)
at java.util.stream.ForEachOps$ForEachOp$OfRef.evaluateSequential(ForEachOps.java:173)
at java.util.stream.AbstractPipeline.evaluate(AbstractPipeline.java:234)
at java.util.stream.ReferencePipeline.forEach(ReferencePipeline.java:485)
... 2 more
Suppressed: java.nio.file.DirectoryNotEmptyException: C:\Users\jenkins\AppData\Local\Temp\junit-6348404345921672297
at sun.nio.fs.WindowsFileSystemProvider.implDelete(WindowsFileSystemProvider.java:266)
at sun.nio.fs.AbstractFileSystemProvider.delete(AbstractFileSystemProvider.java:103)
at java.nio.file.Files.delete(Files.java:1126)
at java.nio.file.Files.walkFileTree(Files.java:2688)
at java.nio.file.Files.walkFileTree(Files.java:2742)
... 13 more
[ERROR] org.apache.commons.compress.harmony.pack200.PackingOptionsTest.testKeepFileOrder -- Time elapsed: 0.477 s <<< ERROR!
org.junit.platform.commons.JUnitException: Failed to close extension context
at java.util.ArrayList.forEach(ArrayList.java:1259)
at java.util.ArrayList.forEach(ArrayList.java:1259)
Caused by: java.io.IOException: Failed to delete temp directory C:\Users\jenkins\AppData\Local\Temp\junit-3745650632587368683. The following paths could not be deleted (see suppressed exceptions for details): <root>
at java.util.stream.ForEachOps$ForEachOp$OfRef.accept(ForEachOps.java:183)
at java.util.ArrayList.forEach(ArrayList.java:1259)
at java.util.stream.SortedOps$RefSortingSink.end(SortedOps.java:395)
at java.util.stream.Sink$ChainedReference.end(Sink.java:258)
at java.util.stream.Sink$ChainedReference.end(Sink.java:258)
at java.util.stream.AbstractPipeline.copyInto(AbstractPipeline.java:483)
at java.util.stream.AbstractPipeline.wrapAndCopyInto(AbstractPipeline.java:472)
at java.util.stream.ForEachOps$ForEachOp.evaluateSequential(ForEachOps.java:150)
at java.util.stream.ForEachOps$ForEachOp$OfRef.evaluateSequential(ForEachOps.java:173)
at java.util.stream.AbstractPipeline.evaluate(AbstractPipeline.java:234)
at java.util.stream.ReferencePipeline.forEach(ReferencePipeline.java:485)
... 2 more
Suppressed: java.nio.file.DirectoryNotEmptyException: C:\Users\jenkins\AppData\Local\Temp\junit-3745650632587368683
at sun.nio.fs.WindowsFileSystemProvider.implDelete(WindowsFileSystemProvider.java:266)
at sun.nio.fs.AbstractFileSystemProvider.delete(AbstractFileSystemProvider.java:103)
at java.nio.file.Files.delete(Files.java:1126)
at java.nio.file.Files.walkFileTree(Files.java:2688)
at java.nio.file.Files.walkFileTree(Files.java:2742)
... 13 more
[ERROR] org.apache.commons.compress.harmony.pack200.PackingOptionsTest.testModificationTime -- Time elapsed: 0.338 s <<< ERROR!
org.junit.platform.commons.JUnitException: Failed to close extension context
at java.util.ArrayList.forEach(ArrayList.java:1259)
at java.util.ArrayList.forEach(ArrayList.java:1259)
Caused by: java.io.IOException: Failed to delete temp directory C:\Users\jenkins\AppData\Local\Temp\junit-2846023190920916284. The following paths could not be deleted (see suppressed exceptions for details): <root>
at java.util.stream.ForEachOps$ForEachOp$OfRef.accept(ForEachOps.java:183)
at java.util.ArrayList.forEach(ArrayList.java:1259)
at java.util.stream.SortedOps$RefSortingSink.end(SortedOps.java:395)
at java.util.stream.Sink$ChainedReference.end(Sink.java:258)
at java.util.stream.Sink$ChainedReference.end(Sink.java:258)
at java.util.stream.AbstractPipeline.copyInto(AbstractPipeline.java:483)
at java.util.stream.AbstractPipeline.wrapAndCopyInto(AbstractPipeline.java:472)
at java.util.stream.ForEachOps$ForEachOp.evaluateSequential(ForEachOps.java:150)
at java.util.stream.ForEachOps$ForEachOp$OfRef.evaluateSequential(ForEachOps.java:173)
at java.util.stream.AbstractPipeline.evaluate(AbstractPipeline.java:234)
at java.util.stream.ReferencePipeline.forEach(ReferencePipeline.java:485)
... 2 more
Suppressed: java.nio.file.DirectoryNotEmptyException: C:\Users\jenkins\AppData\Local\Temp\junit-2846023190920916284
at sun.nio.fs.WindowsFileSystemProvider.implDelete(WindowsFileSystemProvider.java:266)
at sun.nio.fs.AbstractFileSystemProvider.delete(AbstractFileSystemProvider.java:103)
at java.nio.file.Files.delete(Files.java:1126)
at java.nio.file.Files.walkFileTree(Files.java:2688)
at java.nio.file.Files.walkFileTree(Files.java:2742)
... 13 more
[ERROR] org.apache.commons.compress.harmony.pack200.PackingOptionsTest.testStripDebug -- Time elapsed: 0.297 s <<< ERROR!
org.junit.platform.commons.JUnitException: Failed to close extension context
at java.util.ArrayList.forEach(ArrayList.java:1259)
at java.util.ArrayList.forEach(ArrayList.java:1259)
Caused by: java.io.IOException: Failed to delete temp directory C:\Users\jenkins\AppData\Local\Temp\junit-6421429006456330984. The following paths could not be deleted (see suppressed exceptions for details): <root>
at java.util.stream.ForEachOps$ForEachOp$OfRef.accept(ForEachOps.java:183)
at java.util.ArrayList.forEach(ArrayList.java:1259)
at java.util.stream.SortedOps$RefSortingSink.end(SortedOps.java:395)
at java.util.stream.Sink$ChainedReference.end(Sink.java:258)
at java.util.stream.Sink$ChainedReference.end(Sink.java:258)
at java.util.stream.AbstractPipeline.copyInto(AbstractPipeline.java:483)
at java.util.stream.AbstractPipeline.wrapAndCopyInto(AbstractPipeline.java:472)
at java.util.stream.ForEachOps$ForEachOp.evaluateSequential(ForEachOps.java:150)
at java.util.stream.ForEachOps$ForEachOp$OfRef.evaluateSequential(ForEachOps.java:173)
at java.util.stream.AbstractPipeline.evaluate(AbstractPipeline.java:234)
at java.util.stream.ReferencePipeline.forEach(ReferencePipeline.java:485)
... 2 more
Suppressed: java.nio.file.DirectoryNotEmptyException: C:\Users\jenkins\AppData\Local\Temp\junit-6421429006456330984
at sun.nio.fs.WindowsFileSystemProvider.implDelete(WindowsFileSystemProvider.java:266)
at sun.nio.fs.AbstractFileSystemProvider.delete(AbstractFileSystemProvider.java:103)
at java.nio.file.Files.delete(Files.java:1126)
at java.nio.file.Files.walkFileTree(Files.java:2688)
at java.nio.file.Files.walkFileTree(Files.java:2742)
... 13 more
[INFO] Running org.apache.commons.compress.harmony.pack200.PopulationCodecTest
[INFO] Tests run: 11, Failures: 0, Errors: 0, Skipped: 0, Time elapsed: 0.013 s -- in org.apache.commons.compress.harmony.pack200.PopulationCodecTest
[INFO] Running org.apache.commons.compress.harmony.pack200.RunCodecTest
[WARNING] Tests run: 12, Failures: 0, Errors: 0, Skipped: 2, Time elapsed: 0.014 s -- in org.apache.commons.compress.harmony.pack200.RunCodecTest
[INFO] Running org.apache.commons.compress.harmony.unpack200.ArchiveTest
[INFO] Tests run: 31, Failures: 0, Errors: 0, Skipped: 0, Time elapsed: 1.724 s -- in org.apache.commons.compress.harmony.unpack200.ArchiveTest
[INFO] Running org.apache.commons.compress.harmony.unpack200.AttributeLayoutMapTest
[INFO] Tests run: 1, Failures: 0, Errors: 0, Skipped: 0, Time elapsed: 0.001 s -- in org.apache.commons.compress.harmony.unpack200.AttributeLayoutMapTest
[INFO] Running org.apache.commons.compress.harmony.unpack200.AttributeLayoutTest
[INFO] Tests run: 18, Failures: 0, Errors: 0, Skipped: 0, Time elapsed: 0.015 s -- in org.apache.commons.compress.harmony.unpack200.AttributeLayoutTest
[INFO] Running org.apache.commons.compress.harmony.unpack200.BandSetTest
[WARNING] Tests run: 6, Failures: 0, Errors: 0, Skipped: 5, Time elapsed: 0.002 s -- in org.apache.commons.compress.harmony.unpack200.BandSetTest
[INFO] Running org.apache.commons.compress.harmony.unpack200.BcBandsTest
[WARNING] Tests run: 25, Failures: 0, Errors: 0, Skipped: 4, Time elapsed: 0.040 s -- in org.apache.commons.compress.harmony.unpack200.BcBandsTest
[INFO] Running org.apache.commons.compress.harmony.unpack200.bytecode.ByteCodeTest
[INFO] Tests run: 3, Failures: 0, Errors: 0, Skipped: 0, Time elapsed: 0.005 s -- in org.apache.commons.compress.harmony.unpack200.bytecode.ByteCodeTest
[INFO] Running org.apache.commons.compress.harmony.unpack200.bytecode.ClassFileEntryTest
[INFO] Tests run: 8, Failures: 0, Errors: 0, Skipped: 0, Time elapsed: 0.005 s -- in org.apache.commons.compress.harmony.unpack200.bytecode.ClassFileEntryTest
[INFO] Running org.apache.commons.compress.harmony.unpack200.bytecode.ConstantPoolTest
[INFO] Tests run: 4, Failures: 0, Errors: 0, Skipped: 0, Time elapsed: 0.005 s -- in org.apache.commons.compress.harmony.unpack200.bytecode.ConstantPoolTest
[INFO] Running org.apache.commons.compress.harmony.unpack200.ClassBandsTest
[INFO] Tests run: 2, Failures: 0, Errors: 0, Skipped: 0, Time elapsed: 0.010 s -- in org.apache.commons.compress.harmony.unpack200.ClassBandsTest
[INFO] Running org.apache.commons.compress.harmony.unpack200.CodeAttributeTest
[INFO] Tests run: 3, Failures: 0, Errors: 0, Skipped: 0, Time elapsed: 0.003 s -- in org.apache.commons.compress.harmony.unpack200.CodeAttributeTest
[INFO] Running org.apache.commons.compress.harmony.unpack200.Codec_decodeInts_OutOfMemoryErrorTest
[WARNING] Tests run: 1, Failures: 0, Errors: 0, Skipped: 1, Time elapsed: 0 s -- in org.apache.commons.compress.harmony.unpack200.Codec_decodeInts_OutOfMemoryErrorTest
[INFO] Running org.apache.commons.compress.harmony.unpack200.CPUTF8Test
[INFO] Tests run: 1, Failures: 0, Errors: 0, Skipped: 0, Time elapsed: 0 s -- in org.apache.commons.compress.harmony.unpack200.CPUTF8Test
[INFO] Running org.apache.commons.compress.harmony.unpack200.ICTupleTest
[INFO] Tests run: 7, Failures: 0, Errors: 0, Skipped: 0, Time elapsed: 0.009 s -- in org.apache.commons.compress.harmony.unpack200.ICTupleTest
[INFO] Running org.apache.commons.compress.harmony.unpack200.NewAttributeBandsTest
[INFO] Tests run: 44, Failures: 0, Errors: 0, Skipped: 0, Time elapsed: 0.040 s -- in org.apache.commons.compress.harmony.unpack200.NewAttributeBandsTest
[INFO] Running org.apache.commons.compress.harmony.unpack200.SegmentConstantPoolArrayCacheTest
[INFO] Tests run: 3, Failures: 0, Errors: 0, Skipped: 0, Time elapsed: 0.001 s -- in org.apache.commons.compress.harmony.unpack200.SegmentConstantPoolArrayCacheTest
[INFO] Running org.apache.commons.compress.harmony.unpack200.SegmentConstantPoolTest
[INFO] Tests run: 3, Failures: 0, Errors: 0, Skipped: 0, Time elapsed: 0.001 s -- in org.apache.commons.compress.harmony.unpack200.SegmentConstantPoolTest
[INFO] Running org.apache.commons.compress.harmony.unpack200.SegmentOptionsTest
[INFO] Tests run: 20, Failures: 0, Errors: 0, Skipped: 0, Time elapsed: 0.014 s -- in org.apache.commons.compress.harmony.unpack200.SegmentOptionsTest
[INFO] Running org.apache.commons.compress.harmony.unpack200.SegmentTest
[INFO] Tests run: 21, Failures: 0, Errors: 0, Skipped: 0, Time elapsed: 0.114 s -- in org.apache.commons.compress.harmony.unpack200.SegmentTest
[INFO] Running org.apache.commons.compress.harmony.unpack200.SegmentUtilsTest
[INFO] Tests run: 18, Failures: 0, Errors: 0, Skipped: 0, Time elapsed: 0.015 s -- in org.apache.commons.compress.harmony.unpack200.SegmentUtilsTest
[INFO] Running org.apache.commons.compress.IOMethodsTest
[INFO] Tests run: 10, Failures: 0, Errors: 0, Skipped: 0, Time elapsed: 0.064 s -- in org.apache.commons.compress.IOMethodsTest
[INFO] Running org.apache.commons.compress.java.util.jar.Pack200Test
[INFO] Tests run: 2, Failures: 0, Errors: 0, Skipped: 0, Time elapsed: 0.001 s -- in org.apache.commons.compress.java.util.jar.Pack200Test
[INFO] Running org.apache.commons.compress.MemoryLimitExceptionTest
[INFO] Tests run: 4, Failures: 0, Errors: 0, Skipped: 0, Time elapsed: 0.002 s -- in org.apache.commons.compress.MemoryLimitExceptionTest
[INFO] Running org.apache.commons.compress.utils.BitInputStreamTest
[INFO] Tests run: 21, Failures: 0, Errors: 0, Skipped: 0, Time elapsed: 0.009 s -- in org.apache.commons.compress.utils.BitInputStreamTest
[INFO] Running org.apache.commons.compress.utils.BoundedSeekableByteChannelInputStreamTest
[INFO] Tests run: 1, Failures: 0, Errors: 0, Skipped: 0, Time elapsed: 0 s -- in org.apache.commons.compress.utils.BoundedSeekableByteChannelInputStreamTest
[INFO] Running org.apache.commons.compress.utils.ByteUtilsTest
[INFO] Tests run: 26, Failures: 0, Errors: 0, Skipped: 0, Time elapsed: 0.012 s -- in org.apache.commons.compress.utils.ByteUtilsTest
[INFO] Running org.apache.commons.compress.utils.CharsetNamesTest
[INFO] Tests run: 1, Failures: 0, Errors: 0, Skipped: 0, Time elapsed: 0.001 s -- in org.apache.commons.compress.utils.CharsetNamesTest
[INFO] Running org.apache.commons.compress.utils.CharsetsTest
[INFO] Tests run: 1, Failures: 0, Errors: 0, Skipped: 0, Time elapsed: 0.002 s -- in org.apache.commons.compress.utils.CharsetsTest
[INFO] Running org.apache.commons.compress.utils.ChecksumCalculatingInputStreamTest
[INFO] Tests run: 11, Failures: 0, Errors: 0, Skipped: 0, Time elapsed: 0.005 s -- in org.apache.commons.compress.utils.ChecksumCalculatingInputStreamTest
[INFO] Running org.apache.commons.compress.utils.ChecksumVerifyingInputStreamTest
[INFO] Tests run: 3, Failures: 0, Errors: 0, Skipped: 0, Time elapsed: 0.002 s -- in org.apache.commons.compress.utils.ChecksumVerifyingInputStreamTest
[INFO] Running org.apache.commons.compress.utils.CountingStreamTest
[INFO] Tests run: 2, Failures: 0, Errors: 0, Skipped: 0, Time elapsed: 0.003 s -- in org.apache.commons.compress.utils.CountingStreamTest
[INFO] Running org.apache.commons.compress.utils.ExactMathTest
[INFO] Tests run: 1, Failures: 0, Errors: 0, Skipped: 0, Time elapsed: 0.001 s -- in org.apache.commons.compress.utils.ExactMathTest
[INFO] Running org.apache.commons.compress.utils.FileNameUtilsTest
[INFO] Tests run: 8, Failures: 0, Errors: 0, Skipped: 0, Time elapsed: 0.020 s -- in org.apache.commons.compress.utils.FileNameUtilsTest
[INFO] Running org.apache.commons.compress.utils.FixedLengthBlockOutputStreamTest
[INFO] Tests run: 9, Failures: 0, Errors: 0, Skipped: 0, Time elapsed: 0.121 s -- in org.apache.commons.compress.utils.FixedLengthBlockOutputStreamTest
[INFO] Running org.apache.commons.compress.utils.IOUtilsTest
[INFO] Tests run: 19, Failures: 0, Errors: 0, Skipped: 0, Time elapsed: 0.046 s -- in org.apache.commons.compress.utils.IOUtilsTest
[INFO] Running org.apache.commons.compress.utils.MultiReadOnlySeekableByteChannelTest
[WARNING] Tests run: 19, Failures: 0, Errors: 0, Skipped: 1, Time elapsed: 0.109 s -- in org.apache.commons.compress.utils.MultiReadOnlySeekableByteChannelTest
[INFO] Running org.apache.commons.compress.utils.OsgiUtilsTest
[INFO] Tests run: 1, Failures: 0, Errors: 0, Skipped: 0, Time elapsed: 0.001 s -- in org.apache.commons.compress.utils.OsgiUtilsTest
[INFO] Running org.apache.commons.compress.utils.ParsingUtilsTest
[INFO] Tests run: 22, Failures: 0, Errors: 0, Skipped: 0, Time elapsed: 0.020 s -- in org.apache.commons.compress.utils.ParsingUtilsTest
[INFO] Running org.apache.commons.compress.utils.SeekableInMemoryByteChannelTest
[WARNING] Tests run: 27, Failures: 0, Errors: 0, Skipped: 3, Time elapsed: 0.022 s -- in org.apache.commons.compress.utils.SeekableInMemoryByteChannelTest
[INFO] Running org.apache.commons.compress.utils.ServiceLoaderIteratorTest
[INFO] Tests run: 3, Failures: 0, Errors: 0, Skipped: 0, Time elapsed: 0.003 s -- in org.apache.commons.compress.utils.ServiceLoaderIteratorTest
[INFO] Running org.apache.commons.compress.utils.SetsTest
[INFO] Tests run: 1, Failures: 0, Errors: 0, Skipped: 0, Time elapsed: 0.001 s -- in org.apache.commons.compress.utils.SetsTest
[INFO] Running org.apache.commons.compress.utils.SkipShieldingInputStreamTest
[INFO] Tests run: 3, Failures: 0, Errors: 0, Skipped: 0, Time elapsed: 0.002 s -- in org.apache.commons.compress.utils.SkipShieldingInputStreamTest
[INFO] Running org.apache.commons.compress.utils.TimeUtilsTest
[INFO] Tests run: 101, Failures: 0, Errors: 0, Skipped: 0, Time elapsed: 0.072 s -- in org.apache.commons.compress.utils.TimeUtilsTest
[INFO] Running org.apache.commons.compress.utils.ZipSplitReadOnlySeekableByteChannelTest
[INFO] Tests run: 15, Failures: 0, Errors: 0, Skipped: 0, Time elapsed: 0.013 s -- in org.apache.commons.compress.utils.ZipSplitReadOnlySeekableByteChannelTest
[INFO]
[INFO] Results:
[INFO]
[ERROR] Errors:
[ERROR] ZipSplitOutputStreamTest.testThrowsIfUnsplittableSizeLargerThanSplitSize » JUnit Failed to close extension context
[ERROR] ArchiveTest.testAnnotations » JUnit Failed to close extension context
[ERROR] ArchiveTest.testAnnotations2 » JUnit Failed to close extension context
[ERROR] ArchiveTest.testHelloWorld » JUnit Failed to close extension context
[ERROR] ArchiveTest.testJNDI » JUnit Failed to close extension context
[ERROR] ArchiveTest.testLargeClass » JUnit Failed to close extension context
[ERROR] ArchiveTest.testSQL » JUnit Failed to close extension context
[ERROR] PackingOptionsTest.testKeepFileOrder » JUnit Failed to close extension context
[ERROR] PackingOptionsTest.testModificationTime » JUnit Failed to close extension context
[ERROR] PackingOptionsTest.testNewAttributes » JUnit Failed to close extension context
[ERROR] PackingOptionsTest.testNewAttributes2 » JUnit Failed to close extension context
[ERROR] PackingOptionsTest.testPassAttributes » JUnit Failed to close extension context
[ERROR] PackingOptionsTest.testPassFiles » JUnit Failed to close extension context
[ERROR] PackingOptionsTest.testStripDebug » JUnit Failed to close extension context
[INFO]
[ERROR] Tests run: 4150, Failures: 0, Errors: 14, Skipped: 34
[INFO]
[INFO] ------------------------------------------------------------------------
[INFO] BUILD FAILURE
[INFO] ------------------------------------------------------------------------
[INFO] Total time: 04:04 min
[INFO] Finished at: 2025-08-10T12:19:42Z
[INFO] ------------------------------------------------------------------------
[ERROR] Failed to execute goal org.apache.maven.plugins:maven-surefire-plugin:3.5.3:test (default-test) on project commons-compress:
[ERROR]
[ERROR] See <https://ci-builds.apache.org/job/Commons/job/commons-compress-windows/OS=Windows,jdk=jdk_1.8_latest/ws/target\surefire-reports> for the individual test results.
[ERROR] See dump files (if any exist) [date].dump, [date]-jvmRun[N].dump and [date].dumpstream.
[ERROR] -> [Help 1]
[ERROR]
[ERROR] To see the full stack trace of the errors, re-run Maven with the -e switch.
[ERROR] Re-run Maven using the -X switch to enable full debug logging.
[ERROR]
[ERROR] For more information about the errors and possible solutions, please read the following articles:
[ERROR] [Help 1] http://cwiki.apache.org/confluence/display/MAVEN/MojoFailureException
Build step 'Invoke top-level Maven targets' marked build as failure