You are viewing a plain text version of this content. The canonical link for it is here.
Posted to dev@lucene.apache.org by Apache Jenkins Server <je...@builds.apache.org> on 2018/02/05 18:34:03 UTC

[JENKINS] Lucene-Solr-Tests-master - Build # 2298 - Still unstable

Build: https://builds.apache.org/job/Lucene-Solr-Tests-master/2298/

8 tests failed.
FAILED:  junit.framework.TestSuite.org.apache.solr.ltr.store.rest.TestModelManagerPersistence

Error Message:
1 thread leaked from SUITE scope at org.apache.solr.ltr.store.rest.TestModelManagerPersistence:     1) Thread[id=159, name=qtp2034504500-159, state=TIMED_WAITING, group=TGRP-TestModelManagerPersistence]         at sun.misc.Unsafe.park(Native Method)         at java.util.concurrent.locks.LockSupport.parkNanos(LockSupport.java:215)         at java.util.concurrent.locks.AbstractQueuedSynchronizer$ConditionObject.await(AbstractQueuedSynchronizer.java:2163)         at org.eclipse.jetty.util.thread.ReservedThreadExecutor$ReservedThread.reservedWait(ReservedThreadExecutor.java:308)         at org.eclipse.jetty.util.thread.ReservedThreadExecutor$ReservedThread.run(ReservedThreadExecutor.java:373)         at org.eclipse.jetty.util.thread.QueuedThreadPool.runJob(QueuedThreadPool.java:708)         at org.eclipse.jetty.util.thread.QueuedThreadPool$2.run(QueuedThreadPool.java:626)         at java.lang.Thread.run(Thread.java:748)

Stack Trace:
com.carrotsearch.randomizedtesting.ThreadLeakError: 1 thread leaked from SUITE scope at org.apache.solr.ltr.store.rest.TestModelManagerPersistence: 
   1) Thread[id=159, name=qtp2034504500-159, state=TIMED_WAITING, group=TGRP-TestModelManagerPersistence]
        at sun.misc.Unsafe.park(Native Method)
        at java.util.concurrent.locks.LockSupport.parkNanos(LockSupport.java:215)
        at java.util.concurrent.locks.AbstractQueuedSynchronizer$ConditionObject.await(AbstractQueuedSynchronizer.java:2163)
        at org.eclipse.jetty.util.thread.ReservedThreadExecutor$ReservedThread.reservedWait(ReservedThreadExecutor.java:308)
        at org.eclipse.jetty.util.thread.ReservedThreadExecutor$ReservedThread.run(ReservedThreadExecutor.java:373)
        at org.eclipse.jetty.util.thread.QueuedThreadPool.runJob(QueuedThreadPool.java:708)
        at org.eclipse.jetty.util.thread.QueuedThreadPool$2.run(QueuedThreadPool.java:626)
        at java.lang.Thread.run(Thread.java:748)
	at __randomizedtesting.SeedInfo.seed([8E983D4F108CA92A]:0)


FAILED:  junit.framework.TestSuite.org.apache.solr.ltr.store.rest.TestModelManagerPersistence

Error Message:
There are still zombie threads that couldn't be terminated:    1) Thread[id=159, name=qtp2034504500-159, state=TIMED_WAITING, group=TGRP-TestModelManagerPersistence]         at sun.misc.Unsafe.park(Native Method)         at java.util.concurrent.locks.LockSupport.parkNanos(LockSupport.java:215)         at java.util.concurrent.locks.AbstractQueuedSynchronizer$ConditionObject.await(AbstractQueuedSynchronizer.java:2163)         at org.eclipse.jetty.util.thread.ReservedThreadExecutor$ReservedThread.reservedWait(ReservedThreadExecutor.java:308)         at org.eclipse.jetty.util.thread.ReservedThreadExecutor$ReservedThread.run(ReservedThreadExecutor.java:373)         at org.eclipse.jetty.util.thread.QueuedThreadPool.runJob(QueuedThreadPool.java:708)         at org.eclipse.jetty.util.thread.QueuedThreadPool$2.run(QueuedThreadPool.java:626)         at java.lang.Thread.run(Thread.java:748)

Stack Trace:
com.carrotsearch.randomizedtesting.ThreadLeakError: There are still zombie threads that couldn't be terminated:
   1) Thread[id=159, name=qtp2034504500-159, state=TIMED_WAITING, group=TGRP-TestModelManagerPersistence]
        at sun.misc.Unsafe.park(Native Method)
        at java.util.concurrent.locks.LockSupport.parkNanos(LockSupport.java:215)
        at java.util.concurrent.locks.AbstractQueuedSynchronizer$ConditionObject.await(AbstractQueuedSynchronizer.java:2163)
        at org.eclipse.jetty.util.thread.ReservedThreadExecutor$ReservedThread.reservedWait(ReservedThreadExecutor.java:308)
        at org.eclipse.jetty.util.thread.ReservedThreadExecutor$ReservedThread.run(ReservedThreadExecutor.java:373)
        at org.eclipse.jetty.util.thread.QueuedThreadPool.runJob(QueuedThreadPool.java:708)
        at org.eclipse.jetty.util.thread.QueuedThreadPool$2.run(QueuedThreadPool.java:626)
        at java.lang.Thread.run(Thread.java:748)
	at __randomizedtesting.SeedInfo.seed([8E983D4F108CA92A]:0)


FAILED:  org.apache.solr.cloud.TestUtilizeNode.test

Error Message:
no replica should be present in  127.0.0.1:34344_solr

Stack Trace:
java.lang.AssertionError: no replica should be present in  127.0.0.1:34344_solr
	at __randomizedtesting.SeedInfo.seed([7D757E90F8BE0D14:F521414A564260EC]:0)
	at org.junit.Assert.fail(Assert.java:93)
	at org.junit.Assert.assertTrue(Assert.java:43)
	at org.apache.solr.cloud.TestUtilizeNode.test(TestUtilizeNode.java:99)
	at sun.reflect.NativeMethodAccessorImpl.invoke0(Native Method)
	at sun.reflect.NativeMethodAccessorImpl.invoke(NativeMethodAccessorImpl.java:62)
	at sun.reflect.DelegatingMethodAccessorImpl.invoke(DelegatingMethodAccessorImpl.java:43)
	at java.lang.reflect.Method.invoke(Method.java:498)
	at com.carrotsearch.randomizedtesting.RandomizedRunner.invoke(RandomizedRunner.java:1737)
	at com.carrotsearch.randomizedtesting.RandomizedRunner$8.evaluate(RandomizedRunner.java:934)
	at com.carrotsearch.randomizedtesting.RandomizedRunner$9.evaluate(RandomizedRunner.java:970)
	at com.carrotsearch.randomizedtesting.RandomizedRunner$10.evaluate(RandomizedRunner.java:984)
	at com.carrotsearch.randomizedtesting.rules.SystemPropertiesRestoreRule$1.evaluate(SystemPropertiesRestoreRule.java:57)
	at org.apache.lucene.util.TestRuleSetupTeardownChained$1.evaluate(TestRuleSetupTeardownChained.java:49)
	at org.apache.lucene.util.AbstractBeforeAfterRule$1.evaluate(AbstractBeforeAfterRule.java:45)
	at org.apache.lucene.util.TestRuleThreadAndTestName$1.evaluate(TestRuleThreadAndTestName.java:48)
	at org.apache.lucene.util.TestRuleIgnoreAfterMaxFailures$1.evaluate(TestRuleIgnoreAfterMaxFailures.java:64)
	at org.apache.lucene.util.TestRuleMarkFailure$1.evaluate(TestRuleMarkFailure.java:47)
	at com.carrotsearch.randomizedtesting.rules.StatementAdapter.evaluate(StatementAdapter.java:36)
	at com.carrotsearch.randomizedtesting.ThreadLeakControl$StatementRunner.run(ThreadLeakControl.java:368)
	at com.carrotsearch.randomizedtesting.ThreadLeakControl.forkTimeoutingTask(ThreadLeakControl.java:817)
	at com.carrotsearch.randomizedtesting.ThreadLeakControl$3.evaluate(ThreadLeakControl.java:468)
	at com.carrotsearch.randomizedtesting.RandomizedRunner.runSingleTest(RandomizedRunner.java:943)
	at com.carrotsearch.randomizedtesting.RandomizedRunner$5.evaluate(RandomizedRunner.java:829)
	at com.carrotsearch.randomizedtesting.RandomizedRunner$6.evaluate(RandomizedRunner.java:879)
	at com.carrotsearch.randomizedtesting.RandomizedRunner$7.evaluate(RandomizedRunner.java:890)
	at com.carrotsearch.randomizedtesting.rules.StatementAdapter.evaluate(StatementAdapter.java:36)
	at com.carrotsearch.randomizedtesting.rules.SystemPropertiesRestoreRule$1.evaluate(SystemPropertiesRestoreRule.java:57)
	at org.apache.lucene.util.AbstractBeforeAfterRule$1.evaluate(AbstractBeforeAfterRule.java:45)
	at com.carrotsearch.randomizedtesting.rules.StatementAdapter.evaluate(StatementAdapter.java:36)
	at org.apache.lucene.util.TestRuleStoreClassName$1.evaluate(TestRuleStoreClassName.java:41)
	at com.carrotsearch.randomizedtesting.rules.NoShadowingOrOverridesOnMethodsRule$1.evaluate(NoShadowingOrOverridesOnMethodsRule.java:40)
	at com.carrotsearch.randomizedtesting.rules.NoShadowingOrOverridesOnMethodsRule$1.evaluate(NoShadowingOrOverridesOnMethodsRule.java:40)
	at com.carrotsearch.randomizedtesting.rules.StatementAdapter.evaluate(StatementAdapter.java:36)
	at com.carrotsearch.randomizedtesting.rules.StatementAdapter.evaluate(StatementAdapter.java:36)
	at com.carrotsearch.randomizedtesting.rules.StatementAdapter.evaluate(StatementAdapter.java:36)
	at org.apache.lucene.util.TestRuleAssertionsRequired$1.evaluate(TestRuleAssertionsRequired.java:53)
	at org.apache.lucene.util.TestRuleMarkFailure$1.evaluate(TestRuleMarkFailure.java:47)
	at org.apache.lucene.util.TestRuleIgnoreAfterMaxFailures$1.evaluate(TestRuleIgnoreAfterMaxFailures.java:64)
	at org.apache.lucene.util.TestRuleIgnoreTestSuites$1.evaluate(TestRuleIgnoreTestSuites.java:54)
	at com.carrotsearch.randomizedtesting.rules.StatementAdapter.evaluate(StatementAdapter.java:36)
	at com.carrotsearch.randomizedtesting.ThreadLeakControl$StatementRunner.run(ThreadLeakControl.java:368)
	at java.lang.Thread.run(Thread.java:748)


FAILED:  org.apache.solr.cloud.api.collections.ShardSplitTest.testSplitAfterFailedSplit

Error Message:
expected:<1> but was:<2>

Stack Trace:
java.lang.AssertionError: expected:<1> but was:<2>
	at __randomizedtesting.SeedInfo.seed([7D757E90F8BE0D14:8438ED3FC4CB409E]:0)
	at org.junit.Assert.fail(Assert.java:93)
	at org.junit.Assert.failNotEquals(Assert.java:647)
	at org.junit.Assert.assertEquals(Assert.java:128)
	at org.junit.Assert.assertEquals(Assert.java:472)
	at org.junit.Assert.assertEquals(Assert.java:456)
	at org.apache.solr.cloud.api.collections.ShardSplitTest.testSplitAfterFailedSplit(ShardSplitTest.java:282)
	at sun.reflect.NativeMethodAccessorImpl.invoke0(Native Method)
	at sun.reflect.NativeMethodAccessorImpl.invoke(NativeMethodAccessorImpl.java:62)
	at sun.reflect.DelegatingMethodAccessorImpl.invoke(DelegatingMethodAccessorImpl.java:43)
	at java.lang.reflect.Method.invoke(Method.java:498)
	at com.carrotsearch.randomizedtesting.RandomizedRunner.invoke(RandomizedRunner.java:1737)
	at com.carrotsearch.randomizedtesting.RandomizedRunner$8.evaluate(RandomizedRunner.java:934)
	at com.carrotsearch.randomizedtesting.RandomizedRunner$9.evaluate(RandomizedRunner.java:970)
	at com.carrotsearch.randomizedtesting.RandomizedRunner$10.evaluate(RandomizedRunner.java:984)
	at org.apache.solr.BaseDistributedSearchTestCase$ShardsRepeatRule$ShardsFixedStatement.callStatement(BaseDistributedSearchTestCase.java:993)
	at org.apache.solr.BaseDistributedSearchTestCase$ShardsRepeatRule$ShardsStatement.evaluate(BaseDistributedSearchTestCase.java:968)
	at com.carrotsearch.randomizedtesting.rules.SystemPropertiesRestoreRule$1.evaluate(SystemPropertiesRestoreRule.java:57)
	at org.apache.lucene.util.TestRuleSetupTeardownChained$1.evaluate(TestRuleSetupTeardownChained.java:49)
	at org.apache.lucene.util.AbstractBeforeAfterRule$1.evaluate(AbstractBeforeAfterRule.java:45)
	at org.apache.lucene.util.TestRuleThreadAndTestName$1.evaluate(TestRuleThreadAndTestName.java:48)
	at org.apache.lucene.util.TestRuleIgnoreAfterMaxFailures$1.evaluate(TestRuleIgnoreAfterMaxFailures.java:64)
	at org.apache.lucene.util.TestRuleMarkFailure$1.evaluate(TestRuleMarkFailure.java:47)
	at com.carrotsearch.randomizedtesting.rules.StatementAdapter.evaluate(StatementAdapter.java:36)
	at com.carrotsearch.randomizedtesting.ThreadLeakControl$StatementRunner.run(ThreadLeakControl.java:368)
	at com.carrotsearch.randomizedtesting.ThreadLeakControl.forkTimeoutingTask(ThreadLeakControl.java:817)
	at com.carrotsearch.randomizedtesting.ThreadLeakControl$3.evaluate(ThreadLeakControl.java:468)
	at com.carrotsearch.randomizedtesting.RandomizedRunner.runSingleTest(RandomizedRunner.java:943)
	at com.carrotsearch.randomizedtesting.RandomizedRunner$5.evaluate(RandomizedRunner.java:829)
	at com.carrotsearch.randomizedtesting.RandomizedRunner$6.evaluate(RandomizedRunner.java:879)
	at com.carrotsearch.randomizedtesting.RandomizedRunner$7.evaluate(RandomizedRunner.java:890)
	at com.carrotsearch.randomizedtesting.rules.StatementAdapter.evaluate(StatementAdapter.java:36)
	at com.carrotsearch.randomizedtesting.rules.SystemPropertiesRestoreRule$1.evaluate(SystemPropertiesRestoreRule.java:57)
	at org.apache.lucene.util.AbstractBeforeAfterRule$1.evaluate(AbstractBeforeAfterRule.java:45)
	at com.carrotsearch.randomizedtesting.rules.StatementAdapter.evaluate(StatementAdapter.java:36)
	at org.apache.lucene.util.TestRuleStoreClassName$1.evaluate(TestRuleStoreClassName.java:41)
	at com.carrotsearch.randomizedtesting.rules.NoShadowingOrOverridesOnMethodsRule$1.evaluate(NoShadowingOrOverridesOnMethodsRule.java:40)
	at com.carrotsearch.randomizedtesting.rules.NoShadowingOrOverridesOnMethodsRule$1.evaluate(NoShadowingOrOverridesOnMethodsRule.java:40)
	at com.carrotsearch.randomizedtesting.rules.StatementAdapter.evaluate(StatementAdapter.java:36)
	at com.carrotsearch.randomizedtesting.rules.StatementAdapter.evaluate(StatementAdapter.java:36)
	at com.carrotsearch.randomizedtesting.rules.StatementAdapter.evaluate(StatementAdapter.java:36)
	at org.apache.lucene.util.TestRuleAssertionsRequired$1.evaluate(TestRuleAssertionsRequired.java:53)
	at org.apache.lucene.util.TestRuleMarkFailure$1.evaluate(TestRuleMarkFailure.java:47)
	at org.apache.lucene.util.TestRuleIgnoreAfterMaxFailures$1.evaluate(TestRuleIgnoreAfterMaxFailures.java:64)
	at org.apache.lucene.util.TestRuleIgnoreTestSuites$1.evaluate(TestRuleIgnoreTestSuites.java:54)
	at com.carrotsearch.randomizedtesting.rules.StatementAdapter.evaluate(StatementAdapter.java:36)
	at com.carrotsearch.randomizedtesting.ThreadLeakControl$StatementRunner.run(ThreadLeakControl.java:368)
	at java.lang.Thread.run(Thread.java:748)


FAILED:  org.apache.solr.cloud.autoscaling.sim.TestLargeCluster.testSearchRate

Error Message:
The trigger did not fire at all

Stack Trace:
java.lang.AssertionError: The trigger did not fire at all
	at __randomizedtesting.SeedInfo.seed([7D757E90F8BE0D14:203D60193778AB5B]:0)
	at org.junit.Assert.fail(Assert.java:93)
	at org.junit.Assert.assertTrue(Assert.java:43)
	at org.apache.solr.cloud.autoscaling.sim.TestLargeCluster.testSearchRate(TestLargeCluster.java:547)
	at sun.reflect.NativeMethodAccessorImpl.invoke0(Native Method)
	at sun.reflect.NativeMethodAccessorImpl.invoke(NativeMethodAccessorImpl.java:62)
	at sun.reflect.DelegatingMethodAccessorImpl.invoke(DelegatingMethodAccessorImpl.java:43)
	at java.lang.reflect.Method.invoke(Method.java:498)
	at com.carrotsearch.randomizedtesting.RandomizedRunner.invoke(RandomizedRunner.java:1737)
	at com.carrotsearch.randomizedtesting.RandomizedRunner$8.evaluate(RandomizedRunner.java:934)
	at com.carrotsearch.randomizedtesting.RandomizedRunner$9.evaluate(RandomizedRunner.java:970)
	at com.carrotsearch.randomizedtesting.RandomizedRunner$10.evaluate(RandomizedRunner.java:984)
	at com.carrotsearch.randomizedtesting.rules.SystemPropertiesRestoreRule$1.evaluate(SystemPropertiesRestoreRule.java:57)
	at org.apache.lucene.util.TestRuleSetupTeardownChained$1.evaluate(TestRuleSetupTeardownChained.java:49)
	at org.apache.lucene.util.AbstractBeforeAfterRule$1.evaluate(AbstractBeforeAfterRule.java:45)
	at org.apache.lucene.util.TestRuleThreadAndTestName$1.evaluate(TestRuleThreadAndTestName.java:48)
	at org.apache.lucene.util.TestRuleIgnoreAfterMaxFailures$1.evaluate(TestRuleIgnoreAfterMaxFailures.java:64)
	at org.apache.lucene.util.TestRuleMarkFailure$1.evaluate(TestRuleMarkFailure.java:47)
	at com.carrotsearch.randomizedtesting.rules.StatementAdapter.evaluate(StatementAdapter.java:36)
	at com.carrotsearch.randomizedtesting.ThreadLeakControl$StatementRunner.run(ThreadLeakControl.java:368)
	at com.carrotsearch.randomizedtesting.ThreadLeakControl.forkTimeoutingTask(ThreadLeakControl.java:817)
	at com.carrotsearch.randomizedtesting.ThreadLeakControl$3.evaluate(ThreadLeakControl.java:468)
	at com.carrotsearch.randomizedtesting.RandomizedRunner.runSingleTest(RandomizedRunner.java:943)
	at com.carrotsearch.randomizedtesting.RandomizedRunner$5.evaluate(RandomizedRunner.java:829)
	at com.carrotsearch.randomizedtesting.RandomizedRunner$6.evaluate(RandomizedRunner.java:879)
	at com.carrotsearch.randomizedtesting.RandomizedRunner$7.evaluate(RandomizedRunner.java:890)
	at com.carrotsearch.randomizedtesting.rules.StatementAdapter.evaluate(StatementAdapter.java:36)
	at com.carrotsearch.randomizedtesting.rules.SystemPropertiesRestoreRule$1.evaluate(SystemPropertiesRestoreRule.java:57)
	at org.apache.lucene.util.AbstractBeforeAfterRule$1.evaluate(AbstractBeforeAfterRule.java:45)
	at com.carrotsearch.randomizedtesting.rules.StatementAdapter.evaluate(StatementAdapter.java:36)
	at org.apache.lucene.util.TestRuleStoreClassName$1.evaluate(TestRuleStoreClassName.java:41)
	at com.carrotsearch.randomizedtesting.rules.NoShadowingOrOverridesOnMethodsRule$1.evaluate(NoShadowingOrOverridesOnMethodsRule.java:40)
	at com.carrotsearch.randomizedtesting.rules.NoShadowingOrOverridesOnMethodsRule$1.evaluate(NoShadowingOrOverridesOnMethodsRule.java:40)
	at com.carrotsearch.randomizedtesting.rules.StatementAdapter.evaluate(StatementAdapter.java:36)
	at com.carrotsearch.randomizedtesting.rules.StatementAdapter.evaluate(StatementAdapter.java:36)
	at com.carrotsearch.randomizedtesting.rules.StatementAdapter.evaluate(StatementAdapter.java:36)
	at org.apache.lucene.util.TestRuleAssertionsRequired$1.evaluate(TestRuleAssertionsRequired.java:53)
	at org.apache.lucene.util.TestRuleMarkFailure$1.evaluate(TestRuleMarkFailure.java:47)
	at org.apache.lucene.util.TestRuleIgnoreAfterMaxFailures$1.evaluate(TestRuleIgnoreAfterMaxFailures.java:64)
	at org.apache.lucene.util.TestRuleIgnoreTestSuites$1.evaluate(TestRuleIgnoreTestSuites.java:54)
	at com.carrotsearch.randomizedtesting.rules.StatementAdapter.evaluate(StatementAdapter.java:36)
	at com.carrotsearch.randomizedtesting.ThreadLeakControl$StatementRunner.run(ThreadLeakControl.java:368)
	at java.lang.Thread.run(Thread.java:748)


FAILED:  org.apache.solr.cloud.autoscaling.sim.TestTriggerIntegration.testSearchRate

Error Message:
The trigger did not fire at all

Stack Trace:
java.lang.AssertionError: The trigger did not fire at all
	at __randomizedtesting.SeedInfo.seed([7D757E90F8BE0D14:203D60193778AB5B]:0)
	at org.junit.Assert.fail(Assert.java:93)
	at org.junit.Assert.assertTrue(Assert.java:43)
	at org.apache.solr.cloud.autoscaling.sim.TestTriggerIntegration.testSearchRate(TestTriggerIntegration.java:1178)
	at sun.reflect.NativeMethodAccessorImpl.invoke0(Native Method)
	at sun.reflect.NativeMethodAccessorImpl.invoke(NativeMethodAccessorImpl.java:62)
	at sun.reflect.DelegatingMethodAccessorImpl.invoke(DelegatingMethodAccessorImpl.java:43)
	at java.lang.reflect.Method.invoke(Method.java:498)
	at com.carrotsearch.randomizedtesting.RandomizedRunner.invoke(RandomizedRunner.java:1737)
	at com.carrotsearch.randomizedtesting.RandomizedRunner$8.evaluate(RandomizedRunner.java:934)
	at com.carrotsearch.randomizedtesting.RandomizedRunner$9.evaluate(RandomizedRunner.java:970)
	at com.carrotsearch.randomizedtesting.RandomizedRunner$10.evaluate(RandomizedRunner.java:984)
	at com.carrotsearch.randomizedtesting.rules.SystemPropertiesRestoreRule$1.evaluate(SystemPropertiesRestoreRule.java:57)
	at org.apache.lucene.util.TestRuleSetupTeardownChained$1.evaluate(TestRuleSetupTeardownChained.java:49)
	at org.apache.lucene.util.AbstractBeforeAfterRule$1.evaluate(AbstractBeforeAfterRule.java:45)
	at org.apache.lucene.util.TestRuleThreadAndTestName$1.evaluate(TestRuleThreadAndTestName.java:48)
	at org.apache.lucene.util.TestRuleIgnoreAfterMaxFailures$1.evaluate(TestRuleIgnoreAfterMaxFailures.java:64)
	at org.apache.lucene.util.TestRuleMarkFailure$1.evaluate(TestRuleMarkFailure.java:47)
	at com.carrotsearch.randomizedtesting.rules.StatementAdapter.evaluate(StatementAdapter.java:36)
	at com.carrotsearch.randomizedtesting.ThreadLeakControl$StatementRunner.run(ThreadLeakControl.java:368)
	at com.carrotsearch.randomizedtesting.ThreadLeakControl.forkTimeoutingTask(ThreadLeakControl.java:817)
	at com.carrotsearch.randomizedtesting.ThreadLeakControl$3.evaluate(ThreadLeakControl.java:468)
	at com.carrotsearch.randomizedtesting.RandomizedRunner.runSingleTest(RandomizedRunner.java:943)
	at com.carrotsearch.randomizedtesting.RandomizedRunner$5.evaluate(RandomizedRunner.java:829)
	at com.carrotsearch.randomizedtesting.RandomizedRunner$6.evaluate(RandomizedRunner.java:879)
	at com.carrotsearch.randomizedtesting.RandomizedRunner$7.evaluate(RandomizedRunner.java:890)
	at com.carrotsearch.randomizedtesting.rules.StatementAdapter.evaluate(StatementAdapter.java:36)
	at com.carrotsearch.randomizedtesting.rules.SystemPropertiesRestoreRule$1.evaluate(SystemPropertiesRestoreRule.java:57)
	at org.apache.lucene.util.AbstractBeforeAfterRule$1.evaluate(AbstractBeforeAfterRule.java:45)
	at com.carrotsearch.randomizedtesting.rules.StatementAdapter.evaluate(StatementAdapter.java:36)
	at org.apache.lucene.util.TestRuleStoreClassName$1.evaluate(TestRuleStoreClassName.java:41)
	at com.carrotsearch.randomizedtesting.rules.NoShadowingOrOverridesOnMethodsRule$1.evaluate(NoShadowingOrOverridesOnMethodsRule.java:40)
	at com.carrotsearch.randomizedtesting.rules.NoShadowingOrOverridesOnMethodsRule$1.evaluate(NoShadowingOrOverridesOnMethodsRule.java:40)
	at com.carrotsearch.randomizedtesting.rules.StatementAdapter.evaluate(StatementAdapter.java:36)
	at com.carrotsearch.randomizedtesting.rules.StatementAdapter.evaluate(StatementAdapter.java:36)
	at com.carrotsearch.randomizedtesting.rules.StatementAdapter.evaluate(StatementAdapter.java:36)
	at org.apache.lucene.util.TestRuleAssertionsRequired$1.evaluate(TestRuleAssertionsRequired.java:53)
	at org.apache.lucene.util.TestRuleMarkFailure$1.evaluate(TestRuleMarkFailure.java:47)
	at org.apache.lucene.util.TestRuleIgnoreAfterMaxFailures$1.evaluate(TestRuleIgnoreAfterMaxFailures.java:64)
	at org.apache.lucene.util.TestRuleIgnoreTestSuites$1.evaluate(TestRuleIgnoreTestSuites.java:54)
	at com.carrotsearch.randomizedtesting.rules.StatementAdapter.evaluate(StatementAdapter.java:36)
	at com.carrotsearch.randomizedtesting.ThreadLeakControl$StatementRunner.run(ThreadLeakControl.java:368)
	at java.lang.Thread.run(Thread.java:748)


FAILED:  org.apache.solr.cloud.autoscaling.sim.TestTriggerIntegration.testNodeMarkersRegistration

Error Message:
Path /autoscaling/nodeAdded/127.0.0.1:10006_solr should have been deleted

Stack Trace:
java.lang.AssertionError: Path /autoscaling/nodeAdded/127.0.0.1:10006_solr should have been deleted
	at __randomizedtesting.SeedInfo.seed([7D757E90F8BE0D14:65CFF69CF68BC0FB]:0)
	at org.junit.Assert.fail(Assert.java:93)
	at org.junit.Assert.assertTrue(Assert.java:43)
	at org.junit.Assert.assertFalse(Assert.java:68)
	at org.apache.solr.cloud.autoscaling.sim.TestTriggerIntegration.testNodeMarkersRegistration(TestTriggerIntegration.java:844)
	at sun.reflect.NativeMethodAccessorImpl.invoke0(Native Method)
	at sun.reflect.NativeMethodAccessorImpl.invoke(NativeMethodAccessorImpl.java:62)
	at sun.reflect.DelegatingMethodAccessorImpl.invoke(DelegatingMethodAccessorImpl.java:43)
	at java.lang.reflect.Method.invoke(Method.java:498)
	at com.carrotsearch.randomizedtesting.RandomizedRunner.invoke(RandomizedRunner.java:1737)
	at com.carrotsearch.randomizedtesting.RandomizedRunner$8.evaluate(RandomizedRunner.java:934)
	at com.carrotsearch.randomizedtesting.RandomizedRunner$9.evaluate(RandomizedRunner.java:970)
	at com.carrotsearch.randomizedtesting.RandomizedRunner$10.evaluate(RandomizedRunner.java:984)
	at com.carrotsearch.randomizedtesting.rules.SystemPropertiesRestoreRule$1.evaluate(SystemPropertiesRestoreRule.java:57)
	at org.apache.lucene.util.TestRuleSetupTeardownChained$1.evaluate(TestRuleSetupTeardownChained.java:49)
	at org.apache.lucene.util.AbstractBeforeAfterRule$1.evaluate(AbstractBeforeAfterRule.java:45)
	at org.apache.lucene.util.TestRuleThreadAndTestName$1.evaluate(TestRuleThreadAndTestName.java:48)
	at org.apache.lucene.util.TestRuleIgnoreAfterMaxFailures$1.evaluate(TestRuleIgnoreAfterMaxFailures.java:64)
	at org.apache.lucene.util.TestRuleMarkFailure$1.evaluate(TestRuleMarkFailure.java:47)
	at com.carrotsearch.randomizedtesting.rules.StatementAdapter.evaluate(StatementAdapter.java:36)
	at com.carrotsearch.randomizedtesting.ThreadLeakControl$StatementRunner.run(ThreadLeakControl.java:368)
	at com.carrotsearch.randomizedtesting.ThreadLeakControl.forkTimeoutingTask(ThreadLeakControl.java:817)
	at com.carrotsearch.randomizedtesting.ThreadLeakControl$3.evaluate(ThreadLeakControl.java:468)
	at com.carrotsearch.randomizedtesting.RandomizedRunner.runSingleTest(RandomizedRunner.java:943)
	at com.carrotsearch.randomizedtesting.RandomizedRunner$5.evaluate(RandomizedRunner.java:829)
	at com.carrotsearch.randomizedtesting.RandomizedRunner$6.evaluate(RandomizedRunner.java:879)
	at com.carrotsearch.randomizedtesting.RandomizedRunner$7.evaluate(RandomizedRunner.java:890)
	at com.carrotsearch.randomizedtesting.rules.StatementAdapter.evaluate(StatementAdapter.java:36)
	at com.carrotsearch.randomizedtesting.rules.SystemPropertiesRestoreRule$1.evaluate(SystemPropertiesRestoreRule.java:57)
	at org.apache.lucene.util.AbstractBeforeAfterRule$1.evaluate(AbstractBeforeAfterRule.java:45)
	at com.carrotsearch.randomizedtesting.rules.StatementAdapter.evaluate(StatementAdapter.java:36)
	at org.apache.lucene.util.TestRuleStoreClassName$1.evaluate(TestRuleStoreClassName.java:41)
	at com.carrotsearch.randomizedtesting.rules.NoShadowingOrOverridesOnMethodsRule$1.evaluate(NoShadowingOrOverridesOnMethodsRule.java:40)
	at com.carrotsearch.randomizedtesting.rules.NoShadowingOrOverridesOnMethodsRule$1.evaluate(NoShadowingOrOverridesOnMethodsRule.java:40)
	at com.carrotsearch.randomizedtesting.rules.StatementAdapter.evaluate(StatementAdapter.java:36)
	at com.carrotsearch.randomizedtesting.rules.StatementAdapter.evaluate(StatementAdapter.java:36)
	at com.carrotsearch.randomizedtesting.rules.StatementAdapter.evaluate(StatementAdapter.java:36)
	at org.apache.lucene.util.TestRuleAssertionsRequired$1.evaluate(TestRuleAssertionsRequired.java:53)
	at org.apache.lucene.util.TestRuleMarkFailure$1.evaluate(TestRuleMarkFailure.java:47)
	at org.apache.lucene.util.TestRuleIgnoreAfterMaxFailures$1.evaluate(TestRuleIgnoreAfterMaxFailures.java:64)
	at org.apache.lucene.util.TestRuleIgnoreTestSuites$1.evaluate(TestRuleIgnoreTestSuites.java:54)
	at com.carrotsearch.randomizedtesting.rules.StatementAdapter.evaluate(StatementAdapter.java:36)
	at com.carrotsearch.randomizedtesting.ThreadLeakControl$StatementRunner.run(ThreadLeakControl.java:368)
	at java.lang.Thread.run(Thread.java:748)


FAILED:  org.apache.solr.handler.admin.AutoscalingHistoryHandlerTest.testHistory

Error Message:
expected:<5> but was:<0>

Stack Trace:
java.lang.AssertionError: expected:<5> but was:<0>
	at __randomizedtesting.SeedInfo.seed([7D757E90F8BE0D14:1089DA6D42F6F213]:0)
	at org.junit.Assert.fail(Assert.java:93)
	at org.junit.Assert.failNotEquals(Assert.java:647)
	at org.junit.Assert.assertEquals(Assert.java:128)
	at org.junit.Assert.assertEquals(Assert.java:472)
	at org.junit.Assert.assertEquals(Assert.java:456)
	at org.apache.solr.handler.admin.AutoscalingHistoryHandlerTest.testHistory(AutoscalingHistoryHandlerTest.java:244)
	at sun.reflect.NativeMethodAccessorImpl.invoke0(Native Method)
	at sun.reflect.NativeMethodAccessorImpl.invoke(NativeMethodAccessorImpl.java:62)
	at sun.reflect.DelegatingMethodAccessorImpl.invoke(DelegatingMethodAccessorImpl.java:43)
	at java.lang.reflect.Method.invoke(Method.java:498)
	at com.carrotsearch.randomizedtesting.RandomizedRunner.invoke(RandomizedRunner.java:1737)
	at com.carrotsearch.randomizedtesting.RandomizedRunner$8.evaluate(RandomizedRunner.java:934)
	at com.carrotsearch.randomizedtesting.RandomizedRunner$9.evaluate(RandomizedRunner.java:970)
	at com.carrotsearch.randomizedtesting.RandomizedRunner$10.evaluate(RandomizedRunner.java:984)
	at com.carrotsearch.randomizedtesting.rules.SystemPropertiesRestoreRule$1.evaluate(SystemPropertiesRestoreRule.java:57)
	at org.apache.lucene.util.TestRuleSetupTeardownChained$1.evaluate(TestRuleSetupTeardownChained.java:49)
	at org.apache.lucene.util.AbstractBeforeAfterRule$1.evaluate(AbstractBeforeAfterRule.java:45)
	at org.apache.lucene.util.TestRuleThreadAndTestName$1.evaluate(TestRuleThreadAndTestName.java:48)
	at org.apache.lucene.util.TestRuleIgnoreAfterMaxFailures$1.evaluate(TestRuleIgnoreAfterMaxFailures.java:64)
	at org.apache.lucene.util.TestRuleMarkFailure$1.evaluate(TestRuleMarkFailure.java:47)
	at com.carrotsearch.randomizedtesting.rules.StatementAdapter.evaluate(StatementAdapter.java:36)
	at com.carrotsearch.randomizedtesting.ThreadLeakControl$StatementRunner.run(ThreadLeakControl.java:368)
	at com.carrotsearch.randomizedtesting.ThreadLeakControl.forkTimeoutingTask(ThreadLeakControl.java:817)
	at com.carrotsearch.randomizedtesting.ThreadLeakControl$3.evaluate(ThreadLeakControl.java:468)
	at com.carrotsearch.randomizedtesting.RandomizedRunner.runSingleTest(RandomizedRunner.java:943)
	at com.carrotsearch.randomizedtesting.RandomizedRunner$5.evaluate(RandomizedRunner.java:829)
	at com.carrotsearch.randomizedtesting.RandomizedRunner$6.evaluate(RandomizedRunner.java:879)
	at com.carrotsearch.randomizedtesting.RandomizedRunner$7.evaluate(RandomizedRunner.java:890)
	at com.carrotsearch.randomizedtesting.rules.StatementAdapter.evaluate(StatementAdapter.java:36)
	at com.carrotsearch.randomizedtesting.rules.SystemPropertiesRestoreRule$1.evaluate(SystemPropertiesRestoreRule.java:57)
	at org.apache.lucene.util.AbstractBeforeAfterRule$1.evaluate(AbstractBeforeAfterRule.java:45)
	at com.carrotsearch.randomizedtesting.rules.StatementAdapter.evaluate(StatementAdapter.java:36)
	at org.apache.lucene.util.TestRuleStoreClassName$1.evaluate(TestRuleStoreClassName.java:41)
	at com.carrotsearch.randomizedtesting.rules.NoShadowingOrOverridesOnMethodsRule$1.evaluate(NoShadowingOrOverridesOnMethodsRule.java:40)
	at com.carrotsearch.randomizedtesting.rules.NoShadowingOrOverridesOnMethodsRule$1.evaluate(NoShadowingOrOverridesOnMethodsRule.java:40)
	at com.carrotsearch.randomizedtesting.rules.StatementAdapter.evaluate(StatementAdapter.java:36)
	at com.carrotsearch.randomizedtesting.rules.StatementAdapter.evaluate(StatementAdapter.java:36)
	at com.carrotsearch.randomizedtesting.rules.StatementAdapter.evaluate(StatementAdapter.java:36)
	at org.apache.lucene.util.TestRuleAssertionsRequired$1.evaluate(TestRuleAssertionsRequired.java:53)
	at org.apache.lucene.util.TestRuleMarkFailure$1.evaluate(TestRuleMarkFailure.java:47)
	at org.apache.lucene.util.TestRuleIgnoreAfterMaxFailures$1.evaluate(TestRuleIgnoreAfterMaxFailures.java:64)
	at org.apache.lucene.util.TestRuleIgnoreTestSuites$1.evaluate(TestRuleIgnoreTestSuites.java:54)
	at com.carrotsearch.randomizedtesting.rules.StatementAdapter.evaluate(StatementAdapter.java:36)
	at com.carrotsearch.randomizedtesting.ThreadLeakControl$StatementRunner.run(ThreadLeakControl.java:368)
	at java.lang.Thread.run(Thread.java:748)




Build Log:
[...truncated 12209 lines...]
   [junit4] Suite: org.apache.solr.cloud.api.collections.ShardSplitTest
   [junit4]   2> 133152 INFO  (SUITE-ShardSplitTest-seed#[7D757E90F8BE0D14]-worker) [    ] o.a.s.SolrTestCaseJ4 SecureRandom sanity checks: test.solr.allowed.securerandom=null & java.security.egd=file:/dev/./urandom
   [junit4]   2> Creating dataDir: /home/jenkins/jenkins-slave/workspace/Lucene-Solr-Tests-master/solr/build/solr-core/test/J2/temp/solr.cloud.api.collections.ShardSplitTest_7D757E90F8BE0D14-001/init-core-data-001
   [junit4]   2> 133153 WARN  (SUITE-ShardSplitTest-seed#[7D757E90F8BE0D14]-worker) [    ] o.a.s.SolrTestCaseJ4 startTrackingSearchers: numOpens=18 numCloses=18
   [junit4]   2> 133153 INFO  (SUITE-ShardSplitTest-seed#[7D757E90F8BE0D14]-worker) [    ] o.a.s.SolrTestCaseJ4 Using PointFields (NUMERIC_POINTS_SYSPROP=true) w/NUMERIC_DOCVALUES_SYSPROP=false
   [junit4]   2> 133155 INFO  (SUITE-ShardSplitTest-seed#[7D757E90F8BE0D14]-worker) [    ] o.a.s.SolrTestCaseJ4 Randomized ssl (false) and clientAuth (false) via: @org.apache.solr.SolrTestCaseJ4$SuppressSSL(bugUrl=https://issues.apache.org/jira/browse/SOLR-5776)
   [junit4]   2> 133155 INFO  (SUITE-ShardSplitTest-seed#[7D757E90F8BE0D14]-worker) [    ] o.a.s.BaseDistributedSearchTestCase Setting hostContext system property: /r_xf/
   [junit4]   2> 133227 INFO  (TEST-ShardSplitTest.testSplitShardWithRule-seed#[7D757E90F8BE0D14]) [    ] o.a.s.c.ZkTestServer STARTING ZK TEST SERVER
   [junit4]   2> 133245 INFO  (Thread-57) [    ] o.a.s.c.ZkTestServer client port:0.0.0.0/0.0.0.0:0
   [junit4]   2> 133245 INFO  (Thread-57) [    ] o.a.s.c.ZkTestServer Starting server
   [junit4]   2> 133298 ERROR (Thread-57) [    ] o.a.z.s.ZooKeeperServer ZKShutdownHandler is not registered, so ZooKeeper server won't take any action on ERROR or SHUTDOWN server state changes
   [junit4]   2> 133354 INFO  (TEST-ShardSplitTest.testSplitShardWithRule-seed#[7D757E90F8BE0D14]) [    ] o.a.s.c.ZkTestServer start zk server on port:42924
   [junit4]   2> 133456 INFO  (zkConnectionManagerCallback-85-thread-1) [    ] o.a.s.c.c.ConnectionManager zkClient has connected
   [junit4]   2> 133674 INFO  (zkConnectionManagerCallback-87-thread-1) [    ] o.a.s.c.c.ConnectionManager zkClient has connected
   [junit4]   2> 133695 INFO  (TEST-ShardSplitTest.testSplitShardWithRule-seed#[7D757E90F8BE0D14]) [    ] o.a.s.c.AbstractZkTestCase put /home/jenkins/jenkins-slave/workspace/Lucene-Solr-Tests-master/solr/core/src/test-files/solr/collection1/conf/solrconfig-tlog.xml to /configs/conf1/solrconfig.xml
   [junit4]   2> 133714 INFO  (TEST-ShardSplitTest.testSplitShardWithRule-seed#[7D757E90F8BE0D14]) [    ] o.a.s.c.AbstractZkTestCase put /home/jenkins/jenkins-slave/workspace/Lucene-Solr-Tests-master/solr/core/src/test-files/solr/collection1/conf/schema15.xml to /configs/conf1/schema.xml
   [junit4]   2> 133747 INFO  (TEST-ShardSplitTest.testSplitShardWithRule-seed#[7D757E90F8BE0D14]) [    ] o.a.s.c.AbstractZkTestCase put /home/jenkins/jenkins-slave/workspace/Lucene-Solr-Tests-master/solr/core/src/test-files/solr/collection1/conf/solrconfig.snippet.randomindexconfig.xml to /configs/conf1/solrconfig.snippet.randomindexconfig.xml
   [junit4]   2> 133749 INFO  (TEST-ShardSplitTest.testSplitShardWithRule-seed#[7D757E90F8BE0D14]) [    ] o.a.s.c.AbstractZkTestCase put /home/jenkins/jenkins-slave/workspace/Lucene-Solr-Tests-master/solr/core/src/test-files/solr/collection1/conf/stopwords.txt to /configs/conf1/stopwords.txt
   [junit4]   2> 133768 INFO  (TEST-ShardSplitTest.testSplitShardWithRule-seed#[7D757E90F8BE0D14]) [    ] o.a.s.c.AbstractZkTestCase put /home/jenkins/jenkins-slave/workspace/Lucene-Solr-Tests-master/solr/core/src/test-files/solr/collection1/conf/protwords.txt to /configs/conf1/protwords.txt
   [junit4]   2> 133769 INFO  (TEST-ShardSplitTest.testSplitShardWithRule-seed#[7D757E90F8BE0D14]) [    ] o.a.s.c.AbstractZkTestCase put /home/jenkins/jenkins-slave/workspace/Lucene-Solr-Tests-master/solr/core/src/test-files/solr/collection1/conf/currency.xml to /configs/conf1/currency.xml
   [junit4]   2> 133770 INFO  (TEST-ShardSplitTest.testSplitShardWithRule-seed#[7D757E90F8BE0D14]) [    ] o.a.s.c.AbstractZkTestCase put /home/jenkins/jenkins-slave/workspace/Lucene-Solr-Tests-master/solr/core/src/test-files/solr/collection1/conf/enumsConfig.xml to /configs/conf1/enumsConfig.xml
   [junit4]   2> 133771 INFO  (TEST-ShardSplitTest.testSplitShardWithRule-seed#[7D757E90F8BE0D14]) [    ] o.a.s.c.AbstractZkTestCase put /home/jenkins/jenkins-slave/workspace/Lucene-Solr-Tests-master/solr/core/src/test-files/solr/collection1/conf/open-exchange-rates.json to /configs/conf1/open-exchange-rates.json
   [junit4]   2> 133784 INFO  (TEST-ShardSplitTest.testSplitShardWithRule-seed#[7D757E90F8BE0D14]) [    ] o.a.s.c.AbstractZkTestCase put /home/jenkins/jenkins-slave/workspace/Lucene-Solr-Tests-master/solr/core/src/test-files/solr/collection1/conf/mapping-ISOLatin1Accent.txt to /configs/conf1/mapping-ISOLatin1Accent.txt
   [junit4]   2> 133785 INFO  (TEST-ShardSplitTest.testSplitShardWithRule-seed#[7D757E90F8BE0D14]) [    ] o.a.s.c.AbstractZkTestCase put /home/jenkins/jenkins-slave/workspace/Lucene-Solr-Tests-master/solr/core/src/test-files/solr/collection1/conf/old_synonyms.txt to /configs/conf1/old_synonyms.txt
   [junit4]   2> 133786 INFO  (TEST-ShardSplitTest.testSplitShardWithRule-seed#[7D757E90F8BE0D14]) [    ] o.a.s.c.AbstractZkTestCase put /home/jenkins/jenkins-slave/workspace/Lucene-Solr-Tests-master/solr/core/src/test-files/solr/collection1/conf/synonyms.txt to /configs/conf1/synonyms.txt
   [junit4]   2> 133845 INFO  (TEST-ShardSplitTest.testSplitShardWithRule-seed#[7D757E90F8BE0D14]) [    ] o.a.s.c.AbstractFullDistribZkTestBase Will use TLOG replicas unless explicitly asked otherwise
   [junit4]   2> 134616 INFO  (TEST-ShardSplitTest.testSplitShardWithRule-seed#[7D757E90F8BE0D14]) [    ] o.e.j.s.Server jetty-9.4.8.v20171121, build timestamp: 2017-11-22T05:27:37+08:00, git hash: 82b8fb23f757335bb3329d540ce37a2a2615f0a8
   [junit4]   2> 134676 INFO  (TEST-ShardSplitTest.testSplitShardWithRule-seed#[7D757E90F8BE0D14]) [    ] o.e.j.s.session DefaultSessionIdManager workerName=node0
   [junit4]   2> 134676 INFO  (TEST-ShardSplitTest.testSplitShardWithRule-seed#[7D757E90F8BE0D14]) [    ] o.e.j.s.session No SessionScavenger set, using defaults
   [junit4]   2> 134676 INFO  (TEST-ShardSplitTest.testSplitShardWithRule-seed#[7D757E90F8BE0D14]) [    ] o.e.j.s.session Scavenging every 600000ms
   [junit4]   2> 134677 INFO  (TEST-ShardSplitTest.testSplitShardWithRule-seed#[7D757E90F8BE0D14]) [    ] o.e.j.s.h.ContextHandler Started o.e.j.s.ServletContextHandler@7dc93285{/r_xf,null,AVAILABLE}
   [junit4]   2> 134678 INFO  (TEST-ShardSplitTest.testSplitShardWithRule-seed#[7D757E90F8BE0D14]) [    ] o.e.j.s.AbstractConnector Started ServerConnector@45391b5a{HTTP/1.1,[http/1.1]}{127.0.0.1:44044}
   [junit4]   2> 134678 INFO  (TEST-ShardSplitTest.testSplitShardWithRule-seed#[7D757E90F8BE0D14]) [    ] o.e.j.s.Server Started @146911ms
   [junit4]   2> 134678 INFO  (TEST-ShardSplitTest.testSplitShardWithRule-seed#[7D757E90F8BE0D14]) [    ] o.a.s.c.s.e.JettySolrRunner Jetty properties: {solr.data.dir=/home/jenkins/jenkins-slave/workspace/Lucene-Solr-Tests-master/solr/build/solr-core/test/J2/temp/solr.cloud.api.collections.ShardSplitTest_7D757E90F8BE0D14-001/tempDir-001/control/data, replicaType=NRT, hostContext=/r_xf, hostPort=44044, coreRootDirectory=/home/jenkins/jenkins-slave/workspace/Lucene-Solr-Tests-master/solr/build/solr-core/test/J2/temp/solr.cloud.api.collections.ShardSplitTest_7D757E90F8BE0D14-001/control-001/cores}
   [junit4]   2> 134679 ERROR (TEST-ShardSplitTest.testSplitShardWithRule-seed#[7D757E90F8BE0D14]) [    ] o.a.s.u.StartupLoggingUtils Missing Java Option solr.log.dir. Logging may be missing or incomplete.
   [junit4]   2> 134679 INFO  (TEST-ShardSplitTest.testSplitShardWithRule-seed#[7D757E90F8BE0D14]) [    ] o.a.s.s.SolrDispatchFilter  ___      _       Welcome to Apache Solr™ version 8.0.0
   [junit4]   2> 134679 INFO  (TEST-ShardSplitTest.testSplitShardWithRule-seed#[7D757E90F8BE0D14]) [    ] o.a.s.s.SolrDispatchFilter / __| ___| |_ _   Starting in cloud mode on port null
   [junit4]   2> 134679 INFO  (TEST-ShardSplitTest.testSplitShardWithRule-seed#[7D757E90F8BE0D14]) [    ] o.a.s.s.SolrDispatchFilter \__ \/ _ \ | '_|  Install dir: null
   [junit4]   2> 134679 INFO  (TEST-ShardSplitTest.testSplitShardWithRule-seed#[7D757E90F8BE0D14]) [    ] o.a.s.s.SolrDispatchFilter |___/\___/_|_|    Start time: 2018-02-05T16:41:20.486Z
   [junit4]   2> 134713 INFO  (zkConnectionManagerCallback-89-thread-1) [    ] o.a.s.c.c.ConnectionManager zkClient has connected
   [junit4]   2> 134714 INFO  (TEST-ShardSplitTest.testSplitShardWithRule-seed#[7D757E90F8BE0D14]) [    ] o.a.s.s.SolrDispatchFilter Loading solr.xml from SolrHome (not found in ZooKeeper)
   [junit4]   2> 134714 INFO  (TEST-ShardSplitTest.testSplitShardWithRule-seed#[7D757E90F8BE0D14]) [    ] o.a.s.c.SolrXmlConfig Loading container configuration from /home/jenkins/jenkins-slave/workspace/Lucene-Solr-Tests-master/solr/build/solr-core/test/J2/temp/solr.cloud.api.collections.ShardSplitTest_7D757E90F8BE0D14-001/control-001/solr.xml
   [junit4]   2> 134752 INFO  (TEST-ShardSplitTest.testSplitShardWithRule-seed#[7D757E90F8BE0D14]) [    ] o.a.s.c.SolrXmlConfig Configuration parameter autoReplicaFailoverWorkLoopDelay is ignored
   [junit4]   2> 134752 INFO  (TEST-ShardSplitTest.testSplitShardWithRule-seed#[7D757E90F8BE0D14]) [    ] o.a.s.c.SolrXmlConfig Configuration parameter autoReplicaFailoverBadNodeExpiration is ignored
   [junit4]   2> 134753 INFO  (TEST-ShardSplitTest.testSplitShardWithRule-seed#[7D757E90F8BE0D14]) [    ] o.a.s.c.SolrXmlConfig MBean server found: com.sun.jmx.mbeanserver.JmxMBeanServer@367dc723, but no JMX reporters were configured - adding default JMX reporter.
   [junit4]   2> 134824 INFO  (TEST-ShardSplitTest.testSplitShardWithRule-seed#[7D757E90F8BE0D14]) [    ] o.a.s.c.ZkContainer Zookeeper client=127.0.0.1:42924/solr
   [junit4]   2> 134845 INFO  (zkConnectionManagerCallback-93-thread-1) [    ] o.a.s.c.c.ConnectionManager zkClient has connected
   [junit4]   2> 134883 INFO  (zkConnectionManagerCallback-95-thread-1-processing-n:127.0.0.1:44044_r_xf) [n:127.0.0.1:44044_r_xf    ] o.a.s.c.c.ConnectionManager zkClient has connected
   [junit4]   2> 135974 INFO  (TEST-ShardSplitTest.testSplitShardWithRule-seed#[7D757E90F8BE0D14]) [n:127.0.0.1:44044_r_xf    ] o.a.s.c.Overseer Overseer (id=null) closing
   [junit4]   2> 135990 INFO  (TEST-ShardSplitTest.testSplitShardWithRule-seed#[7D757E90F8BE0D14]) [n:127.0.0.1:44044_r_xf    ] o.a.s.c.OverseerElectionContext I am going to be the leader 127.0.0.1:44044_r_xf
   [junit4]   2> 135991 INFO  (TEST-ShardSplitTest.testSplitShardWithRule-seed#[7D757E90F8BE0D14]) [n:127.0.0.1:44044_r_xf    ] o.a.s.c.Overseer Overseer (id=72069802084335620-127.0.0.1:44044_r_xf-n_0000000000) starting
   [junit4]   2> 136029 INFO  (TEST-ShardSplitTest.testSplitShardWithRule-seed#[7D757E90F8BE0D14]) [n:127.0.0.1:44044_r_xf    ] o.a.s.c.ZkController Register node as live in ZooKeeper:/live_nodes/127.0.0.1:44044_r_xf
   [junit4]   2> 136030 INFO  (OverseerStateUpdate-72069802084335620-127.0.0.1:44044_r_xf-n_0000000000) [n:127.0.0.1:44044_r_xf    ] o.a.s.c.c.ZkStateReader Updated live nodes from ZooKeeper... (0) -> (1)
   [junit4]   2> 136458 INFO  (TEST-ShardSplitTest.testSplitShardWithRule-seed#[7D757E90F8BE0D14]) [n:127.0.0.1:44044_r_xf    ] o.a.s.m.r.SolrJmxReporter JMX monitoring for 'solr.node' (registry 'solr.node') enabled at server: com.sun.jmx.mbeanserver.JmxMBeanServer@367dc723
   [junit4]   2> 136532 INFO  (TEST-ShardSplitTest.testSplitShardWithRule-seed#[7D757E90F8BE0D14]) [n:127.0.0.1:44044_r_xf    ] o.a.s.m.r.SolrJmxReporter JMX monitoring for 'solr.jvm' (registry 'solr.jvm') enabled at server: com.sun.jmx.mbeanserver.JmxMBeanServer@367dc723
   [junit4]   2> 136545 INFO  (TEST-ShardSplitTest.testSplitShardWithRule-seed#[7D757E90F8BE0D14]) [n:127.0.0.1:44044_r_xf    ] o.a.s.m.r.SolrJmxReporter JMX monitoring for 'solr.jetty' (registry 'solr.jetty') enabled at server: com.sun.jmx.mbeanserver.JmxMBeanServer@367dc723
   [junit4]   2> 136547 INFO  (TEST-ShardSplitTest.testSplitShardWithRule-seed#[7D757E90F8BE0D14]) [n:127.0.0.1:44044_r_xf    ] o.a.s.c.CorePropertiesLocator Found 0 core definitions underneath /home/jenkins/jenkins-slave/workspace/Lucene-Solr-Tests-master/solr/build/solr-core/test/J2/temp/solr.cloud.api.collections.ShardSplitTest_7D757E90F8BE0D14-001/control-001/cores
   [junit4]   2> 136858 INFO  (zkConnectionManagerCallback-101-thread-1) [    ] o.a.s.c.c.ConnectionManager zkClient has connected
   [junit4]   2> 136910 INFO  (TEST-ShardSplitTest.testSplitShardWithRule-seed#[7D757E90F8BE0D14]) [    ] o.a.s.c.c.ZkStateReader Updated live nodes from ZooKeeper... (0) -> (1)
   [junit4]   2> 136924 INFO  (TEST-ShardSplitTest.testSplitShardWithRule-seed#[7D757E90F8BE0D14]) [    ] o.a.s.c.s.i.ZkClientClusterStateProvider Cluster at 127.0.0.1:42924/solr ready
   [junit4]   2> 136933 INFO  (qtp1074694918-471) [n:127.0.0.1:44044_r_xf    ] o.a.s.h.a.CollectionsHandler Invoked Collection Action :create with params replicationFactor=1&collection.configName=conf1&name=control_collection&nrtReplicas=1&action=CREATE&numShards=1&createNodeSet=127.0.0.1:44044_r_xf&wt=javabin&version=2 and sendToOCPQueue=true
   [junit4]   2> 137089 INFO  (OverseerThreadFactory-141-thread-1-processing-n:127.0.0.1:44044_r_xf) [n:127.0.0.1:44044_r_xf    ] o.a.s.c.a.c.CreateCollectionCmd Create collection control_collection
   [junit4]   2> 137301 INFO  (qtp1074694918-475) [n:127.0.0.1:44044_r_xf    ] o.a.s.h.a.CoreAdminOperation core create command qt=/admin/cores&collection.configName=conf1&newCollection=true&name=control_collection_shard1_replica_n1&action=CREATE&numShards=1&collection=control_collection&shard=shard1&wt=javabin&version=2&replicaType=NRT
   [junit4]   2> 137301 INFO  (qtp1074694918-475) [n:127.0.0.1:44044_r_xf    ] o.a.s.c.TransientSolrCoreCacheDefault Allocating transient cache for 4 transient cores
   [junit4]   2> 137620 INFO  (zkCallback-94-thread-1-processing-n:127.0.0.1:44044_r_xf) [n:127.0.0.1:44044_r_xf    ] o.a.s.c.c.ZkStateReader A cluster state change: [WatchedEvent state:SyncConnected type:NodeDataChanged path:/collections/control_collection/state.json] for collection [control_collection] has occurred - updating... (live nodes size: [1])
   [junit4]   2> 138627 INFO  (qtp1074694918-475) [n:127.0.0.1:44044_r_xf c:control_collection s:shard1  x:control_collection_shard1_replica_n1] o.a.s.c.SolrConfig Using Lucene MatchVersion: 8.0.0
   [junit4]   2> 138837 INFO  (qtp1074694918-475) [n:127.0.0.1:44044_r_xf c:control_collection s:shard1  x:control_collection_shard1_replica_n1] o.a.s.s.IndexSchema [control_collection_shard1_replica_n1] Schema name=test
   [junit4]   2> 139443 INFO  (qtp1074694918-475) [n:127.0.0.1:44044_r_xf c:control_collection s:shard1  x:control_collection_shard1_replica_n1] o.a.s.s.IndexSchema Loaded schema test/1.6 with uniqueid field id
   [junit4]   2> 139627 INFO  (qtp1074694918-475) [n:127.0.0.1:44044_r_xf c:control_collection s:shard1  x:control_collection_shard1_replica_n1] o.a.s.c.CoreContainer Creating SolrCore 'control_collection_shard1_replica_n1' using configuration from collection control_collection, trusted=true
   [junit4]   2> 139660 INFO  (qtp1074694918-475) [n:127.0.0.1:44044_r_xf c:control_collection s:shard1  x:control_collection_shard1_replica_n1] o.a.s.m.r.SolrJmxReporter JMX monitoring for 'solr.core.control_collection.shard1.replica_n1' (registry 'solr.core.control_collection.shard1.replica_n1') enabled at server: com.sun.jmx.mbeanserver.JmxMBeanServer@367dc723
   [junit4]   2> 139735 INFO  (qtp1074694918-475) [n:127.0.0.1:44044_r_xf c:control_collection s:shard1  x:control_collection_shard1_replica_n1] o.a.s.c.SolrCore solr.RecoveryStrategy.Builder
   [junit4]   2> 139735 INFO  (qtp1074694918-475) [n:127.0.0.1:44044_r_xf c:control_collection s:shard1  x:control_collection_shard1_replica_n1] o.a.s.c.SolrCore [[control_collection_shard1_replica_n1] ] Opening new SolrCore at [/home/jenkins/jenkins-slave/workspace/Lucene-Solr-Tests-master/solr/build/solr-core/test/J2/temp/solr.cloud.api.collections.ShardSplitTest_7D757E90F8BE0D14-001/control-001/cores/control_collection_shard1_replica_n1], dataDir=[/home/jenkins/jenkins-slave/workspace/Lucene-Solr-Tests-master/solr/build/solr-core/test/J2/temp/solr.cloud.api.collections.ShardSplitTest_7D757E90F8BE0D14-001/control-001/cores/control_collection_shard1_replica_n1/data/]
   [junit4]   2> 139770 INFO  (qtp1074694918-475) [n:127.0.0.1:44044_r_xf c:control_collection s:shard1  x:control_collection_shard1_replica_n1] o.a.s.u.RandomMergePolicy RandomMergePolicy wrapping class org.apache.lucene.index.TieredMergePolicy: [TieredMergePolicy: maxMergeAtOnce=45, maxMergeAtOnceExplicit=12, maxMergedSegmentMB=20.3046875, floorSegmentMB=1.5849609375, forceMergeDeletesPctAllowed=25.297949433785103, segmentsPerTier=42.0, maxCFSSegmentSizeMB=8.796093022207999E12, noCFSRatio=1.0
   [junit4]   2> 139831 WARN  (qtp1074694918-475) [n:127.0.0.1:44044_r_xf c:control_collection s:shard1  x:control_collection_shard1_replica_n1] o.a.s.c.RequestHandlers INVALID paramSet a in requestHandler {type = requestHandler,name = /dump,class = DumpRequestHandler,attributes = {initParams=a, name=/dump, class=DumpRequestHandler},args = {defaults={a=A,b=B}}}
   [junit4]   2> 140031 INFO  (qtp1074694918-475) [n:127.0.0.1:44044_r_xf c:control_collection s:shard1  x:control_collection_shard1_replica_n1] o.a.s.u.UpdateHandler Using UpdateLog implementation: org.apache.solr.update.UpdateLog
   [junit4]   2> 140031 INFO  (qtp1074694918-475) [n:127.0.0.1:44044_r_xf c:control_collection s:shard1  x:control_collection_shard1_replica_n1] o.a.s.u.UpdateLog Initializing UpdateLog: dataDir= defaultSyncLevel=FLUSH numRecordsToKeep=100 maxNumLogsToKeep=10 numVersionBuckets=65536
   [junit4]   2> 140032 INFO  (qtp1074694918-475) [n:127.0.0.1:44044_r_xf c:control_collection s:shard1  x:control_collection_shard1_replica_n1] o.a.s.u.CommitTracker Hard AutoCommit: disabled
   [junit4]   2> 140032 INFO  (qtp1074694918-475) [n:127.0.0.1:44044_r_xf c:control_collection s:shard1  x:control_collection_shard1_replica_n1] o.a.s.u.CommitTracker Soft AutoCommit: disabled
   [junit4]   2> 140050 INFO  (qtp1074694918-475) [n:127.0.0.1:44044_r_xf c:control_collection s:shard1  x:control_collection_shard1_replica_n1] o.a.s.u.RandomMergePolicy RandomMergePolicy wrapping class org.apache.lucene.index.TieredMergePolicy: [TieredMergePolicy: maxMergeAtOnce=28, maxMergeAtOnceExplicit=15, maxMergedSegmentMB=55.26953125, floorSegmentMB=1.7734375, forceMergeDeletesPctAllowed=9.0423274225675, segmentsPerTier=33.0, maxCFSSegmentSizeMB=8.796093022207999E12, noCFSRatio=0.2771342467784269
   [junit4]   2> 140101 INFO  (qtp1074694918-475) [n:127.0.0.1:44044_r_xf c:control_collection s:shard1  x:control_collection_shard1_replica_n1] o.a.s.s.SolrIndexSearcher Opening [Searcher@2933fd7c[control_collection_shard1_replica_n1] main]
   [junit4]   2> 140158 INFO  (qtp1074694918-475) [n:127.0.0.1:44044_r_xf c:control_collection s:shard1  x:control_collection_shard1_replica_n1] o.a.s.r.ManagedResourceStorage Configured ZooKeeperStorageIO with znodeBase: /configs/conf1
   [junit4]   2> 140174 INFO  (qtp1074694918-475) [n:127.0.0.1:44044_r_xf c:control_collection s:shard1  x:control_collection_shard1_replica_n1] o.a.s.r.ManagedResourceStorage Loaded null at path _rest_managed.json using ZooKeeperStorageIO:path=/configs/conf1
   [junit4]   2> 140175 INFO  (qtp1074694918-475) [n:127.0.0.1:44044_r_xf c:control_collection s:shard1  x:control_collection_shard1_replica_n1] o.a.s.h.ReplicationHandler Commits will be reserved for 10000ms.
   [junit4]   2> 140175 INFO  (qtp1074694918-475) [n:127.0.0.1:44044_r_xf c:control_collection s:shard1  x:control_collection_shard1_replica_n1] o.a.s.u.UpdateLog Could not find max version in index or recent updates, using new clock 1591579913467461632
   [junit4]   2> 140232 INFO  (searcherExecutor-144-thread-1-processing-n:127.0.0.1:44044_r_xf x:control_collection_shard1_replica_n1 s:shard1 c:control_collection) [n:127.0.0.1:44044_r_xf c:control_collection s:shard1  x:control_collection_shard1_replica_n1] o.a.s.c.SolrCore [control_collection_shard1_replica_n1] Registered new searcher Searcher@2933fd7c[control_collection_shard1_replica_n1] main{ExitableDirectoryReader(UninvertingDirectoryReader())}
   [junit4]   2> 140264 INFO  (qtp1074694918-475) [n:127.0.0.1:44044_r_xf c:control_collection s:shard1  x:control_collection_shard1_replica_n1] o.a.s.c.ShardLeaderElectionContext Enough replicas found to continue.
   [junit4]   2> 140265 INFO  (qtp1074694918-475) [n:127.0.0.1:44044_r_xf c:control_collection s:shard1  x:control_collection_shard1_replica_n1] o.a.s.c.ShardLeaderElectionContext I may be the new leader - try and sync
   [junit4]   2> 140265 INFO  (qtp1074694918-475) [n:127.0.0.1:44044_r_xf c:control_collection s:shard1  x:control_collection_shard1_replica_n1] o.a.s.c.SyncStrategy Sync replicas to http://127.0.0.1:44044/r_xf/control_collection_shard1_replica_n1/
   [junit4]   2> 140265 INFO  (qtp1074694918-475) [n:127.0.0.1:44044_r_xf c:control_collection s:shard1  x:control_collection_shard1_replica_n1] o.a.s.c.SyncStrategy Sync Success - now sync replicas to me
   [junit4]   2> 140265 INFO  (qtp1074694918-475) [n:127.0.0.1:44044_r_xf c:control_collection s:shard1  x:control_collection_shard1_replica_n1] o.a.s.c.SyncStrategy http://127.0.0.1:44044/r_xf/control_collection_shard1_replica_n1/ has no replicas
   [junit4]   2> 140265 INFO  (qtp1074694918-475) [n:127.0.0.1:44044_r_xf c:control_collection s:shard1  x:control_collection_shard1_replica_n1] o.a.s.c.ShardLeaderElectionContext Found all replicas participating in election, clear LIR
   [junit4]   2> 140337 INFO  (qtp1074694918-475) [n:127.0.0.1:44044_r_xf c:control_collection s:shard1  x:control_collection_shard1_replica_n1] o.a.s.c.ShardLeaderElectionContext I am the new leader: http://127.0.0.1:44044/r_xf/control_collection_shard1_replica_n1/ shard1
   [junit4]   2> 140389 INFO  (zkCallback-94-thread-2-processing-n:127.0.0.1:44044_r_xf) [n:127.0.0.1:44044_r_xf    ] o.a.s.c.c.ZkStateReader A cluster state change: [WatchedEvent state:SyncConnected type:NodeDataChanged path:/collections/control_collection/state.json] for collection [control_collection] has occurred - updating... (live nodes size: [1])
   [junit4]   2> 140446 INFO  (qtp1074694918-475) [n:127.0.0.1:44044_r_xf c:control_collection s:shard1  x:control_collection_shard1_replica_n1] o.a.s.c.ZkController I am the leader, no recovery necessary
   [junit4]   2> 140448 INFO  (qtp1074694918-475) [n:127.0.0.1:44044_r_xf c:control_collection s:shard1  x:control_collection_shard1_replica_n1] o.a.s.s.HttpSolrCall [admin] webapp=null path=/admin/cores params={qt=/admin/cores&collection.configName=conf1&newCollection=true&name=control_collection_shard1_replica_n1&action=CREATE&numShards=1&collection=control_collection&shard=shard1&wt=javabin&version=2&replicaType=NRT} status=0 QTime=3146
   [junit4]   2> 140508 INFO  (qtp1074694918-471) [n:127.0.0.1:44044_r_xf    ] o.a.s.h.a.CollectionsHandler Wait for new collection to be active for at most 30 seconds. Check all shard replicas
   [junit4]   2> 140600 INFO  (zkCallback-94-thread-2-processing-n:127.0.0.1:44044_r_xf) [n:127.0.0.1:44044_r_xf    ] o.a.s.c.c.ZkStateReader A cluster state change: [WatchedEvent state:SyncConnected type:NodeDataChanged path:/collections/control_collection/state.json] for collection [control_collection] has occurred - updating... (live nodes size: [1])
   [junit4]   2> 141269 INFO  (OverseerCollectionConfigSetProcessor-72069802084335620-127.0.0.1:44044_r_xf-n_0000000000) [n:127.0.0.1:44044_r_xf    ] o.a.s.c.OverseerTaskQueue Response ZK path: /overseer/collection-queue-work/qnr-0000000000 doesn't exist.  Requestor may have disconnected from ZooKeeper
   [junit4]   2> 141512 INFO  (qtp1074694918-471) [n:127.0.0.1:44044_r_xf    ] o.a.s.s.HttpSolrCall [admin] webapp=null path=/admin/collections params={replicationFactor=1&collection.configName=conf1&name=control_collection&nrtReplicas=1&action=CREATE&numShards=1&createNodeSet=127.0.0.1:44044_r_xf&wt=javabin&version=2} status=0 QTime=4579
   [junit4]   2> 141594 INFO  (zkConnectionManagerCallback-105-thread-1) [    ] o.a.s.c.c.ConnectionManager zkClient has connected
   [junit4]   2> 141595 INFO  (TEST-ShardSplitTest.testSplitShardWithRule-seed#[7D757E90F8BE0D14]) [    ] o.a.s.c.c.ZkStateReader Updated live nodes from ZooKeeper... (0) -> (1)
   [junit4]   2> 141596 INFO  (TEST-ShardSplitTest.testSplitShardWithRule-seed#[7D757E90F8BE0D14]) [    ] o.a.s.c.s.i.ZkClientClusterStateProvider Cluster at 127.0.0.1:42924/solr ready
   [junit4]   2> 141596 INFO  (TEST-ShardSplitTest.testSplitShardWithRule-seed#[7D757E90F8BE0D14]) [    ] o.a.s.c.ChaosMonkey monkey: init - expire sessions:false cause connection loss:false
   [junit4]   2> 141648 INFO  (qtp1074694918-475) [n:127.0.0.1:44044_r_xf    ] o.a.s.h.a.CollectionsHandler Invoked Collection Action :create with params replicationFactor=1&collection.configName=conf1&name=collection1&nrtReplicas=1&action=CREATE&numShards=2&createNodeSet=&stateFormat=2&wt=javabin&version=2 and sendToOCPQueue=true
   [junit4]   2> 141699 INFO  (OverseerThreadFactory-141-thread-2-processing-n:127.0.0.1:44044_r_xf) [n:127.0.0.1:44044_r_xf    ] o.a.s.c.a.c.CreateCollectionCmd Create collection collection1
   [junit4]   2> 141755 WARN  (OverseerThreadFactory-141-thread-2-processing-n:127.0.0.1:44044_r_xf) [n:127.0.0.1:44044_r_xf    ] o.a.s.c.a.c.CreateCollectionCmd It is unusual to create a collection (collection1) without cores.
   [junit4]   2> 142095 INFO  (qtp1074694918-475) [n:127.0.0.1:44044_r_xf    ] o.a.s.h.a.CollectionsHandler Wait for new collection to be active for at most 30 seconds. Check all shard replicas
   [junit4]   2> 142095 INFO  (qtp1074694918-475) [n:127.0.0.1:44044_r_xf    ] o.a.s.s.HttpSolrCall [admin] webapp=null path=/admin/collections params={replicationFactor=1&collection.configName=conf1&name=collection1&nrtReplicas=1&action=CREATE&numShards=2&createNodeSet=&stateFormat=2&wt=javabin&version=2} status=0 QTime=447
   [junit4]   2> 143214 INFO  (TEST-ShardSplitTest.testSplitShardWithRule-seed#[7D757E90F8BE0D14]) [    ] o.a.s.c.AbstractFullDistribZkTestBase create jetty 1 in directory /home/jenkins/jenkins-slave/workspace/Lucene-Solr-Tests-master/solr/build/solr-core/test/J2/temp/solr.cloud.api.collections.ShardSplitTest_7D757E90F8BE0D14-001/shard-1-001 of type TLOG
   [junit4]   2> 143268 INFO  (TEST-ShardSplitTest.testSplitShardWithRule-seed#[7D757E90F8BE0D14]) [    ] o.e.j.s.Server jetty-9.4.8.v20171121, build timestamp: 2017-11-22T05:27:37+08:00, git hash: 82b8fb23f757335bb3329d540ce37a2a2615f0a8
   [junit4]   2> 143408 INFO  (TEST-ShardSplitTest.testSplitShardWithRule-seed#[7D757E90F8BE0D14]) [    ] o.e.j.s.session DefaultSessionIdManager workerName=node0
   [junit4]   2> 143408 INFO  (TEST-ShardSplitTest.testSplitShardWithRule-seed#[7D757E90F8BE0D14]) [    ] o.e.j.s.session No SessionScavenger set, using defaults
   [junit4]   2> 143408 INFO  (TEST-ShardSplitTest.testSplitShardWithRule-seed#[7D757E90F8BE0D14]) [    ] o.e.j.s.session Scavenging every 600000ms
   [junit4]   2> 143413 INFO  (TEST-ShardSplitTest.testSplitShardWithRule-seed#[7D757E90F8BE0D14]) [    ] o.e.j.s.h.ContextHandler Started o.e.j.s.ServletContextHandler@51df79fe{/r_xf,null,AVAILABLE}
   [junit4]   2> 143414 INFO  (TEST-ShardSplitTest.testSplitShardWithRule-seed#[7D757E90F8BE0D14]) [    ] o.e.j.s.AbstractConnector Started ServerConnector@422c30d4{HTTP/1.1,[http/1.1]}{127.0.0.1:38452}
   [junit4]   2> 143414 INFO  (TEST-ShardSplitTest.testSplitShardWithRule-seed#[7D757E90F8BE0D14]) [    ] o.e.j.s.Server Started @155647ms
   [junit4]   2> 143414 INFO  (TEST-ShardSplitTest.testSplitShardWithRule-seed#[7D757E90F8BE0D14]) [    ] o.a.s.c.s.e.JettySolrRunner Jetty properties: {solr.data.dir=/home/jenkins/jenkins-slave/workspace/Lucene-Solr-Tests-master/solr/build/solr-core/test/J2/temp/solr.cloud.api.collections.ShardSplitTest_7D757E90F8BE0D14-001/tempDir-001/jetty1, replicaType=TLOG, solrconfig=solrconfig.xml, hostContext=/r_xf, hostPort=38452, coreRootDirectory=/home/jenkins/jenkins-slave/workspace/Lucene-Solr-Tests-master/solr/build/solr-core/test/J2/../../../../../../../../../../home/jenkins/jenkins-slave/workspace/Lucene-Solr-Tests-master/solr/build/solr-core/test/J2/temp/solr.cloud.api.collections.ShardSplitTest_7D757E90F8BE0D14-001/shard-1-001/cores}
   [junit4]   2> 143414 ERROR (TEST-ShardSplitTest.testSplitShardWithRule-seed#[7D757E90F8BE0D14]) [    ] o.a.s.u.StartupLoggingUtils Missing Java Option solr.log.dir. Logging may be missing or incomplete.
   [junit4]   2> 143414 INFO  (TEST-ShardSplitTest.testSplitShardWithRule-seed#[7D757E90F8BE0D14]) [    ] o.a.s.s.SolrDispatchFilter  ___      _       Welcome to Apache Solr™ version 8.0.0
   [junit4]   2> 143414 INFO  (TEST-ShardSplitTest.testSplitShardWithRule-seed#[7D757E90F8BE0D14]) [    ] o.a.s.s.SolrDispatchFilter / __| ___| |_ _   Starting in cloud mode on port null
   [junit4]   2> 143415 INFO  (TEST-ShardSplitTest.testSplitShardWithRule-seed#[7D757E90F8BE0D14]) [    ] o.a.s.s.SolrDispatchFilter \__ \/ _ \ | '_|  Install dir: null
   [junit4]   2> 143415 INFO  (TEST-ShardSplitTest.testSplitShardWithRule-seed#[7D757E90F8BE0D14]) [    ] o.a.s.s.SolrDispatchFilter |___/\___/_|_|    Start time: 2018-02-05T16:41:29.222Z
   [junit4]   2> 143450 INFO  (zkConnectionManagerCallback-107-thread-1) [    ] o.a.s.c.c.ConnectionManager zkClient has connected
   [junit4]   2> 143510 INFO  (TEST-ShardSplitTest.testSplitShardWithRule-seed#[7D757E90F8BE0D14]) [    ] o.a.s.s.SolrDispatchFilter Loading solr.xml from SolrHome (not found in ZooKeeper)
   [junit4]   2> 143511 INFO  (TEST-ShardSplitTest.testSplitShardWithRule-seed#[7D757E90F8BE0D14]) [    ] o.a.s.c.SolrXmlConfig Loading container configuration from /home/jenkins/jenkins-slave/workspace/Lucene-Solr-Tests-master/solr/build/solr-core/test/J2/temp/solr.cloud.api.collections.ShardSplitTest_7D757E90F8BE0D14-001/shard-1-001/solr.xml
   [junit4]   2> 143613 INFO  (TEST-ShardSplitTest.testSplitShardWithRule-seed#[7D757E90F8BE0D14]) [    ] o.a.s.c.SolrXmlConfig Configuration parameter autoReplicaFailoverWorkLoopDelay is ignored
   [junit4]   2> 143613 INFO  (TEST-ShardSplitTest.testSplitShardWithRule-seed#[7D757E90F8BE0D14]) [    ] o.a.s.c.SolrXmlConfig Configuration parameter autoReplicaFailoverBadNodeExpiration is ignored
   [junit4]   2> 143615 INFO  (TEST-ShardSplitTest.testSplitShardWithRule-seed#[7D757E90F8BE0D14]) [    ] o.a.s.c.SolrXmlConfig MBean server found: com.sun.jmx.mbeanserver.JmxMBeanServer@367dc723, but no JMX reporters were configured - adding default JMX reporter.
   [junit4]   2> 143708 INFO  (TEST-ShardSplitTest.testSplitShardWithRule-seed#[7D757E90F8BE0D14]) [    ] o.a.s.c.ZkContainer Zookeeper client=127.0.0.1:42924/solr
   [junit4]   2> 143744 INFO  (OverseerCollectionConfigSetProcessor-72069802084335620-127.0.0.1:44044_r_xf-n_0000000000) [n:127.0.0.1:44044_r_xf    ] o.a.s.c.OverseerTaskQueue Response ZK path: /overseer/collection-queue-work/qnr-0000000002 doesn't exist.  Requestor may have disconnected from ZooKeeper
   [junit4]   2> 143794 INFO  (zkConnectionManagerCallback-111-thread-1) [    ] o.a.s.c.c.ConnectionManager zkClient has connected
   [junit4]   2> 143863 INFO  (zkConnectionManagerCallback-113-thread-1-processing-n:127.0.0.1:38452_r_xf) [n:127.0.0.1:38452_r_xf    ] o.a.s.c.c.ConnectionManager zkClient has connected
   [junit4]   2> 144034 INFO  (TEST-ShardSplitTest.testSplitShardWithRule-seed#[7D757E90F8BE0D14]) [n:127.0.0.1:38452_r_xf    ] o.a.s.c.c.ZkStateReader Updated live nodes from ZooKeeper... (0) -> (1)
   [junit4]   2> 144035 INFO  (TEST-ShardSplitTest.testSplitShardWithRule-seed#[7D757E90F8BE0D14]) [n:127.0.0.1:38452_r_xf    ] o.a.s.c.Overseer Overseer (id=null) closing
   [junit4]   2> 144037 INFO  (TEST-ShardSplitTest.testSplitShardWithRule-seed#[7D757E90F8BE0D14]) [n:127.0.0.1:38452_r_xf    ] o.a.s.c.ZkController Register node as live in ZooKeeper:/live_nodes/127.0.0.1:38452_r_xf
   [junit4]   2> 144118 INFO  (zkCallback-94-thread-1-processing-n:127.0.0.1:44044_r_xf) [n:127.0.0.1:44044_r_xf    ] o.a.s.c.c.ZkStateReader Updated live nodes from ZooKeeper... (1) -> (2)
   [junit4]   2> 144216 INFO  (zkCallback-104-thread-1) [    ] o.a.s.c.c.ZkStateReader Updated live nodes from ZooKeeper... (1) -> (2)
   [junit4]   2> 144341 INFO  (zkCallback-112-thread-1-processing-n:127.0.0.1:38452_r_xf) [n:127.0.0.1:38452_r_xf    ] o.a.s.c.c.ZkStateReader Updated live nodes from ZooKeeper... (1) -> (2)
   [junit4]   2> 144548 INFO  (TEST-ShardSplitTest.testSplitShardWithRule-seed#[7D757E90F8BE0D14]) [n:127.0.0.1:38452_r_xf    ] o.a.s.m.r.SolrJmxReporter JMX monitoring for 'solr.node' (registry 'solr.node') enabled at server: com.sun.jmx.mbeanserver.JmxMBeanServer@367dc723
   [junit4]   2> 144587 INFO  (TEST-ShardSplitTest.testSplitShardWithRule-seed#[7D757E90F8BE0D14]) [n:127.0.0.1:38452_r_xf    ] o.a.s.m.r.SolrJmxReporter JMX monitoring for 'solr.jvm' (registry 'solr.jvm') enabled at server: com.sun.jmx.mbeanserver.JmxMBeanServer@367dc723
   [junit4]   2> 144588 INFO  (TEST-ShardSplitTest.testSplitShardWithRule-seed#[7D757E90F8BE0D14]) [n:127.0.0.1:38452_r_xf    ] o.a.s.m.r.SolrJmxReporter JMX monitoring for 'solr.jetty' (registry 'solr.jetty') enabled at server: com.sun.jmx.mbeanserver.JmxMBeanServer@367dc723
   [junit4]   2> 144604 INFO  (TEST-ShardSplitTest.testSplitShardWithRule-seed#[7D757E90F8BE0D14]) [n:127.0.0.1:38452_r_xf    ] o.a.s.c.CorePropertiesLocator Found 0 core definitions underneath /home/jenkins/jenkins-slave/workspace/Lucene-Solr-Tests-master/solr/build/solr-core/test/J2/../../../../../../../../../../home/jenkins/jenkins-slave/workspace/Lucene-Solr-Tests-master/solr/build/solr-core/test/J2/temp/solr.cloud.api.collections.ShardSplitTest_7D757E90F8BE0D14-001/shard-1-001/cores
   [junit4]   2> 144922 INFO  (qtp795736388-519) [n:127.0.0.1:38452_r_xf    ] o.a.s.h.a.CollectionsHandler Invoked Collection Action :addreplica with params node=127.0.0.1:38452_r_xf&action=ADDREPLICA&collection=collection1&shard=shard2&type=TLOG&wt=javabin&version=2 and sendToOCPQueue=true
   [junit4]   2> 145061 INFO  (OverseerThreadFactory-141-thread-3-processing-n:127.0.0.1:44044_r_xf) [n:127.0.0.1:44044_r_xf    ] o.a.s.c.a.c.AddReplicaCmd Node Identified 127.0.0.1:38452_r_xf for creating new replica
   [junit4]   2> 145081 INFO  (qtp795736388-523) [n:127.0.0.1:38452_r_xf    ] o.a.s.h.a.CoreAdminOperation core create command qt=/admin/cores&collection.configName=conf1&name=collection1_shard2_replica_t41&action=CREATE&collection=collection1&shard=shard2&wt=javabin&version=2&replicaType=TLOG
   [junit4]   2> 145081 INFO  (qtp795736388-523) [n:127.0.0.1:38452_r_xf    ] o.a.s.c.TransientSolrCoreCacheDefault Allocating transient cache for 4 transient cores
   [junit4]   2> 145099 INFO  (zkCallback-112-thread-1-processing-n:127.0.0.1:38452_r_xf) [n:127.0.0.1:38452_r_xf    ] o.a.s.c.c.ZkStateReader A cluster state change: [WatchedEvent state:SyncConnected type:NodeDataChanged path:/collections/collection1/state.json] for collection [collection1] has occurred - updating... (live nodes size: [2])
   [junit4]   2> 146213 INFO  (qtp795736388-523) [n:127.0.0.1:38452_r_xf c:collection1 s:shard2  x:collection1_shard2_replica_t41] o.a.s.c.SolrConfig Using Lucene MatchVersion: 8.0.0
   [junit4]   2> 146443 INFO  (qtp795736388-523) [n:127.0.0.1:38452_r_xf c:collection1 s:shard2  x:collection1_shard2_replica_t41] o.a.s.s.IndexSchema [collection1_shard2_replica_t41] Schema name=test
   [junit4]   2> 147269 INFO  (qtp795736388-523) [n:127.0.0.1:38452_r_xf c:collection1 s:shard2  x:collection1_shard2_replica_t41] o.a.s.s.IndexSchema Loaded schema test/1.6 with uniqueid field id
   [junit4]   2> 147522 INFO  (qtp795736388-523) [n:127.0.0.1:38452_r_xf c:collection1 s:shard2  x:collection1_shard2_replica_t41] o.a.s.c.CoreContainer Creating SolrCore 'collection1_shard2_replica_t41' using configuration from collection collection1, trusted=true
   [junit4]   2> 147522 INFO  (qtp795736388-523) [n:127.0.0.1:38452_r_xf c:collection1 s:shard2  x:collection1_shard2_replica_t41] o.a.s.m.r.SolrJmxReporter JMX monitoring for 'solr.core.collection1.shard2.replica_t41' (registry 'solr.core.collection1.shard2.replica_t41') enabled at server: com.sun.jmx.mbeanserver.JmxMBeanServer@367dc723
   [junit4]   2> 147522 INFO  (qtp795736388-523) [n:127.0.0.1:38452_r_xf c:collection1 s:shard2  x:collection1_shard2_replica_t41] o.a.s.c.SolrCore solr.RecoveryStrategy.Builder
   [junit4]   2> 147540 INFO  (qtp795736388-523) [n:127.0.0.1:38452_r_xf c:collection1 s:shard2  x:collection1_shard2_replica_t41] o.a.s.c.SolrCore [[collection1_shard2_replica_t41] ] Opening new SolrCore at [/home/jenkins/jenkins-slave/workspace/Lucene-Solr-Tests-master/solr/build/solr-core/test/J2/temp/solr.cloud.api.collections.ShardSplitTest_7D757E90F8BE0D14-001/shard-1-001/cores/collection1_shard2_replica_t41], dataDir=[/home/jenkins/jenkins-slave/workspace/Lucene-Solr-Tests-master/solr/build/solr-core/test/J2/../../../../../../../../../../home/jenkins/jenkins-slave/workspace/Lucene-Solr-Tests-master/solr/build/solr-core/test/J2/temp/solr.cloud.api.collections.ShardSplitTest_7D757E90F8BE0D14-001/shard-1-001/cores/collection1_shard2_replica_t41/data/]
   [junit4]   2> 147543 INFO  (qtp795736388-523) [n:127.0.0.1:38452_r_xf c:collection1 s:shard2  x:collection1_shard2_replica_t41] o.a.s.u.RandomMergePolicy RandomMergePolicy wrapping class org.apache.lucene.index.TieredMergePolicy: [TieredMergePolicy: maxMergeAtOnce=45, maxMergeAtOnceExplicit=12, maxMergedSegmentMB=20.3046875, floorSegmentMB=1.5849609375, forceMergeDeletesPctAllowed=25.297949433785103, segmentsPerTier=42.0, maxCFSSegmentSizeMB=8.796093022207999E12, noCFSRatio=1.0
   [junit4]   2> 147651 WARN  (qtp795736388-523) [n:127.0.0.1:38452_r_xf c:collection1 s:shard2  x:collection1_shard2_replica_t41] o.a.s.c.RequestHandlers INVALID paramSet a in requestHandler {type = requestHandler,name = /dump,class = DumpRequestHandler,attributes = {initParams=a, name=/dump, class=DumpRequestHandler},args = {defaults={a=A,b=B}}}
   [junit4]   2> 148014 INFO  (qtp795736388-523) [n:127.0.0.1:38452_r_xf c:collection1 s:shard2  x:collection1_shard2_replica_t41] o.a.s.u.UpdateHandler Using UpdateLog implementation: org.apache.solr.update.UpdateLog
   [junit4]   2> 148014 INFO  (qtp795736388-523) [n:127.0.0.1:38452_r_xf c:collection1 s:shard2  x:collection1_shard2_replica_t41] o.a.s.u.UpdateLog Initializing UpdateLog: dataDir= defaultSyncLevel=FLUSH numRecordsToKeep=100 maxNumLogsToKeep=10 numVersionBuckets=65536
   [junit4]   2> 148015 INFO  (qtp795736388-523) [n:127.0.0.1:38452_r_xf c:collection1 s:shard2  x:collection1_shard2_replica_t41] o.a.s.u.CommitTracker Hard AutoCommit: disabled
   [junit4]   2> 148015 INFO  (qtp795736388-523) [n:127.0.0.1:38452_r_xf c:collection1 s:shard2  x:collection1_shard2_replica_t41] o.a.s.u.CommitTracker Soft AutoCommit: disabled
   [junit4]   2> 148017 INFO  (qtp795736388-523) [n:127.0.0.1:38452_r_xf c:collection1 s:shard2  x:collection1_shard2_replica_t41] o.a.s.u.RandomMergePolicy RandomMergePolicy wrapping class org.apache.lucene.index.TieredMergePolicy: [TieredMergePolicy: maxMergeAtOnce=28, maxMergeAtOnceExplicit=15, maxMergedSegmentMB=55.26953125, floorSegmentMB=1.7734375, forceMergeDeletesPctAllowed=9.0423274225675, segmentsPerTier=33.0, maxCFSSegmentSizeMB=8.796093022207999E12, noCFSRatio=0.2771342467784269
   [junit4]   2> 148051 INFO  (qtp795736388-523) [n:127.0.0.1:38452_r_xf c:collection1 s:shard2  x:collection1_shard2_replica_t41] o.a.s.s.SolrIndexSearcher Opening [Searcher@31a5c882[collection1_shard2_replica_t41] main]
   [junit4]   2> 148052 INFO  (qtp795736388-523) [n:127.0.0.1:38452_r_xf c:collection1 s:shard2  x:collection1_shard2_replica_t41] o.a.s.r.ManagedResourceStorage Configured ZooKeeperStorageIO with znodeBase: /configs/conf1
   [junit4]   2> 148052 INFO  (qtp795736388-523) [n:127.0.0.1:38452_r_xf c:collection1 s:shard2  x:collection1_shard2_replica_t41] o.a.s.r.ManagedResourceStorage Loaded null at path _rest_managed.json using ZooKeeperStorageIO:path=/configs/conf1
   [junit4]   2> 148053 INFO  (qtp795736388-523) [n:127.0.0.1:38452_r_xf c:collection1 s:shard2  x:collection1_shard2_replica_t41] o.a.s.h.ReplicationHandler Commits will be reserved for 10000ms.
   [junit4]   2> 148068 INFO  (searcherExecutor-155-thread-1-processing-n:127.0.0.1:38452_r_xf x:collection1_shard2_replica_t41 s:shard2 c:collection1) [n:127.0.0.1:38452_r_xf c:collection1 s:shard2  x:collection1_shard2_replica_t41] o.a.s.c.SolrCore [collection1_shard2_replica_t41] Registered new searcher Searcher@31a5c882[collection1_shard2_replica_t41] main{ExitableDirectoryReader(UninvertingDirectoryReader())}
   [junit4]   2> 148068 INFO  (qtp795736388-523) [n:127.0.0.1:38452_r_xf c:collection1 s:shard2  x:collection1_shard2_replica_t41] o.a.s.u.UpdateLog Could not find max version in index or recent updates, using new clock 1591579921743872000
   [junit4]   2> 148107 INFO  (qtp795736388-523) [n:127.0.0.1:38452_r_xf c:collection1 s:shard2  x:collection1_shard2_replica_t41] o.a.s.c.ShardLeaderElectionContext Enough replicas found to continue.
   [junit4]   2> 148107 INFO  (qtp795736388-523) [n:127.0.0.1:38452_r_xf c:collection1 s:shard2  x:collection1_shard2_replica_t41] o.a.s.c.ShardLeaderElectionContext I may be the new leader - try and sync
   [junit4]   2> 148107 INFO  (qtp795736388-523) [n:127.0.0.1:38452_r_xf c:collection1 s:shard2  x:collection1_shard2_replica_t41] o.a.s.c.SyncStrategy Sync replicas to http://127.0.0.1:38452/r_xf/collection1_shard2_replica_t41/
   [junit4]   2> 148107 INFO  (qtp795736388-523) [n:127.0.0.1:38452_r_xf c:collection1 s:shard2  x:collection1_shard2_replica_t41] o.a.s.c.SyncStrategy Sync Success - now sync replicas to me
   [junit4]   2> 148107 INFO  (qtp795736388-523) [n:127.0.0.1:38452_r_xf c:collection1 s:shard2  x:collection1_shard2_replica_t41] o.a.s.c.SyncStrategy http://127.0.0.1:38452/r_xf/collection1_shard2_replica_t41/ has no replicas
   [junit4]   2> 148107 INFO  (qtp795736388-523) [n:127.0.0.1:38452_r_xf c:collection1 s:shard2  x:collection1_shard2_replica_t41] o.a.s.c.ShardLeaderElectionContext Found all replicas participating in election, clear LIR
   [junit4]   2> 148107 INFO  (qtp795736388-523) [n:127.0.0.1:38452_r_xf c:collection1 s:shard2  x:collection1_shard2_replica_t41] o.a.s.c.ZkController collection1_shard2_replica_t41 stopping background replication from leader
   [junit4]   2> 148125 INFO  (qtp795736388-523) [n:127.0.0.1:38452_r_xf c:collection1 s:shard2  x:collection1_shard2_replica_t41] o.a.s.c.ShardLeaderElectionContext I am the new leader: http://127.0.0.1:38452/r_xf/collection1_shard2_replica_t41/ shard2
   [junit4]   2> 148141 INFO  (zkCallback-112-thread-1-processing-n:127.0.0.1:38452_r_xf) [n:127.0.0.1:38452_r_xf    ] o.a.s.c.c.ZkStateReader A cluster state change: [WatchedEvent state:SyncConnected type:NodeDataChanged path:/collections/collection1/state.json] for collection [collection1] has occurred - updating... (live nodes size: [2])
   [junit4]   2> 148176 INFO  (qtp795736388-523) [n:127.0.0.1:38452_r_xf c:collection1 s:shard2  x:collection1_shard2_replica_t41] o.a.s.c.ZkController I am the leader, no recovery necessary
   [junit4]   2> 148178 INFO  (qtp795736388-523) [n:127.0.0.1:38452_r_xf c:collection1 s:shard2  x:collection1_shard2_replica_t41] o.a.s.s.HttpSolrCall [admin] webapp=null path=/admin/cores params={qt=/admin/cores&collection.configName=conf1&name=collection1_shard2_replica_t41&action=CREATE&collection=collection1&shard=shard2&wt=javabin&version=2&replicaType=TLOG} status=0 QTime=3097
   [junit4]   2> 148214 INFO  (qtp795736388-519) [n:127.0.0.1:38452_r_xf    ] o.a.s.s.HttpSolrCall [admin] webapp=null path=/admin/collections params={node=127.0.0.1:38452_r_xf&action=ADDREPLICA&collection=collection1&shard=shard2&type=TLOG&wt=javabin&version=2} status=0 QTime=3292
   [junit4]   2> 148302 INFO  (zkCallback-112-thread-1-processing-n:127.0.0.1:38452_r_xf) [n:127.0.0.1:38452_r_xf    ] o.a.s.c.c.ZkStateReader A cluster state change: [WatchedEvent state:SyncConnected type:NodeDataChanged path:/collections/collection1/state.json] for collection [collection1] has occurred - updating... (live nodes size: [2])
   [junit4]   2> 149036 INFO  (OverseerCollectionConfigSetProcessor-72069802084335620-127.0.0.1:44044_r_xf-n_0000000000) [n:127.0.0.1:44044_r_xf    ] o.a.s.c.OverseerTaskQueue Response ZK path: /overseer/collection-queue-work/qnr-0000000004 doesn't exist.  Requestor may have disconnected from ZooKeeper
   [junit4]   2> 149450 INFO  (TEST-ShardSplitTest.testSplitShardWithRule-seed#[7D757E90F8BE0D14]) [    ] o.a.s.c.AbstractFullDistribZkTestBase create jetty 2 in directory /home/jenkins/jenkins-slave/workspace/Lucene-Solr-Tests-master/solr/build/solr-core/test/J2/temp/solr.cloud.api.collections.ShardSplitTest_7D757E90F8BE0D14-001/shard-2-001 of type TLOG
   [junit4]   2> 149471 INFO  (TEST-ShardSplitTest.testSplitShardWithRule-seed#[7D757E90F8BE0D14]) [    ] o.e.j.s.Server jetty-9.4.8.v20171121, build timestamp: 2017-11-22T05:27:37+08:00, git hash: 82b8fb23f757335bb3329d540ce37a2a2615f0a8
   [junit4]   2> 149522 INFO  (TEST-ShardSplitTest.testSplitShardWithRule-seed#[7D757E90F8BE0D14]) [    ] o.e.j.s.session DefaultSessionIdManager workerName=node0
   [junit4]   2> 149522 INFO  (TEST-ShardSplitTest.testSplitShardWithRule-seed#[7D757E90F8BE0D14]) [    ] o.e.j.s.session No SessionScavenger set, using defaults
   [junit4]   2> 149522 INFO  (TEST-ShardSplitTest.testSplitShardWithRule-seed#[7D757E90F8BE0D14]) [    ] o.e.j.s.session Scavenging every 600000ms
   [junit4]   2> 149523 INFO  (TEST-ShardSplitTest.testSplitShardWithRule-seed#[7D757E90F8BE0D14]) [    ] o.e.j.s.h.ContextHandler Started o.e.j.s.ServletContextHandler@37d7e15c{/r_xf,null,AVAILABLE}
   [junit4]   2> 149523 INFO  (TEST-ShardSplitTest.testSplitShardWithRule-seed#[7D757E90F8BE0D14]) [    ] o.e.j.s.AbstractConnector Started ServerConnector@719a0672{HTTP/1.1,[http/1.1]}{127.0.0.1:39504}
   [junit4]   2> 149523 INFO  (TEST-ShardSplitTest.testSplitShardWithRule-seed#[7D757E90F8BE0D14]) [    ] o.e.j.s.Server Started @161757ms
   [junit4]   2> 149524 INFO  (TEST-ShardSplitTest.testSplitShardWithRule-seed#[7D757E90F8BE0D14]) [    ] o.a.s.c.s.e.JettySolrRunner Jetty properties: {solr.data.dir=/home/jenkins/jenkins-slave/workspace/Lucene-Solr-Tests-master/solr/build/solr-core/test/J2/temp/solr.cloud.api.collections.ShardSplitTest_7D757E90F8BE0D14-001/tempDir-001/jetty2, replicaType=TLOG, solrconfig=solrconfig.xml, hostContext=/r_xf, hostPort=39504, coreRootDirectory=/home/jenkins/jenkins-slave/workspace/Lucene-Solr-Tests-master/solr/build/solr-core/test/J2/../../../../../../../../../../home/jenkins/jenkins-slave/workspace/Lucene-Solr-Tests-master/solr/build/solr-core/test/J2/temp/solr.cloud.api.collections.ShardSplitTest_7D757E90F8BE0D14-001/shard-2-001/cores}
   [junit4]   2> 149524 ERROR (TEST-ShardSplitTest.testSplitShardWithRule-seed#[7D757E90F8BE0D14]) [    ] o.a.s.u.StartupLoggingUtils Missing Java Option solr.log.dir. Logging may be missing or incomplete.
   [junit4]   2> 149535 INFO  (TEST-ShardSplitTest.testSplitShardWithRule-seed#[7D757E90F8BE0D14]) [    ] o.a.s.s.SolrDispatchFilter  ___      _       Welcome to Apache Solr™ version 8.0.0
   [junit4]   2> 149535 INFO  (TEST-ShardSplitTest.testSplitShardWithRule-seed#[7D757E90F8BE0D14]) [    ] o.a.s.s.SolrDispatchFilter / __| ___| |_ _   Starting in cloud mode on port null
   [junit4]   2> 149535 INFO  (TEST-ShardSplitTest.testSplitShardWithRule-seed#[7D757E90F8BE0D14]) [    ] o.a.s.s.SolrDispatchFilter \__ \/ _ \ | '_|  Install dir: null
   [junit4]   2> 149535 INFO  (TEST-ShardSplitTest.testSplitShardWithRule-seed#[7D757E90F8BE0D14]) [    ] o.a.s.s.SolrDispatchFilter |___/\___/_|_|    Start time: 2018-02-05T16:41:35.342Z
   [junit4]   2> 149595 INFO  (zkConnectionManagerCallback-117-thread-1) [    ] o.a.s.c.c.ConnectionManager zkClient has connected
   [junit4]   2> 149619 INFO  (TEST-ShardSplitTest.testSplitShardWithRule-seed#[7D757E90F8BE0D14]) [    ] o.a.s.s.SolrDispatchFilter Loading solr.xml from SolrHome (not found in ZooKeeper)
   [junit4]   2> 149619 INFO  (TEST-ShardSplitTest.testSplitShardWithRule-seed#[7D757E90F8BE0D14]) [    ] o.a.s.c.SolrXmlConfig Loading container configuration from /home/jenkins/jenkins-slave/workspace/Lucene-Solr-Tests-master/solr/build/solr-core/test/J2/temp/solr.cloud.api.collections.ShardSplitTest_7D757E90F8BE0D14-001/shard-2-001/solr.xml
   [junit4]   2> 149623 INFO  (TEST-ShardSplitTest.testSplitShardWithRule-seed#[7D757E90F8BE0D14]) [    ] o.a.s.c.SolrXmlConfig Configuration parameter autoReplicaFailoverWorkLoopDelay is ignored
   [junit4]   2> 149623 INFO  (TEST-ShardSplitTest.testSplitShardWithRule-seed#[7D757E90F8BE0D14]) [    ] o.a.s.c.SolrXmlConfig Configuration parameter autoReplicaFailoverBadNodeExpiration is ignored
   [junit4]   2> 149638 INFO  (TEST-ShardSplitTest.testSplitShardWithRule-seed#[7D757E90F8BE0D14]) [    ] o.a.s.c.SolrXmlConfig MBean server found: com.sun.jmx.mbeanserver.JmxMBeanServer@367dc723, but no JMX reporters were configured - adding default JMX reporter.
   [junit4]   2> 149746 INFO  (TEST-ShardSplitTest.testSplitShardWithRule-seed#[7D757E90F8BE0D14]) [    ] o.a.s.c.ZkContainer Zookeeper client=127.0.0.1:42924/solr
   [junit4]   2> 149895 INFO  (zkConnectionManagerCallback-121-thread-1) [    ] o.a.s.c.c.ConnectionManager zkClient has connected
   [junit4]   2> 150163 INFO  (zkConnectionManagerCallback-123-thread-1-processing-n:127.0.0.1:39504_r_xf) [n:127.0.0.1:39504_r_xf    ] o.a.s.c.c.ConnectionManager zkClient has connected
   [junit4]   2> 150203 INFO  (TEST-ShardSplitTest.testSplitShardWithRule-seed#[7D757E90F8BE0D14]) [n:127.0.0.1:39504_r_xf    ] o.a.s.c.c.ZkStateReader Updated live nodes from ZooKeeper... (0) -> (2)
   [junit4]   2> 150217 INFO  (TEST-ShardSplitTest.testSplitShardWithRule-seed#[7D757E90F8BE0D14]) [n:127.0.0.1:39504_r_xf    ] o.a.s.c.Overseer Overseer (id=null) closing
   [junit4]   2> 150218 INFO  (TEST-ShardSplitTest.testSplitShardWithRule-seed#[7D757E90F8BE0D14]) [n:127.0.0.1:39504_r_xf    ] o.a.s.c.ZkController Register node as live in ZooKeeper:/live_nodes/127.0.0.1:39504_r_xf
   [junit4]   2> 150253 INFO  (zkCallback-104-thread-1) [    ] o.a.s.c.c.ZkStateReader Updated live nodes from ZooKeeper... (2) -> (3)
   [junit4]   2> 150253 INFO  (zkCallback-94-thread-2-processing-n:127.0.0.1:44044_r_xf) [n:127.0.0.1:44044_r_xf    ] o.a.s.c.c.ZkStateReader Updated live nodes from ZooKeeper... (2) -> (3)
   [junit4]   2> 150288 INFO  (zkCallback-122-thread-1-processing-n:127.0.0.1:39504_r_xf) [n:127.0.0.1:39504_r_xf    ] o.a.s.c.c.ZkStateReader Updated live nodes from ZooKeeper... (2) -> (3)
   [junit4]   2> 150301 INFO  (zkCallback-112-thread-1-processing-n:127.0.0.1:38452_r_xf) [n:127.0.0.1:38452_r_xf    ] o.a.s.c.c.ZkStateReader Updated live nodes from ZooKeeper... (2) -> (3)
   [junit4]   2> 150493 INFO  (TEST-ShardSplitTest.testSplitShardWithRule-seed#[7D757E90F8BE0D14]) [n:127.0.0.1:39504_r_xf    ] o.a.s.m.r.SolrJmxReporter JMX monitoring for 'solr.node' (registry 'solr.node') enabled at server: com.sun.jmx.mbeanserver.JmxMBeanServer@367dc723
   [junit4]   2> 150531 INFO  (TEST-ShardSplitTest.testSplitShardWithRule-seed#[7D757E90F8BE0D14]) [n:127.0.0.1:39504_r_xf    ] o.a.s.m.r.SolrJmxReporter JMX monitoring for 'solr.jvm' (registry 'solr.jvm') enabled at server: com.sun.jmx.mbeanserver.JmxMBeanServer@367dc723
   [junit4]   2> 150531 INFO  (TEST-ShardSplitTest.testSplitShardWithRule-seed#[7D757E90F8BE0D14]) [n:127.0.0.1:39504_r_xf    ] o.a.s.m.r.SolrJmxReporter JMX monitoring for 'solr.jetty' (registry 'solr.jetty') enabled at server: com.sun.jmx.mbeanserver.JmxMBeanServer@367dc723
   [junit4]   2> 150545 INFO  (TEST-ShardSplitTest.testSplitShardWithRule-seed#[7D757E90F8BE0D14]) [n:127.0.0.1:39504_r_xf    ] o.a.s.c.CorePropertiesLocator Found 0 core definitions underneath /home/jenkins/jenkins-slave/workspace/Lucene-Solr-Tests-master/solr/build/solr-core/test/J2/../../../../../../../../../../home/jenkins/jenkins-slave/workspace/Lucene-Solr-Tests-master/solr/build/solr-core/test/J2/temp/solr.cloud.api.collections.ShardSplitTest_7D757E90F8BE0D14-001/shard-2-001/cores
   [junit4]   2> 150938 INFO  (qtp795736388-521) [n:127.0.0.1:38452_r_xf    ] o.a.s.h.a.CollectionsHandler Invoked Collection Action :addreplica with params node=127.0.0.1:39504_r_xf&action=ADDREPLICA&collection=collection1&shard=shard1&type=TLOG&wt=javabin&version=2 and sendToOCPQueue=true
   [junit4]   2> 151083 INFO  (OverseerThreadFactory-141-thread-4-processing-n:127.0.0.1:44044_r_xf) [n:127.0.0.1:44044_r_xf    ] o.a.s.c.a.c.AddReplicaCmd Node Identified 127.0.0.1:39504_r_xf for creating new replica
   [junit4]   2> 151263 INFO  (qtp875745578-552) [n:127.0.0.1:39504_r_xf    ] o.a.s.h.a.CoreAdminOperation core create command qt=/admin/cores&collection.configName=conf1&name=collection1_shard1_replica_t43&action=CREATE&collection=collection1&shard=shard1&wt=javabin&version=2&replicaType=TLOG
   [junit4]   2> 151263 INFO  (qtp875745578-552) [n:127.0.0.1:39504_r_xf    ] o.a.s.c.TransientSolrCoreCacheDefault Allocating transient cache for 4 transient cores
   [junit4]   2> 151321 INFO  (zkCallback-112-thread-1-processing-n:127.0.0.1:38452_r_xf) [n:127.0.0.1:38452_r_xf    ] o.a.s.c.c.ZkStateReader A cluster state change: [WatchedEvent state:SyncConnected type:NodeDataChanged path:/collections/collection1/state.json] for collection [collection1] has occurred - updating... (live nodes size: [3])
   [junit4]   2> 151704 INFO  (qtp875745578-552) [n:127.0.0.1:39504_r_xf c:collection1 s:shard1  x:collection1_shard1_replica_t43] o.a.s.c.SolrConfig Using Lucene MatchVersion: 8.0.0
   [junit4]   2> 151851 INFO  (qtp875745578-552) [n:127.0.0.1:39504_r_xf c:collection1 s:shard1  x:collection1_shard1_replica_t43] o.a.s.s.IndexSchema [collection1_shard1_replica_t43] Schema name=test
   [junit4]   2> 152633 INFO  (qtp875745578-552) [n:127.0.0.1:39504_r_xf c:collection1 s:shard1  x:collection1_shard1_replica_t43] o.a.s.s.IndexSchema Loaded schema test/1.6 with uniqueid field id
   [junit4]   2> 152728 INFO  (qtp875745578-552) [n:127.0.0.1:39504_r_xf c:collection1 s:shard1  x:collection1_shard1_replica_t43] o.a.s.c.CoreContainer Creating SolrCore 'collection1_shard1_replica_t43' using configuration from collection collection1, trusted=true
   [junit4]   2> 152728 INFO  (qtp875745578-552) [n:127.0.0.1:39504_r_xf c:collection1 s:shard1  x:collection1_shard1_replica_t43] o.a.s.m.r.SolrJmxReporter JMX monitoring for 'solr.core.collection1.shard1.replica_t43' (registry 'solr.core.collection1.shard1.replica_t43') enabled at server: com.sun.jmx.mbeanserver.JmxMBeanServer@367dc723
   [junit4]   2> 152729 INFO  (qtp875745578-552) [n:127.0.0.1:39504_r_xf c:collection1 s:shard1  x:collection1_shard1_replica_t43] o.a.s.c.SolrCore solr.RecoveryStrategy.Builder
   [junit4]   2> 152729 INFO  (qtp875745578-552) [n:127.0.0.1:39504_r_xf c:collection1 s:shard1  x:collection1_shard1_replica_t43] o.a.s.c.SolrCore [[collection1_shard1_replica_t43] ] Opening new SolrCore at [/home/jenkins/jenkins-slave/workspace/Lucene-Solr-Tests-master/solr/build/solr-core/test/J2/temp/solr.cloud.api.collections.ShardSplitTest_7D757E90F8BE0D14-001/shard-2-001/cores/collection1_shard1_replica_t43], dataDir=[/home/jenkins/jenkins-slave/workspace/Lucene-Solr-Tests-master/solr/build/solr-core/test/J2/../../../../../../../../../../home/jenkins/jenkins-slave/workspace/Lucene-Solr-Tests-master/solr/build/solr-core/test/J2/temp/solr.cloud.api.collections.ShardSplitTest_7D757E90F8BE0D14-001/shard-2-001/cores/collection1_shard1_replica_t43/data/]
   [junit4]   2> 152744 INFO  (qtp875745578-552) [n:127.0.0.1:39504_r_xf c:collection1 s:shard1  x:collection1_shard1_replica_t43] o.a.s.u.RandomMergePolicy RandomMergePolicy wrapping class org.apache.lucene.index.TieredMergePolicy: [TieredMergePolicy: maxMergeAtOnce=45, maxMergeAtOnceExplicit=12, maxMergedSegmentMB=20.3046875, floorSegmentMB=1.5849609375, forceMergeDeletesPctAllowed=25.297949433785103, segmentsPerTier=42.0, maxCFSSegmentSizeMB=8.796093022207999E12, noCFSRatio=1.0
   [junit4]   2> 152971 WARN  (qtp875745578-552) [n:127.0.0.1:39504_r_xf c:collection1 s:shard1  x:collection1_shard1_replica_t43] o.a.s.c.RequestHandlers INVALID paramSet a in requestHandler {type = requestHandler,name = /dump,class = DumpRequestHandler,attributes = {initParams=a, name=/dump, class=DumpRequestHandler},args = {defaults={a=A,b=B}}}
   [junit4]   2> 153264 INFO  (qtp875745578-552) [n:127.0.0.1:39504_r_xf c:collection1 s:shard1  x:collection1_shard1_replica_t43] o.a.s.u.UpdateHandler Using UpdateLog implementation: org.apache.solr.update.UpdateLog
   [junit4]   2> 153264 INFO  (qtp875745578-552) [n:127.0.0.1:39504_r_xf c:collection1 s:shard1  x:collection1_shard1_replica_t43] o.a.s.u.UpdateLog Initializing UpdateLog: dataDir= defaultSyncLevel=FLUSH numRecordsToKeep=100 maxNumLogsToKeep=10 numVersionBuckets=65536
   [junit4]   2> 153277 INFO  (qtp875745578-552) [n:127.0.0.1:39504_r_xf c:collection1 s:shard1  x:collection1_shard1_replica_t43] o.a.s.u.CommitTracker Hard AutoCommit: disabled
   [junit4]   2> 153277 INFO  (qtp875745578-552) [n:127.0.0.1:39504_r_xf c:collection1 s:shard1  x:collection1_shard1_replica_t43] o.a.s.u.CommitTracker Soft AutoCommit: disabled
   [junit4]   2> 153278 INFO  (qtp875745578-552) [n:127.0.0.1:39504_r_xf c:collection1 s:shard1  x:collection1_shard1_replica_t43] o.a.s.u.RandomMergePolicy RandomMergePolicy wrapping class org.apache.lucene.index.TieredMergePolicy: [TieredMergePolicy: maxMergeAtOnce=28, maxMergeAtOnceExplicit=15, maxMergedSegmentMB=55.26953125, floorSegmentMB=1.7734375, forceMergeDeletesPctAllowed=9.0423274225675, segmentsPerTier=33.0, maxCFSSegmentSizeMB=8.796093022207999E12, noCFSRatio=0.2771342467784269
   [junit4]   2> 153313 INFO  (qtp875745578-552) [n:127.0.0.1:39504_r_xf c:collection1 s:shard1  x:collection1_shard1_replica_t43] o.a.s.s.SolrIndexSearcher Opening [Searcher@54c5e77e[collection1_shard1_replica_t43] main]
   [junit4]   2> 153504 INFO  (qtp875745578-552) [n:127.0.0.1:39504_r_xf c:collection1 s:shard1  x:collection1_shard1_replica_t43] o.a.s.r.ManagedResourceStorage Configured ZooKeeperStorageIO with znodeBase: /configs/conf1
   [junit4]   2> 153540 INFO  (qtp875745578-552) [n:127.0.0.1:39504_r_xf c:collection1 s:shard1  x:collection1_shard1_replica_t43] o.a.s.r.ManagedResourceStorage Loaded null at path _rest_managed.json using ZooKeeperStorageIO:path=/configs/conf1
   [junit4]   2> 153541 INFO  (qtp875745578-552) [n:127.0.0.1:39504_r_xf c:collection1 s:shard1  x:collection1_shard1_replica_t43] o.a.s.h.ReplicationHandler Commits will be reserved for 10000ms.
   [junit4]   2> 153541 INFO  (qtp875745578-552) [n:127.0.0.1:39504_r_xf c:collection1 s:shard1  x:collection1_shard1_replica_t43] o.a.s.u.UpdateLog Could not find max version in index or recent updates, using new clock 1591579927482728448
   [junit4]   2> 153595 INFO  (searcherExecutor-166-thread-1-processing-n:127.0.0.1:39504_r_xf x

[...truncated too long message...]

porters for registry=solr.jetty, tag=null
   [junit4]   2> 80069 INFO  (coreCloseExecutor-170-thread-1) [    x:collection1] o.a.s.c.SolrCore [collection1]  CLOSING SolrCore org.apache.solr.core.SolrCore@36ea5b1b
   [junit4]   2> 80069 INFO  (coreCloseExecutor-170-thread-1) [    x:collection1] o.a.s.m.SolrMetricManager Closing metric reporters for registry=solr.core.collection1, tag=921328411
   [junit4]   2> 80098 INFO  (SUITE-TestModelManagerPersistence-seed#[8E983D4F108CA92A]-worker) [    ] o.e.j.s.h.ContextHandler Stopped o.e.j.s.ServletContextHandler@a0a124f{/solr,null,UNAVAILABLE}
   [junit4]   2> 80098 INFO  (SUITE-TestModelManagerPersistence-seed#[8E983D4F108CA92A]-worker) [    ] o.e.j.s.session Stopped scavenging
   [junit4]   2> 80098 INFO  (SUITE-TestModelManagerPersistence-seed#[8E983D4F108CA92A]-worker) [    ] o.a.s.SolrTestCaseJ4 ###deleteCore
   [junit4]   2> 80098 INFO  (SUITE-TestModelManagerPersistence-seed#[8E983D4F108CA92A]-worker) [    ] o.a.s.c.CoreContainer Shutting down CoreContainer instance=86294718
   [junit4]   2> 80098 INFO  (SUITE-TestModelManagerPersistence-seed#[8E983D4F108CA92A]-worker) [    ] o.a.s.m.SolrMetricManager Closing metric reporters for registry=solr.node, tag=null
   [junit4]   2> 80098 INFO  (SUITE-TestModelManagerPersistence-seed#[8E983D4F108CA92A]-worker) [    ] o.a.s.m.r.SolrJmxReporter Closing reporter [org.apache.solr.metrics.reporters.SolrJmxReporter@7bb2904d: rootName = null, domain = solr.node, service url = null, agent id = null] for registry solr.node / null
   [junit4]   2> 80099 INFO  (SUITE-TestModelManagerPersistence-seed#[8E983D4F108CA92A]-worker) [    ] o.a.s.m.SolrMetricManager Closing metric reporters for registry=solr.jvm, tag=null
   [junit4]   2> 80099 INFO  (SUITE-TestModelManagerPersistence-seed#[8E983D4F108CA92A]-worker) [    ] o.a.s.m.r.SolrJmxReporter Closing reporter [org.apache.solr.metrics.reporters.SolrJmxReporter@6f125428: rootName = null, domain = solr.jvm, service url = null, agent id = null] for registry solr.jvm / null
   [junit4]   2> 80099 INFO  (SUITE-TestModelManagerPersistence-seed#[8E983D4F108CA92A]-worker) [    ] o.a.s.m.SolrMetricManager Closing metric reporters for registry=solr.jetty, tag=null
   [junit4]   2> 80099 INFO  (SUITE-TestModelManagerPersistence-seed#[8E983D4F108CA92A]-worker) [    ] o.a.s.m.r.SolrJmxReporter Closing reporter [org.apache.solr.metrics.reporters.SolrJmxReporter@339122d1: rootName = null, domain = solr.jetty, service url = null, agent id = null] for registry solr.jetty / null
   [junit4]   2> 80099 INFO  (coreCloseExecutor-172-thread-1) [    x:collection1] o.a.s.c.SolrCore [collection1]  CLOSING SolrCore org.apache.solr.core.SolrCore@3304266c
   [junit4]   2> 80100 INFO  (coreCloseExecutor-172-thread-1) [    x:collection1] o.a.s.m.SolrMetricManager Closing metric reporters for registry=solr.core.collection1, tag=855909996
   [junit4]   2> 80100 INFO  (coreCloseExecutor-172-thread-1) [    x:collection1] o.a.s.m.r.SolrJmxReporter Closing reporter [org.apache.solr.metrics.reporters.SolrJmxReporter@35065ff3: rootName = null, domain = solr.core.collection1, service url = null, agent id = null] for registry solr.core.collection1 / null
   [junit4]   2> 80102 INFO  (SUITE-TestModelManagerPersistence-seed#[8E983D4F108CA92A]-worker) [    ] o.a.s.SolrTestCaseJ4 ------------------------------------------------------- Done waiting for tracked resources to be released
   [junit4]   2> Feb 05, 2018 6:16:28 PM com.carrotsearch.randomizedtesting.ThreadLeakControl checkThreadLeaks
   [junit4]   2> WARNING: Will linger awaiting termination of 1 leaked thread(s).
   [junit4]   2> Feb 05, 2018 6:16:48 PM com.carrotsearch.randomizedtesting.ThreadLeakControl checkThreadLeaks
   [junit4]   2> SEVERE: 1 thread leaked from SUITE scope at org.apache.solr.ltr.store.rest.TestModelManagerPersistence: 
   [junit4]   2>    1) Thread[id=159, name=qtp2034504500-159, state=TIMED_WAITING, group=TGRP-TestModelManagerPersistence]
   [junit4]   2>         at sun.misc.Unsafe.park(Native Method)
   [junit4]   2>         at java.util.concurrent.locks.LockSupport.parkNanos(LockSupport.java:215)
   [junit4]   2>         at java.util.concurrent.locks.AbstractQueuedSynchronizer$ConditionObject.await(AbstractQueuedSynchronizer.java:2163)
   [junit4]   2>         at org.eclipse.jetty.util.thread.ReservedThreadExecutor$ReservedThread.reservedWait(ReservedThreadExecutor.java:308)
   [junit4]   2>         at org.eclipse.jetty.util.thread.ReservedThreadExecutor$ReservedThread.run(ReservedThreadExecutor.java:373)
   [junit4]   2>         at org.eclipse.jetty.util.thread.QueuedThreadPool.runJob(QueuedThreadPool.java:708)
   [junit4]   2>         at org.eclipse.jetty.util.thread.QueuedThreadPool$2.run(QueuedThreadPool.java:626)
   [junit4]   2>         at java.lang.Thread.run(Thread.java:748)
   [junit4]   2> Feb 05, 2018 6:16:48 PM com.carrotsearch.randomizedtesting.ThreadLeakControl tryToInterruptAll
   [junit4]   2> INFO: Starting to interrupt leaked threads:
   [junit4]   2>    1) Thread[id=159, name=qtp2034504500-159, state=TIMED_WAITING, group=TGRP-TestModelManagerPersistence]
   [junit4]   2> Feb 05, 2018 6:16:51 PM com.carrotsearch.randomizedtesting.ThreadLeakControl tryToInterruptAll
   [junit4]   2> SEVERE: There are still zombie threads that couldn't be terminated:
   [junit4]   2>    1) Thread[id=159, name=qtp2034504500-159, state=TIMED_WAITING, group=TGRP-TestModelManagerPersistence]
   [junit4]   2>         at sun.misc.Unsafe.park(Native Method)
   [junit4]   2>         at java.util.concurrent.locks.LockSupport.parkNanos(LockSupport.java:215)
   [junit4]   2>         at java.util.concurrent.locks.AbstractQueuedSynchronizer$ConditionObject.await(AbstractQueuedSynchronizer.java:2163)
   [junit4]   2>         at org.eclipse.jetty.util.thread.ReservedThreadExecutor$ReservedThread.reservedWait(ReservedThreadExecutor.java:308)
   [junit4]   2>         at org.eclipse.jetty.util.thread.ReservedThreadExecutor$ReservedThread.run(ReservedThreadExecutor.java:373)
   [junit4]   2>         at org.eclipse.jetty.util.thread.QueuedThreadPool.runJob(QueuedThreadPool.java:708)
   [junit4]   2>         at org.eclipse.jetty.util.thread.QueuedThreadPool$2.run(QueuedThreadPool.java:626)
   [junit4]   2>         at java.lang.Thread.run(Thread.java:748)
   [junit4]   2> NOTE: test params are: codec=Asserting(Lucene70): {description=PostingsFormat(name=Memory), id=Lucene50(blocksize=128), text=PostingsFormat(name=Memory), title=PostingsFormat(name=LuceneVarGapDocFreqInterval)}, docValues:{_version_=DocValuesFormat(name=Memory), popularity=DocValuesFormat(name=Lucene70)}, maxPointsInLeafNode=1730, maxMBSortInHeap=7.301741783444627, sim=Asserting(org.apache.lucene.search.similarities.AssertingSimilarity@5dda9a14), locale=sr-Latn-RS, timezone=Asia/Aqtobe
   [junit4]   2> NOTE: Linux 4.4.0-112-generic amd64/Oracle Corporation 1.8.0_152 (64-bit)/cpus=4,threads=2,free=147778168,total=285212672
   [junit4]   2> NOTE: All tests run in this JVM: [TestParallelWeightCreation, TestFieldValueFeature, TestEdisMaxSolrFeature, TestModelManagerPersistence]
   [junit4]   2> NOTE: reproduce with: ant test  -Dtestcase=TestModelManagerPersistence -Dtests.seed=8E983D4F108CA92A -Dtests.multiplier=2 -Dtests.slow=true -Dtests.locale=sr-Latn-RS -Dtests.timezone=Asia/Aqtobe -Dtests.asserts=true -Dtests.file.encoding=UTF-8
   [junit4] ERROR   0.00s J1 | TestModelManagerPersistence (suite) <<<
   [junit4]    > Throwable #1: com.carrotsearch.randomizedtesting.ThreadLeakError: 1 thread leaked from SUITE scope at org.apache.solr.ltr.store.rest.TestModelManagerPersistence: 
   [junit4]    >    1) Thread[id=159, name=qtp2034504500-159, state=TIMED_WAITING, group=TGRP-TestModelManagerPersistence]
   [junit4]    >         at sun.misc.Unsafe.park(Native Method)
   [junit4]    >         at java.util.concurrent.locks.LockSupport.parkNanos(LockSupport.java:215)
   [junit4]    >         at java.util.concurrent.locks.AbstractQueuedSynchronizer$ConditionObject.await(AbstractQueuedSynchronizer.java:2163)
   [junit4]    >         at org.eclipse.jetty.util.thread.ReservedThreadExecutor$ReservedThread.reservedWait(ReservedThreadExecutor.java:308)
   [junit4]    >         at org.eclipse.jetty.util.thread.ReservedThreadExecutor$ReservedThread.run(ReservedThreadExecutor.java:373)
   [junit4]    >         at org.eclipse.jetty.util.thread.QueuedThreadPool.runJob(QueuedThreadPool.java:708)
   [junit4]    >         at org.eclipse.jetty.util.thread.QueuedThreadPool$2.run(QueuedThreadPool.java:626)
   [junit4]    >         at java.lang.Thread.run(Thread.java:748)
   [junit4]    > 	at __randomizedtesting.SeedInfo.seed([8E983D4F108CA92A]:0)Throwable #2: com.carrotsearch.randomizedtesting.ThreadLeakError: There are still zombie threads that couldn't be terminated:
   [junit4]    >    1) Thread[id=159, name=qtp2034504500-159, state=TIMED_WAITING, group=TGRP-TestModelManagerPersistence]
   [junit4]    >         at sun.misc.Unsafe.park(Native Method)
   [junit4]    >         at java.util.concurrent.locks.LockSupport.parkNanos(LockSupport.java:215)
   [junit4]    >         at java.util.concurrent.locks.AbstractQueuedSynchronizer$ConditionObject.await(AbstractQueuedSynchronizer.java:2163)
   [junit4]    >         at org.eclipse.jetty.util.thread.ReservedThreadExecutor$ReservedThread.reservedWait(ReservedThreadExecutor.java:308)
   [junit4]    >         at org.eclipse.jetty.util.thread.ReservedThreadExecutor$ReservedThread.run(ReservedThreadExecutor.java:373)
   [junit4]    >         at org.eclipse.jetty.util.thread.QueuedThreadPool.runJob(QueuedThreadPool.java:708)
   [junit4]    >         at org.eclipse.jetty.util.thread.QueuedThreadPool$2.run(QueuedThreadPool.java:626)
   [junit4]    >         at java.lang.Thread.run(Thread.java:748)
   [junit4]    > 	at __randomizedtesting.SeedInfo.seed([8E983D4F108CA92A]:0)
   [junit4] Completed [33/35 (1!)] on J1 in 68.11s, 3 tests, 2 errors <<< FAILURES!

[...truncated 40698 lines...]

[JENKINS] Lucene-Solr-Tests-master - Build # 2299 - Failure

Posted by Apache Jenkins Server <je...@builds.apache.org>.
Build: https://builds.apache.org/job/Lucene-Solr-Tests-master/2299/

8 tests failed.
FAILED:  org.apache.solr.cloud.MoveReplicaHDFSTest.testFailedMove

Error Message:
No live SolrServers available to handle this request:[https://127.0.0.1:46045/solr/MoveReplicaHDFSTest_failed_coll_true, https://127.0.0.1:36441/solr/MoveReplicaHDFSTest_failed_coll_true]

Stack Trace:
org.apache.solr.client.solrj.SolrServerException: No live SolrServers available to handle this request:[https://127.0.0.1:46045/solr/MoveReplicaHDFSTest_failed_coll_true, https://127.0.0.1:36441/solr/MoveReplicaHDFSTest_failed_coll_true]
	at __randomizedtesting.SeedInfo.seed([E297651F29BF3751:485AB6ED9E6CE281]:0)
	at org.apache.solr.client.solrj.impl.LBHttpSolrClient.request(LBHttpSolrClient.java:462)
	at org.apache.solr.client.solrj.impl.CloudSolrClient.sendRequest(CloudSolrClient.java:1104)
	at org.apache.solr.client.solrj.impl.CloudSolrClient.requestWithRetryOnStaleState(CloudSolrClient.java:884)
	at org.apache.solr.client.solrj.impl.CloudSolrClient.requestWithRetryOnStaleState(CloudSolrClient.java:991)
	at org.apache.solr.client.solrj.impl.CloudSolrClient.request(CloudSolrClient.java:817)
	at org.apache.solr.client.solrj.SolrRequest.process(SolrRequest.java:194)
	at org.apache.solr.client.solrj.SolrClient.query(SolrClient.java:942)
	at org.apache.solr.cloud.MoveReplicaTest.testFailedMove(MoveReplicaTest.java:309)
	at sun.reflect.NativeMethodAccessorImpl.invoke0(Native Method)
	at sun.reflect.NativeMethodAccessorImpl.invoke(NativeMethodAccessorImpl.java:62)
	at sun.reflect.DelegatingMethodAccessorImpl.invoke(DelegatingMethodAccessorImpl.java:43)
	at java.lang.reflect.Method.invoke(Method.java:498)
	at com.carrotsearch.randomizedtesting.RandomizedRunner.invoke(RandomizedRunner.java:1737)
	at com.carrotsearch.randomizedtesting.RandomizedRunner$8.evaluate(RandomizedRunner.java:934)
	at com.carrotsearch.randomizedtesting.RandomizedRunner$9.evaluate(RandomizedRunner.java:970)
	at com.carrotsearch.randomizedtesting.RandomizedRunner$10.evaluate(RandomizedRunner.java:984)
	at com.carrotsearch.randomizedtesting.rules.SystemPropertiesRestoreRule$1.evaluate(SystemPropertiesRestoreRule.java:57)
	at org.apache.lucene.util.TestRuleSetupTeardownChained$1.evaluate(TestRuleSetupTeardownChained.java:49)
	at org.apache.lucene.util.AbstractBeforeAfterRule$1.evaluate(AbstractBeforeAfterRule.java:45)
	at org.apache.lucene.util.TestRuleThreadAndTestName$1.evaluate(TestRuleThreadAndTestName.java:48)
	at org.apache.lucene.util.TestRuleIgnoreAfterMaxFailures$1.evaluate(TestRuleIgnoreAfterMaxFailures.java:64)
	at org.apache.lucene.util.TestRuleMarkFailure$1.evaluate(TestRuleMarkFailure.java:47)
	at com.carrotsearch.randomizedtesting.rules.StatementAdapter.evaluate(StatementAdapter.java:36)
	at com.carrotsearch.randomizedtesting.ThreadLeakControl$StatementRunner.run(ThreadLeakControl.java:368)
	at com.carrotsearch.randomizedtesting.ThreadLeakControl.forkTimeoutingTask(ThreadLeakControl.java:817)
	at com.carrotsearch.randomizedtesting.ThreadLeakControl$3.evaluate(ThreadLeakControl.java:468)
	at com.carrotsearch.randomizedtesting.RandomizedRunner.runSingleTest(RandomizedRunner.java:943)
	at com.carrotsearch.randomizedtesting.RandomizedRunner$5.evaluate(RandomizedRunner.java:829)
	at com.carrotsearch.randomizedtesting.RandomizedRunner$6.evaluate(RandomizedRunner.java:879)
	at com.carrotsearch.randomizedtesting.RandomizedRunner$7.evaluate(RandomizedRunner.java:890)
	at com.carrotsearch.randomizedtesting.rules.StatementAdapter.evaluate(StatementAdapter.java:36)
	at com.carrotsearch.randomizedtesting.rules.SystemPropertiesRestoreRule$1.evaluate(SystemPropertiesRestoreRule.java:57)
	at org.apache.lucene.util.AbstractBeforeAfterRule$1.evaluate(AbstractBeforeAfterRule.java:45)
	at com.carrotsearch.randomizedtesting.rules.StatementAdapter.evaluate(StatementAdapter.java:36)
	at org.apache.lucene.util.TestRuleStoreClassName$1.evaluate(TestRuleStoreClassName.java:41)
	at com.carrotsearch.randomizedtesting.rules.NoShadowingOrOverridesOnMethodsRule$1.evaluate(NoShadowingOrOverridesOnMethodsRule.java:40)
	at com.carrotsearch.randomizedtesting.rules.NoShadowingOrOverridesOnMethodsRule$1.evaluate(NoShadowingOrOverridesOnMethodsRule.java:40)
	at com.carrotsearch.randomizedtesting.rules.StatementAdapter.evaluate(StatementAdapter.java:36)
	at com.carrotsearch.randomizedtesting.rules.StatementAdapter.evaluate(StatementAdapter.java:36)
	at com.carrotsearch.randomizedtesting.rules.StatementAdapter.evaluate(StatementAdapter.java:36)
	at org.apache.lucene.util.TestRuleAssertionsRequired$1.evaluate(TestRuleAssertionsRequired.java:53)
	at org.apache.lucene.util.TestRuleMarkFailure$1.evaluate(TestRuleMarkFailure.java:47)
	at org.apache.lucene.util.TestRuleIgnoreAfterMaxFailures$1.evaluate(TestRuleIgnoreAfterMaxFailures.java:64)
	at org.apache.lucene.util.TestRuleIgnoreTestSuites$1.evaluate(TestRuleIgnoreTestSuites.java:54)
	at com.carrotsearch.randomizedtesting.rules.StatementAdapter.evaluate(StatementAdapter.java:36)
	at com.carrotsearch.randomizedtesting.ThreadLeakControl$StatementRunner.run(ThreadLeakControl.java:368)
	at java.lang.Thread.run(Thread.java:748)
Caused by: org.apache.solr.client.solrj.impl.HttpSolrClient$RemoteSolrException: Error from server at https://127.0.0.1:36441/solr/MoveReplicaHDFSTest_failed_coll_true: no servers hosting shard: shard2
	at org.apache.solr.client.solrj.impl.HttpSolrClient.executeMethod(HttpSolrClient.java:643)
	at org.apache.solr.client.solrj.impl.HttpSolrClient.request(HttpSolrClient.java:255)
	at org.apache.solr.client.solrj.impl.HttpSolrClient.request(HttpSolrClient.java:244)
	at org.apache.solr.client.solrj.impl.LBHttpSolrClient.doRequest(LBHttpSolrClient.java:483)
	at org.apache.solr.client.solrj.impl.LBHttpSolrClient.request(LBHttpSolrClient.java:436)
	... 46 more


FAILED:  org.apache.solr.cloud.SolrCloudExampleTest.testLoadDocsIntoGettingStartedCollection

Error Message:
Didn't see all replicas for shard shard2 in gettingstarted come up within 10000 ms! ClusterState: {   "control_collection":{     "pullReplicas":"0",     "replicationFactor":"1",     "shards":{"shard1":{         "range":"80000000-7fffffff",         "state":"active",         "replicas":{"core_node2":{             "core":"control_collection_shard1_replica_n1",             "base_url":"http://127.0.0.1:45853/rwp",             "node_name":"127.0.0.1:45853_rwp",             "state":"active",             "type":"NRT",             "leader":"true"}}}},     "router":{"name":"compositeId"},     "maxShardsPerNode":"1",     "autoAddReplicas":"false",     "nrtReplicas":"1",     "tlogReplicas":"0"},   "gettingstarted":{     "pullReplicas":"0",     "replicationFactor":"2",     "shards":{       "shard1":{         "range":"80000000-ffffffff",         "state":"active",         "replicas":{           "core_node6":{             "core":"gettingstarted_shard1_replica_n1",             "base_url":"http://127.0.0.1:52190/rwp",             "node_name":"127.0.0.1:52190_rwp",             "state":"active",             "type":"NRT",             "leader":"true"},           "core_node7":{             "core":"gettingstarted_shard1_replica_n2",             "base_url":"http://127.0.0.1:41493/rwp",             "node_name":"127.0.0.1:41493_rwp",             "state":"active",             "type":"NRT"}}},       "shard2":{         "range":"0-7fffffff",         "state":"active",         "replicas":{           "core_node5":{             "core":"gettingstarted_shard2_replica_n3",             "base_url":"http://127.0.0.1:53180/rwp",             "node_name":"127.0.0.1:53180_rwp",             "state":"active",             "type":"NRT",             "leader":"true"},           "core_node8":{             "core":"gettingstarted_shard2_replica_n4",             "base_url":"http://127.0.0.1:45853/rwp",             "node_name":"127.0.0.1:45853_rwp",             "state":"down",             "type":"NRT"}}}},     "router":{"name":"compositeId"},     "maxShardsPerNode":"-1",     "autoAddReplicas":"false",     "nrtReplicas":"1",     "tlogReplicas":"0"},   "collection1":{     "pullReplicas":"0",     "replicationFactor":"1",     "shards":{       "shard1":{         "range":"80000000-ffffffff",         "state":"active",         "replicas":{           "core_node44":{             "core":"collection1_shard1_replica_n43",             "base_url":"http://127.0.0.1:52190/rwp",             "node_name":"127.0.0.1:52190_rwp",             "state":"active",             "type":"NRT",             "leader":"true"},           "core_node48":{             "core":"collection1_shard1_replica_n47",             "base_url":"http://127.0.0.1:53180/rwp",             "node_name":"127.0.0.1:53180_rwp",             "state":"active",             "type":"NRT"}}},       "shard2":{         "range":"0-7fffffff",         "state":"active",         "replicas":{           "core_node42":{             "core":"collection1_shard2_replica_n41",             "base_url":"http://127.0.0.1:41493/rwp",             "node_name":"127.0.0.1:41493_rwp",             "state":"active",             "type":"NRT"},           "core_node46":{             "core":"collection1_shard2_replica_n45",             "base_url":"http://127.0.0.1:45813/rwp",             "node_name":"127.0.0.1:45813_rwp",             "state":"active",             "type":"NRT",             "leader":"true"}}}},     "router":{"name":"compositeId"},     "maxShardsPerNode":"1",     "autoAddReplicas":"false",     "nrtReplicas":"1",     "tlogReplicas":"0"}}

Stack Trace:
java.lang.AssertionError: Didn't see all replicas for shard shard2 in gettingstarted come up within 10000 ms! ClusterState: {
  "control_collection":{
    "pullReplicas":"0",
    "replicationFactor":"1",
    "shards":{"shard1":{
        "range":"80000000-7fffffff",
        "state":"active",
        "replicas":{"core_node2":{
            "core":"control_collection_shard1_replica_n1",
            "base_url":"http://127.0.0.1:45853/rwp",
            "node_name":"127.0.0.1:45853_rwp",
            "state":"active",
            "type":"NRT",
            "leader":"true"}}}},
    "router":{"name":"compositeId"},
    "maxShardsPerNode":"1",
    "autoAddReplicas":"false",
    "nrtReplicas":"1",
    "tlogReplicas":"0"},
  "gettingstarted":{
    "pullReplicas":"0",
    "replicationFactor":"2",
    "shards":{
      "shard1":{
        "range":"80000000-ffffffff",
        "state":"active",
        "replicas":{
          "core_node6":{
            "core":"gettingstarted_shard1_replica_n1",
            "base_url":"http://127.0.0.1:52190/rwp",
            "node_name":"127.0.0.1:52190_rwp",
            "state":"active",
            "type":"NRT",
            "leader":"true"},
          "core_node7":{
            "core":"gettingstarted_shard1_replica_n2",
            "base_url":"http://127.0.0.1:41493/rwp",
            "node_name":"127.0.0.1:41493_rwp",
            "state":"active",
            "type":"NRT"}}},
      "shard2":{
        "range":"0-7fffffff",
        "state":"active",
        "replicas":{
          "core_node5":{
            "core":"gettingstarted_shard2_replica_n3",
            "base_url":"http://127.0.0.1:53180/rwp",
            "node_name":"127.0.0.1:53180_rwp",
            "state":"active",
            "type":"NRT",
            "leader":"true"},
          "core_node8":{
            "core":"gettingstarted_shard2_replica_n4",
            "base_url":"http://127.0.0.1:45853/rwp",
            "node_name":"127.0.0.1:45853_rwp",
            "state":"down",
            "type":"NRT"}}}},
    "router":{"name":"compositeId"},
    "maxShardsPerNode":"-1",
    "autoAddReplicas":"false",
    "nrtReplicas":"1",
    "tlogReplicas":"0"},
  "collection1":{
    "pullReplicas":"0",
    "replicationFactor":"1",
    "shards":{
      "shard1":{
        "range":"80000000-ffffffff",
        "state":"active",
        "replicas":{
          "core_node44":{
            "core":"collection1_shard1_replica_n43",
            "base_url":"http://127.0.0.1:52190/rwp",
            "node_name":"127.0.0.1:52190_rwp",
            "state":"active",
            "type":"NRT",
            "leader":"true"},
          "core_node48":{
            "core":"collection1_shard1_replica_n47",
            "base_url":"http://127.0.0.1:53180/rwp",
            "node_name":"127.0.0.1:53180_rwp",
            "state":"active",
            "type":"NRT"}}},
      "shard2":{
        "range":"0-7fffffff",
        "state":"active",
        "replicas":{
          "core_node42":{
            "core":"collection1_shard2_replica_n41",
            "base_url":"http://127.0.0.1:41493/rwp",
            "node_name":"127.0.0.1:41493_rwp",
            "state":"active",
            "type":"NRT"},
          "core_node46":{
            "core":"collection1_shard2_replica_n45",
            "base_url":"http://127.0.0.1:45813/rwp",
            "node_name":"127.0.0.1:45813_rwp",
            "state":"active",
            "type":"NRT",
            "leader":"true"}}}},
    "router":{"name":"compositeId"},
    "maxShardsPerNode":"1",
    "autoAddReplicas":"false",
    "nrtReplicas":"1",
    "tlogReplicas":"0"}}
	at __randomizedtesting.SeedInfo.seed([E297651F29BF3751:F1F4577018D08EF7]:0)
	at org.junit.Assert.fail(Assert.java:93)
	at org.apache.solr.cloud.AbstractFullDistribZkTestBase.ensureAllReplicasAreActive(AbstractFullDistribZkTestBase.java:2005)
	at org.apache.solr.cloud.SolrCloudExampleTest.testLoadDocsIntoGettingStartedCollection(SolrCloudExampleTest.java:108)
	at sun.reflect.NativeMethodAccessorImpl.invoke0(Native Method)
	at sun.reflect.NativeMethodAccessorImpl.invoke(NativeMethodAccessorImpl.java:62)
	at sun.reflect.DelegatingMethodAccessorImpl.invoke(DelegatingMethodAccessorImpl.java:43)
	at java.lang.reflect.Method.invoke(Method.java:498)
	at com.carrotsearch.randomizedtesting.RandomizedRunner.invoke(RandomizedRunner.java:1737)
	at com.carrotsearch.randomizedtesting.RandomizedRunner$8.evaluate(RandomizedRunner.java:934)
	at com.carrotsearch.randomizedtesting.RandomizedRunner$9.evaluate(RandomizedRunner.java:970)
	at com.carrotsearch.randomizedtesting.RandomizedRunner$10.evaluate(RandomizedRunner.java:984)
	at org.apache.solr.BaseDistributedSearchTestCase$ShardsRepeatRule$ShardsFixedStatement.callStatement(BaseDistributedSearchTestCase.java:993)
	at org.apache.solr.BaseDistributedSearchTestCase$ShardsRepeatRule$ShardsStatement.evaluate(BaseDistributedSearchTestCase.java:968)
	at com.carrotsearch.randomizedtesting.rules.SystemPropertiesRestoreRule$1.evaluate(SystemPropertiesRestoreRule.java:57)
	at org.apache.lucene.util.TestRuleSetupTeardownChained$1.evaluate(TestRuleSetupTeardownChained.java:49)
	at org.apache.lucene.util.AbstractBeforeAfterRule$1.evaluate(AbstractBeforeAfterRule.java:45)
	at org.apache.lucene.util.TestRuleThreadAndTestName$1.evaluate(TestRuleThreadAndTestName.java:48)
	at org.apache.lucene.util.TestRuleIgnoreAfterMaxFailures$1.evaluate(TestRuleIgnoreAfterMaxFailures.java:64)
	at org.apache.lucene.util.TestRuleMarkFailure$1.evaluate(TestRuleMarkFailure.java:47)
	at com.carrotsearch.randomizedtesting.rules.StatementAdapter.evaluate(StatementAdapter.java:36)
	at com.carrotsearch.randomizedtesting.ThreadLeakControl$StatementRunner.run(ThreadLeakControl.java:368)
	at com.carrotsearch.randomizedtesting.ThreadLeakControl.forkTimeoutingTask(ThreadLeakControl.java:817)
	at com.carrotsearch.randomizedtesting.ThreadLeakControl$3.evaluate(ThreadLeakControl.java:468)
	at com.carrotsearch.randomizedtesting.RandomizedRunner.runSingleTest(RandomizedRunner.java:943)
	at com.carrotsearch.randomizedtesting.RandomizedRunner$5.evaluate(RandomizedRunner.java:829)
	at com.carrotsearch.randomizedtesting.RandomizedRunner$6.evaluate(RandomizedRunner.java:879)
	at com.carrotsearch.randomizedtesting.RandomizedRunner$7.evaluate(RandomizedRunner.java:890)
	at com.carrotsearch.randomizedtesting.rules.StatementAdapter.evaluate(StatementAdapter.java:36)
	at com.carrotsearch.randomizedtesting.rules.SystemPropertiesRestoreRule$1.evaluate(SystemPropertiesRestoreRule.java:57)
	at org.apache.lucene.util.AbstractBeforeAfterRule$1.evaluate(AbstractBeforeAfterRule.java:45)
	at com.carrotsearch.randomizedtesting.rules.StatementAdapter.evaluate(StatementAdapter.java:36)
	at org.apache.lucene.util.TestRuleStoreClassName$1.evaluate(TestRuleStoreClassName.java:41)
	at com.carrotsearch.randomizedtesting.rules.NoShadowingOrOverridesOnMethodsRule$1.evaluate(NoShadowingOrOverridesOnMethodsRule.java:40)
	at com.carrotsearch.randomizedtesting.rules.NoShadowingOrOverridesOnMethodsRule$1.evaluate(NoShadowingOrOverridesOnMethodsRule.java:40)
	at com.carrotsearch.randomizedtesting.rules.StatementAdapter.evaluate(StatementAdapter.java:36)
	at com.carrotsearch.randomizedtesting.rules.StatementAdapter.evaluate(StatementAdapter.java:36)
	at com.carrotsearch.randomizedtesting.rules.StatementAdapter.evaluate(StatementAdapter.java:36)
	at org.apache.lucene.util.TestRuleAssertionsRequired$1.evaluate(TestRuleAssertionsRequired.java:53)
	at org.apache.lucene.util.TestRuleMarkFailure$1.evaluate(TestRuleMarkFailure.java:47)
	at org.apache.lucene.util.TestRuleIgnoreAfterMaxFailures$1.evaluate(TestRuleIgnoreAfterMaxFailures.java:64)
	at org.apache.lucene.util.TestRuleIgnoreTestSuites$1.evaluate(TestRuleIgnoreTestSuites.java:54)
	at com.carrotsearch.randomizedtesting.rules.StatementAdapter.evaluate(StatementAdapter.java:36)
	at com.carrotsearch.randomizedtesting.ThreadLeakControl$StatementRunner.run(ThreadLeakControl.java:368)
	at java.lang.Thread.run(Thread.java:748)


FAILED:  org.apache.solr.cloud.autoscaling.sim.TestDistribStateManager.testGetSetRemoveData

Error Message:
Node watch should have fired!

Stack Trace:
java.lang.AssertionError: Node watch should have fired!
	at __randomizedtesting.SeedInfo.seed([E297651F29BF3751:C4078A4D7D31F15B]:0)
	at org.junit.Assert.fail(Assert.java:93)
	at org.apache.solr.cloud.autoscaling.sim.TestDistribStateManager.testGetSetRemoveData(TestDistribStateManager.java:256)
	at sun.reflect.NativeMethodAccessorImpl.invoke0(Native Method)
	at sun.reflect.NativeMethodAccessorImpl.invoke(NativeMethodAccessorImpl.java:62)
	at sun.reflect.DelegatingMethodAccessorImpl.invoke(DelegatingMethodAccessorImpl.java:43)
	at java.lang.reflect.Method.invoke(Method.java:498)
	at com.carrotsearch.randomizedtesting.RandomizedRunner.invoke(RandomizedRunner.java:1737)
	at com.carrotsearch.randomizedtesting.RandomizedRunner$8.evaluate(RandomizedRunner.java:934)
	at com.carrotsearch.randomizedtesting.RandomizedRunner$9.evaluate(RandomizedRunner.java:970)
	at com.carrotsearch.randomizedtesting.RandomizedRunner$10.evaluate(RandomizedRunner.java:984)
	at com.carrotsearch.randomizedtesting.rules.SystemPropertiesRestoreRule$1.evaluate(SystemPropertiesRestoreRule.java:57)
	at org.apache.lucene.util.TestRuleSetupTeardownChained$1.evaluate(TestRuleSetupTeardownChained.java:49)
	at org.apache.lucene.util.AbstractBeforeAfterRule$1.evaluate(AbstractBeforeAfterRule.java:45)
	at org.apache.lucene.util.TestRuleThreadAndTestName$1.evaluate(TestRuleThreadAndTestName.java:48)
	at org.apache.lucene.util.TestRuleIgnoreAfterMaxFailures$1.evaluate(TestRuleIgnoreAfterMaxFailures.java:64)
	at org.apache.lucene.util.TestRuleMarkFailure$1.evaluate(TestRuleMarkFailure.java:47)
	at com.carrotsearch.randomizedtesting.rules.StatementAdapter.evaluate(StatementAdapter.java:36)
	at com.carrotsearch.randomizedtesting.ThreadLeakControl$StatementRunner.run(ThreadLeakControl.java:368)
	at com.carrotsearch.randomizedtesting.ThreadLeakControl.forkTimeoutingTask(ThreadLeakControl.java:817)
	at com.carrotsearch.randomizedtesting.ThreadLeakControl$3.evaluate(ThreadLeakControl.java:468)
	at com.carrotsearch.randomizedtesting.RandomizedRunner.runSingleTest(RandomizedRunner.java:943)
	at com.carrotsearch.randomizedtesting.RandomizedRunner$5.evaluate(RandomizedRunner.java:829)
	at com.carrotsearch.randomizedtesting.RandomizedRunner$6.evaluate(RandomizedRunner.java:879)
	at com.carrotsearch.randomizedtesting.RandomizedRunner$7.evaluate(RandomizedRunner.java:890)
	at com.carrotsearch.randomizedtesting.rules.StatementAdapter.evaluate(StatementAdapter.java:36)
	at com.carrotsearch.randomizedtesting.rules.SystemPropertiesRestoreRule$1.evaluate(SystemPropertiesRestoreRule.java:57)
	at org.apache.lucene.util.AbstractBeforeAfterRule$1.evaluate(AbstractBeforeAfterRule.java:45)
	at com.carrotsearch.randomizedtesting.rules.StatementAdapter.evaluate(StatementAdapter.java:36)
	at org.apache.lucene.util.TestRuleStoreClassName$1.evaluate(TestRuleStoreClassName.java:41)
	at com.carrotsearch.randomizedtesting.rules.NoShadowingOrOverridesOnMethodsRule$1.evaluate(NoShadowingOrOverridesOnMethodsRule.java:40)
	at com.carrotsearch.randomizedtesting.rules.NoShadowingOrOverridesOnMethodsRule$1.evaluate(NoShadowingOrOverridesOnMethodsRule.java:40)
	at com.carrotsearch.randomizedtesting.rules.StatementAdapter.evaluate(StatementAdapter.java:36)
	at com.carrotsearch.randomizedtesting.rules.StatementAdapter.evaluate(StatementAdapter.java:36)
	at com.carrotsearch.randomizedtesting.rules.StatementAdapter.evaluate(StatementAdapter.java:36)
	at org.apache.lucene.util.TestRuleAssertionsRequired$1.evaluate(TestRuleAssertionsRequired.java:53)
	at org.apache.lucene.util.TestRuleMarkFailure$1.evaluate(TestRuleMarkFailure.java:47)
	at org.apache.lucene.util.TestRuleIgnoreAfterMaxFailures$1.evaluate(TestRuleIgnoreAfterMaxFailures.java:64)
	at org.apache.lucene.util.TestRuleIgnoreTestSuites$1.evaluate(TestRuleIgnoreTestSuites.java:54)
	at com.carrotsearch.randomizedtesting.rules.StatementAdapter.evaluate(StatementAdapter.java:36)
	at com.carrotsearch.randomizedtesting.ThreadLeakControl$StatementRunner.run(ThreadLeakControl.java:368)
	at java.lang.Thread.run(Thread.java:748)


FAILED:  org.apache.solr.cloud.autoscaling.sim.TestTriggerIntegration.testNodeAddedTriggerRestoreState

Error Message:
The trigger did not fire at all

Stack Trace:
java.lang.AssertionError: The trigger did not fire at all
	at __randomizedtesting.SeedInfo.seed([E297651F29BF3751:6AAAEC60137FD6FC]:0)
	at org.junit.Assert.fail(Assert.java:93)
	at org.junit.Assert.assertTrue(Assert.java:43)
	at org.apache.solr.cloud.autoscaling.sim.TestTriggerIntegration.testNodeAddedTriggerRestoreState(TestTriggerIntegration.java:367)
	at sun.reflect.NativeMethodAccessorImpl.invoke0(Native Method)
	at sun.reflect.NativeMethodAccessorImpl.invoke(NativeMethodAccessorImpl.java:62)
	at sun.reflect.DelegatingMethodAccessorImpl.invoke(DelegatingMethodAccessorImpl.java:43)
	at java.lang.reflect.Method.invoke(Method.java:498)
	at com.carrotsearch.randomizedtesting.RandomizedRunner.invoke(RandomizedRunner.java:1737)
	at com.carrotsearch.randomizedtesting.RandomizedRunner$8.evaluate(RandomizedRunner.java:934)
	at com.carrotsearch.randomizedtesting.RandomizedRunner$9.evaluate(RandomizedRunner.java:970)
	at com.carrotsearch.randomizedtesting.RandomizedRunner$10.evaluate(RandomizedRunner.java:984)
	at com.carrotsearch.randomizedtesting.rules.SystemPropertiesRestoreRule$1.evaluate(SystemPropertiesRestoreRule.java:57)
	at org.apache.lucene.util.TestRuleSetupTeardownChained$1.evaluate(TestRuleSetupTeardownChained.java:49)
	at org.apache.lucene.util.AbstractBeforeAfterRule$1.evaluate(AbstractBeforeAfterRule.java:45)
	at org.apache.lucene.util.TestRuleThreadAndTestName$1.evaluate(TestRuleThreadAndTestName.java:48)
	at org.apache.lucene.util.TestRuleIgnoreAfterMaxFailures$1.evaluate(TestRuleIgnoreAfterMaxFailures.java:64)
	at org.apache.lucene.util.TestRuleMarkFailure$1.evaluate(TestRuleMarkFailure.java:47)
	at com.carrotsearch.randomizedtesting.rules.StatementAdapter.evaluate(StatementAdapter.java:36)
	at com.carrotsearch.randomizedtesting.ThreadLeakControl$StatementRunner.run(ThreadLeakControl.java:368)
	at com.carrotsearch.randomizedtesting.ThreadLeakControl.forkTimeoutingTask(ThreadLeakControl.java:817)
	at com.carrotsearch.randomizedtesting.ThreadLeakControl$3.evaluate(ThreadLeakControl.java:468)
	at com.carrotsearch.randomizedtesting.RandomizedRunner.runSingleTest(RandomizedRunner.java:943)
	at com.carrotsearch.randomizedtesting.RandomizedRunner$5.evaluate(RandomizedRunner.java:829)
	at com.carrotsearch.randomizedtesting.RandomizedRunner$6.evaluate(RandomizedRunner.java:879)
	at com.carrotsearch.randomizedtesting.RandomizedRunner$7.evaluate(RandomizedRunner.java:890)
	at com.carrotsearch.randomizedtesting.rules.StatementAdapter.evaluate(StatementAdapter.java:36)
	at com.carrotsearch.randomizedtesting.rules.SystemPropertiesRestoreRule$1.evaluate(SystemPropertiesRestoreRule.java:57)
	at org.apache.lucene.util.AbstractBeforeAfterRule$1.evaluate(AbstractBeforeAfterRule.java:45)
	at com.carrotsearch.randomizedtesting.rules.StatementAdapter.evaluate(StatementAdapter.java:36)
	at org.apache.lucene.util.TestRuleStoreClassName$1.evaluate(TestRuleStoreClassName.java:41)
	at com.carrotsearch.randomizedtesting.rules.NoShadowingOrOverridesOnMethodsRule$1.evaluate(NoShadowingOrOverridesOnMethodsRule.java:40)
	at com.carrotsearch.randomizedtesting.rules.NoShadowingOrOverridesOnMethodsRule$1.evaluate(NoShadowingOrOverridesOnMethodsRule.java:40)
	at com.carrotsearch.randomizedtesting.rules.StatementAdapter.evaluate(StatementAdapter.java:36)
	at com.carrotsearch.randomizedtesting.rules.StatementAdapter.evaluate(StatementAdapter.java:36)
	at com.carrotsearch.randomizedtesting.rules.StatementAdapter.evaluate(StatementAdapter.java:36)
	at org.apache.lucene.util.TestRuleAssertionsRequired$1.evaluate(TestRuleAssertionsRequired.java:53)
	at org.apache.lucene.util.TestRuleMarkFailure$1.evaluate(TestRuleMarkFailure.java:47)
	at org.apache.lucene.util.TestRuleIgnoreAfterMaxFailures$1.evaluate(TestRuleIgnoreAfterMaxFailures.java:64)
	at org.apache.lucene.util.TestRuleIgnoreTestSuites$1.evaluate(TestRuleIgnoreTestSuites.java:54)
	at com.carrotsearch.randomizedtesting.rules.StatementAdapter.evaluate(StatementAdapter.java:36)
	at com.carrotsearch.randomizedtesting.ThreadLeakControl$StatementRunner.run(ThreadLeakControl.java:368)
	at java.lang.Thread.run(Thread.java:748)


FAILED:  org.apache.solr.cloud.autoscaling.sim.TestTriggerIntegration.testNodeLostTriggerRestoreState

Error Message:
The trigger did not fire at all

Stack Trace:
java.lang.AssertionError: The trigger did not fire at all
	at __randomizedtesting.SeedInfo.seed([E297651F29BF3751:C968B044B3C72281]:0)
	at org.junit.Assert.fail(Assert.java:93)
	at org.junit.Assert.assertTrue(Assert.java:43)
	at org.apache.solr.cloud.autoscaling.sim.TestTriggerIntegration.testNodeLostTriggerRestoreState(TestTriggerIntegration.java:309)
	at sun.reflect.NativeMethodAccessorImpl.invoke0(Native Method)
	at sun.reflect.NativeMethodAccessorImpl.invoke(NativeMethodAccessorImpl.java:62)
	at sun.reflect.DelegatingMethodAccessorImpl.invoke(DelegatingMethodAccessorImpl.java:43)
	at java.lang.reflect.Method.invoke(Method.java:498)
	at com.carrotsearch.randomizedtesting.RandomizedRunner.invoke(RandomizedRunner.java:1737)
	at com.carrotsearch.randomizedtesting.RandomizedRunner$8.evaluate(RandomizedRunner.java:934)
	at com.carrotsearch.randomizedtesting.RandomizedRunner$9.evaluate(RandomizedRunner.java:970)
	at com.carrotsearch.randomizedtesting.RandomizedRunner$10.evaluate(RandomizedRunner.java:984)
	at com.carrotsearch.randomizedtesting.rules.SystemPropertiesRestoreRule$1.evaluate(SystemPropertiesRestoreRule.java:57)
	at org.apache.lucene.util.TestRuleSetupTeardownChained$1.evaluate(TestRuleSetupTeardownChained.java:49)
	at org.apache.lucene.util.AbstractBeforeAfterRule$1.evaluate(AbstractBeforeAfterRule.java:45)
	at org.apache.lucene.util.TestRuleThreadAndTestName$1.evaluate(TestRuleThreadAndTestName.java:48)
	at org.apache.lucene.util.TestRuleIgnoreAfterMaxFailures$1.evaluate(TestRuleIgnoreAfterMaxFailures.java:64)
	at org.apache.lucene.util.TestRuleMarkFailure$1.evaluate(TestRuleMarkFailure.java:47)
	at com.carrotsearch.randomizedtesting.rules.StatementAdapter.evaluate(StatementAdapter.java:36)
	at com.carrotsearch.randomizedtesting.ThreadLeakControl$StatementRunner.run(ThreadLeakControl.java:368)
	at com.carrotsearch.randomizedtesting.ThreadLeakControl.forkTimeoutingTask(ThreadLeakControl.java:817)
	at com.carrotsearch.randomizedtesting.ThreadLeakControl$3.evaluate(ThreadLeakControl.java:468)
	at com.carrotsearch.randomizedtesting.RandomizedRunner.runSingleTest(RandomizedRunner.java:943)
	at com.carrotsearch.randomizedtesting.RandomizedRunner$5.evaluate(RandomizedRunner.java:829)
	at com.carrotsearch.randomizedtesting.RandomizedRunner$6.evaluate(RandomizedRunner.java:879)
	at com.carrotsearch.randomizedtesting.RandomizedRunner$7.evaluate(RandomizedRunner.java:890)
	at com.carrotsearch.randomizedtesting.rules.StatementAdapter.evaluate(StatementAdapter.java:36)
	at com.carrotsearch.randomizedtesting.rules.SystemPropertiesRestoreRule$1.evaluate(SystemPropertiesRestoreRule.java:57)
	at org.apache.lucene.util.AbstractBeforeAfterRule$1.evaluate(AbstractBeforeAfterRule.java:45)
	at com.carrotsearch.randomizedtesting.rules.StatementAdapter.evaluate(StatementAdapter.java:36)
	at org.apache.lucene.util.TestRuleStoreClassName$1.evaluate(TestRuleStoreClassName.java:41)
	at com.carrotsearch.randomizedtesting.rules.NoShadowingOrOverridesOnMethodsRule$1.evaluate(NoShadowingOrOverridesOnMethodsRule.java:40)
	at com.carrotsearch.randomizedtesting.rules.NoShadowingOrOverridesOnMethodsRule$1.evaluate(NoShadowingOrOverridesOnMethodsRule.java:40)
	at com.carrotsearch.randomizedtesting.rules.StatementAdapter.evaluate(StatementAdapter.java:36)
	at com.carrotsearch.randomizedtesting.rules.StatementAdapter.evaluate(StatementAdapter.java:36)
	at com.carrotsearch.randomizedtesting.rules.StatementAdapter.evaluate(StatementAdapter.java:36)
	at org.apache.lucene.util.TestRuleAssertionsRequired$1.evaluate(TestRuleAssertionsRequired.java:53)
	at org.apache.lucene.util.TestRuleMarkFailure$1.evaluate(TestRuleMarkFailure.java:47)
	at org.apache.lucene.util.TestRuleIgnoreAfterMaxFailures$1.evaluate(TestRuleIgnoreAfterMaxFailures.java:64)
	at org.apache.lucene.util.TestRuleIgnoreTestSuites$1.evaluate(TestRuleIgnoreTestSuites.java:54)
	at com.carrotsearch.randomizedtesting.rules.StatementAdapter.evaluate(StatementAdapter.java:36)
	at com.carrotsearch.randomizedtesting.ThreadLeakControl$StatementRunner.run(ThreadLeakControl.java:368)
	at java.lang.Thread.run(Thread.java:748)


FAILED:  org.apache.solr.cloud.autoscaling.sim.TestTriggerIntegration.testEventFromRestoredState

Error Message:
The trigger did not fire at all

Stack Trace:
java.lang.AssertionError: The trigger did not fire at all
	at __randomizedtesting.SeedInfo.seed([E297651F29BF3751:E2A1D1DF00B2933B]:0)
	at org.junit.Assert.fail(Assert.java:93)
	at org.junit.Assert.assertTrue(Assert.java:43)
	at org.apache.solr.cloud.autoscaling.sim.TestTriggerIntegration.testEventFromRestoredState(TestTriggerIntegration.java:675)
	at sun.reflect.NativeMethodAccessorImpl.invoke0(Native Method)
	at sun.reflect.NativeMethodAccessorImpl.invoke(NativeMethodAccessorImpl.java:62)
	at sun.reflect.DelegatingMethodAccessorImpl.invoke(DelegatingMethodAccessorImpl.java:43)
	at java.lang.reflect.Method.invoke(Method.java:498)
	at com.carrotsearch.randomizedtesting.RandomizedRunner.invoke(RandomizedRunner.java:1737)
	at com.carrotsearch.randomizedtesting.RandomizedRunner$8.evaluate(RandomizedRunner.java:934)
	at com.carrotsearch.randomizedtesting.RandomizedRunner$9.evaluate(RandomizedRunner.java:970)
	at com.carrotsearch.randomizedtesting.RandomizedRunner$10.evaluate(RandomizedRunner.java:984)
	at com.carrotsearch.randomizedtesting.rules.SystemPropertiesRestoreRule$1.evaluate(SystemPropertiesRestoreRule.java:57)
	at org.apache.lucene.util.TestRuleSetupTeardownChained$1.evaluate(TestRuleSetupTeardownChained.java:49)
	at org.apache.lucene.util.AbstractBeforeAfterRule$1.evaluate(AbstractBeforeAfterRule.java:45)
	at org.apache.lucene.util.TestRuleThreadAndTestName$1.evaluate(TestRuleThreadAndTestName.java:48)
	at org.apache.lucene.util.TestRuleIgnoreAfterMaxFailures$1.evaluate(TestRuleIgnoreAfterMaxFailures.java:64)
	at org.apache.lucene.util.TestRuleMarkFailure$1.evaluate(TestRuleMarkFailure.java:47)
	at com.carrotsearch.randomizedtesting.rules.StatementAdapter.evaluate(StatementAdapter.java:36)
	at com.carrotsearch.randomizedtesting.ThreadLeakControl$StatementRunner.run(ThreadLeakControl.java:368)
	at com.carrotsearch.randomizedtesting.ThreadLeakControl.forkTimeoutingTask(ThreadLeakControl.java:817)
	at com.carrotsearch.randomizedtesting.ThreadLeakControl$3.evaluate(ThreadLeakControl.java:468)
	at com.carrotsearch.randomizedtesting.RandomizedRunner.runSingleTest(RandomizedRunner.java:943)
	at com.carrotsearch.randomizedtesting.RandomizedRunner$5.evaluate(RandomizedRunner.java:829)
	at com.carrotsearch.randomizedtesting.RandomizedRunner$6.evaluate(RandomizedRunner.java:879)
	at com.carrotsearch.randomizedtesting.RandomizedRunner$7.evaluate(RandomizedRunner.java:890)
	at com.carrotsearch.randomizedtesting.rules.StatementAdapter.evaluate(StatementAdapter.java:36)
	at com.carrotsearch.randomizedtesting.rules.SystemPropertiesRestoreRule$1.evaluate(SystemPropertiesRestoreRule.java:57)
	at org.apache.lucene.util.AbstractBeforeAfterRule$1.evaluate(AbstractBeforeAfterRule.java:45)
	at com.carrotsearch.randomizedtesting.rules.StatementAdapter.evaluate(StatementAdapter.java:36)
	at org.apache.lucene.util.TestRuleStoreClassName$1.evaluate(TestRuleStoreClassName.java:41)
	at com.carrotsearch.randomizedtesting.rules.NoShadowingOrOverridesOnMethodsRule$1.evaluate(NoShadowingOrOverridesOnMethodsRule.java:40)
	at com.carrotsearch.randomizedtesting.rules.NoShadowingOrOverridesOnMethodsRule$1.evaluate(NoShadowingOrOverridesOnMethodsRule.java:40)
	at com.carrotsearch.randomizedtesting.rules.StatementAdapter.evaluate(StatementAdapter.java:36)
	at com.carrotsearch.randomizedtesting.rules.StatementAdapter.evaluate(StatementAdapter.java:36)
	at com.carrotsearch.randomizedtesting.rules.StatementAdapter.evaluate(StatementAdapter.java:36)
	at org.apache.lucene.util.TestRuleAssertionsRequired$1.evaluate(TestRuleAssertionsRequired.java:53)
	at org.apache.lucene.util.TestRuleMarkFailure$1.evaluate(TestRuleMarkFailure.java:47)
	at org.apache.lucene.util.TestRuleIgnoreAfterMaxFailures$1.evaluate(TestRuleIgnoreAfterMaxFailures.java:64)
	at org.apache.lucene.util.TestRuleIgnoreTestSuites$1.evaluate(TestRuleIgnoreTestSuites.java:54)
	at com.carrotsearch.randomizedtesting.rules.StatementAdapter.evaluate(StatementAdapter.java:36)
	at com.carrotsearch.randomizedtesting.ThreadLeakControl$StatementRunner.run(ThreadLeakControl.java:368)
	at java.lang.Thread.run(Thread.java:748)


FAILED:  org.apache.solr.index.hdfs.CheckHdfsIndexTest.testChecksumsOnly

Error Message:
Timeout occured while waiting response from server at: https://127.0.0.1:34183/ie/f

Stack Trace:
org.apache.solr.client.solrj.SolrServerException: Timeout occured while waiting response from server at: https://127.0.0.1:34183/ie/f
	at __randomizedtesting.SeedInfo.seed([E297651F29BF3751:4072AC3CCB70CF91]:0)
	at org.apache.solr.client.solrj.impl.HttpSolrClient.executeMethod(HttpSolrClient.java:654)
	at org.apache.solr.client.solrj.impl.HttpSolrClient.request(HttpSolrClient.java:255)
	at org.apache.solr.client.solrj.impl.HttpSolrClient.request(HttpSolrClient.java:244)
	at org.apache.solr.client.solrj.impl.LBHttpSolrClient.doRequest(LBHttpSolrClient.java:483)
	at org.apache.solr.client.solrj.impl.LBHttpSolrClient.request(LBHttpSolrClient.java:413)
	at org.apache.solr.client.solrj.impl.CloudSolrClient.sendRequest(CloudSolrClient.java:1104)
	at org.apache.solr.client.solrj.impl.CloudSolrClient.requestWithRetryOnStaleState(CloudSolrClient.java:884)
	at org.apache.solr.client.solrj.impl.CloudSolrClient.request(CloudSolrClient.java:817)
	at org.apache.solr.client.solrj.SolrRequest.process(SolrRequest.java:194)
	at org.apache.solr.client.solrj.SolrRequest.process(SolrRequest.java:211)
	at org.apache.solr.cloud.AbstractFullDistribZkTestBase.createServers(AbstractFullDistribZkTestBase.java:322)
	at org.apache.solr.BaseDistributedSearchTestCase$ShardsRepeatRule$ShardsFixedStatement.callStatement(BaseDistributedSearchTestCase.java:991)
	at org.apache.solr.BaseDistributedSearchTestCase$ShardsRepeatRule$ShardsStatement.evaluate(BaseDistributedSearchTestCase.java:968)
	at com.carrotsearch.randomizedtesting.rules.SystemPropertiesRestoreRule$1.evaluate(SystemPropertiesRestoreRule.java:57)
	at org.apache.lucene.util.TestRuleSetupTeardownChained$1.evaluate(TestRuleSetupTeardownChained.java:49)
	at org.apache.lucene.util.AbstractBeforeAfterRule$1.evaluate(AbstractBeforeAfterRule.java:45)
	at org.apache.lucene.util.TestRuleThreadAndTestName$1.evaluate(TestRuleThreadAndTestName.java:48)
	at org.apache.lucene.util.TestRuleIgnoreAfterMaxFailures$1.evaluate(TestRuleIgnoreAfterMaxFailures.java:64)
	at org.apache.lucene.util.TestRuleMarkFailure$1.evaluate(TestRuleMarkFailure.java:47)
	at com.carrotsearch.randomizedtesting.rules.StatementAdapter.evaluate(StatementAdapter.java:36)
	at com.carrotsearch.randomizedtesting.ThreadLeakControl$StatementRunner.run(ThreadLeakControl.java:368)
	at com.carrotsearch.randomizedtesting.ThreadLeakControl.forkTimeoutingTask(ThreadLeakControl.java:817)
	at com.carrotsearch.randomizedtesting.ThreadLeakControl$3.evaluate(ThreadLeakControl.java:468)
	at com.carrotsearch.randomizedtesting.RandomizedRunner.runSingleTest(RandomizedRunner.java:943)
	at com.carrotsearch.randomizedtesting.RandomizedRunner$5.evaluate(RandomizedRunner.java:829)
	at com.carrotsearch.randomizedtesting.RandomizedRunner$6.evaluate(RandomizedRunner.java:879)
	at com.carrotsearch.randomizedtesting.RandomizedRunner$7.evaluate(RandomizedRunner.java:890)
	at com.carrotsearch.randomizedtesting.rules.StatementAdapter.evaluate(StatementAdapter.java:36)
	at com.carrotsearch.randomizedtesting.rules.SystemPropertiesRestoreRule$1.evaluate(SystemPropertiesRestoreRule.java:57)
	at org.apache.lucene.util.AbstractBeforeAfterRule$1.evaluate(AbstractBeforeAfterRule.java:45)
	at com.carrotsearch.randomizedtesting.rules.StatementAdapter.evaluate(StatementAdapter.java:36)
	at org.apache.lucene.util.TestRuleStoreClassName$1.evaluate(TestRuleStoreClassName.java:41)
	at com.carrotsearch.randomizedtesting.rules.NoShadowingOrOverridesOnMethodsRule$1.evaluate(NoShadowingOrOverridesOnMethodsRule.java:40)
	at com.carrotsearch.randomizedtesting.rules.NoShadowingOrOverridesOnMethodsRule$1.evaluate(NoShadowingOrOverridesOnMethodsRule.java:40)
	at com.carrotsearch.randomizedtesting.rules.StatementAdapter.evaluate(StatementAdapter.java:36)
	at com.carrotsearch.randomizedtesting.rules.StatementAdapter.evaluate(StatementAdapter.java:36)
	at com.carrotsearch.randomizedtesting.rules.StatementAdapter.evaluate(StatementAdapter.java:36)
	at org.apache.lucene.util.TestRuleAssertionsRequired$1.evaluate(TestRuleAssertionsRequired.java:53)
	at org.apache.lucene.util.TestRuleMarkFailure$1.evaluate(TestRuleMarkFailure.java:47)
	at org.apache.lucene.util.TestRuleIgnoreAfterMaxFailures$1.evaluate(TestRuleIgnoreAfterMaxFailures.java:64)
	at org.apache.lucene.util.TestRuleIgnoreTestSuites$1.evaluate(TestRuleIgnoreTestSuites.java:54)
	at com.carrotsearch.randomizedtesting.rules.StatementAdapter.evaluate(StatementAdapter.java:36)
	at com.carrotsearch.randomizedtesting.ThreadLeakControl$StatementRunner.run(ThreadLeakControl.java:368)
	at java.lang.Thread.run(Thread.java:748)
Caused by: java.net.SocketTimeoutException: Read timed out
	at java.net.SocketInputStream.socketRead0(Native Method)
	at java.net.SocketInputStream.socketRead(SocketInputStream.java:116)
	at java.net.SocketInputStream.read(SocketInputStream.java:171)
	at java.net.SocketInputStream.read(SocketInputStream.java:141)
	at sun.security.ssl.InputRecord.readFully(InputRecord.java:465)
	at sun.security.ssl.InputRecord.read(InputRecord.java:503)
	at sun.security.ssl.SSLSocketImpl.readRecord(SSLSocketImpl.java:983)
	at sun.security.ssl.SSLSocketImpl.readDataRecord(SSLSocketImpl.java:940)
	at sun.security.ssl.AppInputStream.read(AppInputStream.java:105)
	at org.apache.http.impl.io.SessionInputBufferImpl.streamRead(SessionInputBufferImpl.java:137)
	at org.apache.http.impl.io.SessionInputBufferImpl.fillBuffer(SessionInputBufferImpl.java:153)
	at org.apache.http.impl.io.SessionInputBufferImpl.readLine(SessionInputBufferImpl.java:282)
	at org.apache.http.impl.conn.DefaultHttpResponseParser.parseHead(DefaultHttpResponseParser.java:138)
	at org.apache.http.impl.conn.DefaultHttpResponseParser.parseHead(DefaultHttpResponseParser.java:56)
	at org.apache.http.impl.io.AbstractMessageParser.parse(AbstractMessageParser.java:259)
	at org.apache.http.impl.DefaultBHttpClientConnection.receiveResponseHeader(DefaultBHttpClientConnection.java:163)
	at org.apache.http.impl.conn.CPoolProxy.receiveResponseHeader(CPoolProxy.java:165)
	at org.apache.http.protocol.HttpRequestExecutor.doReceiveResponse(HttpRequestExecutor.java:273)
	at org.apache.http.protocol.HttpRequestExecutor.execute(HttpRequestExecutor.java:125)
	at org.apache.http.impl.execchain.MainClientExec.execute(MainClientExec.java:272)
	at org.apache.http.impl.execchain.ProtocolExec.execute(ProtocolExec.java:185)
	at org.apache.http.impl.execchain.RetryExec.execute(RetryExec.java:89)
	at org.apache.http.impl.execchain.RedirectExec.execute(RedirectExec.java:111)
	at org.apache.http.impl.client.InternalHttpClient.doExecute(InternalHttpClient.java:185)
	at org.apache.http.impl.client.CloseableHttpClient.execute(CloseableHttpClient.java:83)
	at org.apache.http.impl.client.CloseableHttpClient.execute(CloseableHttpClient.java:56)
	at org.apache.solr.client.solrj.impl.HttpSolrClient.executeMethod(HttpSolrClient.java:542)
	... 43 more


FAILED:  org.apache.solr.cloud.autoscaling.sim.TestTriggerIntegration.testSearchRate

Error Message:
The trigger did not fire at all

Stack Trace:
java.lang.AssertionError: The trigger did not fire at all
	at __randomizedtesting.SeedInfo.seed([E297651F29BF3751:BFDF7B96E679911E]:0)
	at org.junit.Assert.fail(Assert.java:93)
	at org.junit.Assert.assertTrue(Assert.java:43)
	at org.apache.solr.cloud.autoscaling.sim.TestTriggerIntegration.testSearchRate(TestTriggerIntegration.java:1178)
	at sun.reflect.NativeMethodAccessorImpl.invoke0(Native Method)
	at sun.reflect.NativeMethodAccessorImpl.invoke(NativeMethodAccessorImpl.java:62)
	at sun.reflect.DelegatingMethodAccessorImpl.invoke(DelegatingMethodAccessorImpl.java:43)
	at java.lang.reflect.Method.invoke(Method.java:498)
	at com.carrotsearch.randomizedtesting.RandomizedRunner.invoke(RandomizedRunner.java:1737)
	at com.carrotsearch.randomizedtesting.RandomizedRunner$8.evaluate(RandomizedRunner.java:934)
	at com.carrotsearch.randomizedtesting.RandomizedRunner$9.evaluate(RandomizedRunner.java:970)
	at com.carrotsearch.randomizedtesting.RandomizedRunner$10.evaluate(RandomizedRunner.java:984)
	at com.carrotsearch.randomizedtesting.rules.SystemPropertiesRestoreRule$1.evaluate(SystemPropertiesRestoreRule.java:57)
	at org.apache.lucene.util.TestRuleSetupTeardownChained$1.evaluate(TestRuleSetupTeardownChained.java:49)
	at org.apache.lucene.util.AbstractBeforeAfterRule$1.evaluate(AbstractBeforeAfterRule.java:45)
	at org.apache.lucene.util.TestRuleThreadAndTestName$1.evaluate(TestRuleThreadAndTestName.java:48)
	at org.apache.lucene.util.TestRuleIgnoreAfterMaxFailures$1.evaluate(TestRuleIgnoreAfterMaxFailures.java:64)
	at org.apache.lucene.util.TestRuleMarkFailure$1.evaluate(TestRuleMarkFailure.java:47)
	at com.carrotsearch.randomizedtesting.rules.StatementAdapter.evaluate(StatementAdapter.java:36)
	at com.carrotsearch.randomizedtesting.ThreadLeakControl$StatementRunner.run(ThreadLeakControl.java:368)
	at com.carrotsearch.randomizedtesting.ThreadLeakControl.forkTimeoutingTask(ThreadLeakControl.java:817)
	at com.carrotsearch.randomizedtesting.ThreadLeakControl$3.evaluate(ThreadLeakControl.java:468)
	at com.carrotsearch.randomizedtesting.RandomizedRunner.runSingleTest(RandomizedRunner.java:943)
	at com.carrotsearch.randomizedtesting.RandomizedRunner$5.evaluate(RandomizedRunner.java:829)
	at com.carrotsearch.randomizedtesting.RandomizedRunner$6.evaluate(RandomizedRunner.java:879)
	at com.carrotsearch.randomizedtesting.RandomizedRunner$7.evaluate(RandomizedRunner.java:890)
	at com.carrotsearch.randomizedtesting.rules.StatementAdapter.evaluate(StatementAdapter.java:36)
	at com.carrotsearch.randomizedtesting.rules.SystemPropertiesRestoreRule$1.evaluate(SystemPropertiesRestoreRule.java:57)
	at org.apache.lucene.util.AbstractBeforeAfterRule$1.evaluate(AbstractBeforeAfterRule.java:45)
	at com.carrotsearch.randomizedtesting.rules.StatementAdapter.evaluate(StatementAdapter.java:36)
	at org.apache.lucene.util.TestRuleStoreClassName$1.evaluate(TestRuleStoreClassName.java:41)
	at com.carrotsearch.randomizedtesting.rules.NoShadowingOrOverridesOnMethodsRule$1.evaluate(NoShadowingOrOverridesOnMethodsRule.java:40)
	at com.carrotsearch.randomizedtesting.rules.NoShadowingOrOverridesOnMethodsRule$1.evaluate(NoShadowingOrOverridesOnMethodsRule.java:40)
	at com.carrotsearch.randomizedtesting.rules.StatementAdapter.evaluate(StatementAdapter.java:36)
	at com.carrotsearch.randomizedtesting.rules.StatementAdapter.evaluate(StatementAdapter.java:36)
	at com.carrotsearch.randomizedtesting.rules.StatementAdapter.evaluate(StatementAdapter.java:36)
	at org.apache.lucene.util.TestRuleAssertionsRequired$1.evaluate(TestRuleAssertionsRequired.java:53)
	at org.apache.lucene.util.TestRuleMarkFailure$1.evaluate(TestRuleMarkFailure.java:47)
	at org.apache.lucene.util.TestRuleIgnoreAfterMaxFailures$1.evaluate(TestRuleIgnoreAfterMaxFailures.java:64)
	at org.apache.lucene.util.TestRuleIgnoreTestSuites$1.evaluate(TestRuleIgnoreTestSuites.java:54)
	at com.carrotsearch.randomizedtesting.rules.StatementAdapter.evaluate(StatementAdapter.java:36)
	at com.carrotsearch.randomizedtesting.ThreadLeakControl$StatementRunner.run(ThreadLeakControl.java:368)
	at java.lang.Thread.run(Thread.java:748)




Build Log:
[...truncated 12183 lines...]
   [junit4] Suite: org.apache.solr.cloud.MoveReplicaHDFSTest
   [junit4]   2> 1    INFO  (SUITE-MoveReplicaHDFSTest-seed#[E297651F29BF3751]-worker) [    ] o.a.s.SolrTestCaseJ4 SecureRandom sanity checks: test.solr.allowed.securerandom=null & java.security.egd=file:/dev/./urandom
   [junit4]   2> Creating dataDir: /x1/jenkins/jenkins-slave/workspace/Lucene-Solr-Tests-master/solr/build/solr-core/test/J0/temp/solr.cloud.MoveReplicaHDFSTest_E297651F29BF3751-001/init-core-data-001
   [junit4]   2> 2733 INFO  (SUITE-MoveReplicaHDFSTest-seed#[E297651F29BF3751]-worker) [    ] o.a.s.SolrTestCaseJ4 Using PointFields (NUMERIC_POINTS_SYSPROP=true) w/NUMERIC_DOCVALUES_SYSPROP=false
   [junit4]   2> 3208 INFO  (SUITE-MoveReplicaHDFSTest-seed#[E297651F29BF3751]-worker) [    ] o.e.j.u.log Logging initialized @25534ms to org.eclipse.jetty.util.log.Slf4jLog
   [junit4]   2> 3269 INFO  (SUITE-MoveReplicaHDFSTest-seed#[E297651F29BF3751]-worker) [    ] o.a.s.SolrTestCaseJ4 Randomized ssl (true) and clientAuth (false) via: @org.apache.solr.util.RandomizeSSL(reason=, ssl=NaN, value=NaN, clientAuth=NaN)
   [junit4]   2> 8987 INFO  (SUITE-MoveReplicaHDFSTest-seed#[E297651F29BF3751]-worker) [    ] o.a.s.c.MiniSolrCloudCluster Starting cluster of 4 servers in /x1/jenkins/jenkins-slave/workspace/Lucene-Solr-Tests-master/solr/build/solr-core/test/J0/temp/solr.cloud.MoveReplicaHDFSTest_E297651F29BF3751-001/tempDir-001
   [junit4]   2> 9216 INFO  (SUITE-MoveReplicaHDFSTest-seed#[E297651F29BF3751]-worker) [    ] o.a.s.c.ZkTestServer STARTING ZK TEST SERVER
   [junit4]   2> 9228 INFO  (Thread-1) [    ] o.a.s.c.ZkTestServer client port:0.0.0.0/0.0.0.0:0
   [junit4]   2> 9252 INFO  (Thread-1) [    ] o.a.s.c.ZkTestServer Starting server
   [junit4]   2> 10048 INFO  (SUITE-MoveReplicaHDFSTest-seed#[E297651F29BF3751]-worker) [    ] o.a.s.c.ZkTestServer start zk server on port:52354
   [junit4]   2> 10854 WARN  (NIOServerCxn.Factory:0.0.0.0/0.0.0.0:0) [    ] o.a.z.s.NIOServerCnxn Exception causing close of session 0x0: ZooKeeperServer not running
   [junit4]   2> 11424 ERROR (Thread-1) [    ] o.a.z.s.ZooKeeperServer ZKShutdownHandler is not registered, so ZooKeeper server won't take any action on ERROR or SHUTDOWN server state changes
   [junit4]   2> 12946 INFO  (zkConnectionManagerCallback-4-thread-1) [    ] o.a.s.c.c.ConnectionManager zkClient has connected
   [junit4]   2> 13310 WARN  (NIOServerCxn.Factory:0.0.0.0/0.0.0.0:0) [    ] o.a.z.s.NIOServerCnxn Unable to read additional data from client sessionid 0x104386535e70000, likely client has closed socket
   [junit4]   2> 15972 INFO  (jetty-launcher-1-thread-2) [    ] o.e.j.s.Server jetty-9.4.8.v20171121, build timestamp: 2017-11-21T14:27:37-07:00, git hash: 82b8fb23f757335bb3329d540ce37a2a2615f0a8
   [junit4]   2> 15986 INFO  (jetty-launcher-1-thread-4) [    ] o.e.j.s.Server jetty-9.4.8.v20171121, build timestamp: 2017-11-21T14:27:37-07:00, git hash: 82b8fb23f757335bb3329d540ce37a2a2615f0a8
   [junit4]   2> 15986 INFO  (jetty-launcher-1-thread-3) [    ] o.e.j.s.Server jetty-9.4.8.v20171121, build timestamp: 2017-11-21T14:27:37-07:00, git hash: 82b8fb23f757335bb3329d540ce37a2a2615f0a8
   [junit4]   2> 15987 INFO  (jetty-launcher-1-thread-1) [    ] o.e.j.s.Server jetty-9.4.8.v20171121, build timestamp: 2017-11-21T14:27:37-07:00, git hash: 82b8fb23f757335bb3329d540ce37a2a2615f0a8
   [junit4]   2> 16093 INFO  (jetty-launcher-1-thread-3) [    ] o.e.j.s.session DefaultSessionIdManager workerName=node0
   [junit4]   2> 16093 INFO  (jetty-launcher-1-thread-3) [    ] o.e.j.s.session No SessionScavenger set, using defaults
   [junit4]   2> 16097 INFO  (jetty-launcher-1-thread-3) [    ] o.e.j.s.session Scavenging every 600000ms
   [junit4]   2> 16177 INFO  (jetty-launcher-1-thread-3) [    ] o.e.j.s.h.ContextHandler Started o.e.j.s.ServletContextHandler@47b6490e{/solr,null,AVAILABLE}
   [junit4]   2> 16150 INFO  (jetty-launcher-1-thread-2) [    ] o.e.j.s.session DefaultSessionIdManager workerName=node0
   [junit4]   2> 16188 INFO  (jetty-launcher-1-thread-2) [    ] o.e.j.s.session No SessionScavenger set, using defaults
   [junit4]   2> 16188 INFO  (jetty-launcher-1-thread-2) [    ] o.e.j.s.session Scavenging every 600000ms
   [junit4]   2> 16248 INFO  (jetty-launcher-1-thread-1) [    ] o.e.j.s.session DefaultSessionIdManager workerName=node0
   [junit4]   2> 16248 INFO  (jetty-launcher-1-thread-1) [    ] o.e.j.s.session No SessionScavenger set, using defaults
   [junit4]   2> 16248 INFO  (jetty-launcher-1-thread-1) [    ] o.e.j.s.session Scavenging every 600000ms
   [junit4]   2> 16236 INFO  (jetty-launcher-1-thread-2) [    ] o.e.j.s.h.ContextHandler Started o.e.j.s.ServletContextHandler@6e491b16{/solr,null,AVAILABLE}
   [junit4]   2> 16256 INFO  (jetty-launcher-1-thread-4) [    ] o.e.j.s.session DefaultSessionIdManager workerName=node0
   [junit4]   2> 16256 INFO  (jetty-launcher-1-thread-4) [    ] o.e.j.s.session No SessionScavenger set, using defaults
   [junit4]   2> 16256 INFO  (jetty-launcher-1-thread-4) [    ] o.e.j.s.session Scavenging every 600000ms
   [junit4]   2> 16268 INFO  (jetty-launcher-1-thread-1) [    ] o.e.j.s.h.ContextHandler Started o.e.j.s.ServletContextHandler@c12a692{/solr,null,AVAILABLE}
   [junit4]   2> 16340 INFO  (jetty-launcher-1-thread-4) [    ] o.e.j.s.h.ContextHandler Started o.e.j.s.ServletContextHandler@6b6daf89{/solr,null,AVAILABLE}
   [junit4]   2> 16535 INFO  (jetty-launcher-1-thread-4) [    ] o.e.j.s.AbstractConnector Started ServerConnector@2fe5d2b1{SSL,[ssl, http/1.1]}{127.0.0.1:36441}
   [junit4]   2> 16535 INFO  (jetty-launcher-1-thread-4) [    ] o.e.j.s.Server Started @38885ms
   [junit4]   2> 16536 INFO  (jetty-launcher-1-thread-4) [    ] o.a.s.c.s.e.JettySolrRunner Jetty properties: {hostContext=/solr, hostPort=36441}
   [junit4]   2> 16564 INFO  (jetty-launcher-1-thread-1) [    ] o.e.j.s.AbstractConnector Started ServerConnector@381ac886{SSL,[ssl, http/1.1]}{127.0.0.1:56319}
   [junit4]   2> 16582 INFO  (jetty-launcher-1-thread-1) [    ] o.e.j.s.Server Started @38932ms
   [junit4]   2> 16565 INFO  (jetty-launcher-1-thread-3) [    ] o.e.j.s.AbstractConnector Started ServerConnector@3e821b39{SSL,[ssl, http/1.1]}{127.0.0.1:41516}
   [junit4]   2> 16583 INFO  (jetty-launcher-1-thread-3) [    ] o.e.j.s.Server Started @38932ms
   [junit4]   2> 16564 INFO  (jetty-launcher-1-thread-2) [    ] o.e.j.s.AbstractConnector Started ServerConnector@3309b14{SSL,[ssl, http/1.1]}{127.0.0.1:51910}
   [junit4]   2> 16583 INFO  (jetty-launcher-1-thread-2) [    ] o.e.j.s.Server Started @38933ms
   [junit4]   2> 16583 INFO  (jetty-launcher-1-thread-3) [    ] o.a.s.c.s.e.JettySolrRunner Jetty properties: {hostContext=/solr, hostPort=41516}
   [junit4]   2> 16583 INFO  (jetty-launcher-1-thread-2) [    ] o.a.s.c.s.e.JettySolrRunner Jetty properties: {hostContext=/solr, hostPort=51910}
   [junit4]   2> 16583 INFO  (jetty-launcher-1-thread-1) [    ] o.a.s.c.s.e.JettySolrRunner Jetty properties: {hostContext=/solr, hostPort=56319}
   [junit4]   2> 16887 ERROR (jetty-launcher-1-thread-1) [    ] o.a.s.u.StartupLoggingUtils Missing Java Option solr.log.dir. Logging may be missing or incomplete.
   [junit4]   2> 16887 INFO  (jetty-launcher-1-thread-1) [    ] o.a.s.s.SolrDispatchFilter  ___      _       Welcome to Apache Solr? version 8.0.0
   [junit4]   2> 17868 ERROR (jetty-launcher-1-thread-2) [    ] o.a.s.u.StartupLoggingUtils Missing Java Option solr.log.dir. Logging may be missing or incomplete.
   [junit4]   2> 17868 ERROR (jetty-launcher-1-thread-4) [    ] o.a.s.u.StartupLoggingUtils Missing Java Option solr.log.dir. Logging may be missing or incomplete.
   [junit4]   2> 16888 ERROR (jetty-launcher-1-thread-3) [    ] o.a.s.u.StartupLoggingUtils Missing Java Option solr.log.dir. Logging may be missing or incomplete.
   [junit4]   2> 17904 INFO  (jetty-launcher-1-thread-1) [    ] o.a.s.s.SolrDispatchFilter / __| ___| |_ _   Starting in cloud mode on port null
   [junit4]   2> 17905 INFO  (jetty-launcher-1-thread-1) [    ] o.a.s.s.SolrDispatchFilter \__ \/ _ \ | '_|  Install dir: null
   [junit4]   2> 17888 INFO  (jetty-launcher-1-thread-3) [    ] o.a.s.s.SolrDispatchFilter  ___      _       Welcome to Apache Solr? version 8.0.0
   [junit4]   2> 17928 INFO  (jetty-launcher-1-thread-3) [    ] o.a.s.s.SolrDispatchFilter / __| ___| |_ _   Starting in cloud mode on port null
   [junit4]   2> 17928 INFO  (jetty-launcher-1-thread-3) [    ] o.a.s.s.SolrDispatchFilter \__ \/ _ \ | '_|  Install dir: null
   [junit4]   2> 17888 INFO  (jetty-launcher-1-thread-4) [    ] o.a.s.s.SolrDispatchFilter  ___      _       Welcome to Apache Solr? version 8.0.0
   [junit4]   2> 17932 INFO  (jetty-launcher-1-thread-4) [    ] o.a.s.s.SolrDispatchFilter / __| ___| |_ _   Starting in cloud mode on port null
   [junit4]   2> 17932 INFO  (jetty-launcher-1-thread-4) [    ] o.a.s.s.SolrDispatchFilter \__ \/ _ \ | '_|  Install dir: null
   [junit4]   2> 17887 INFO  (jetty-launcher-1-thread-2) [    ] o.a.s.s.SolrDispatchFilter  ___      _       Welcome to Apache Solr? version 8.0.0
   [junit4]   2> 17932 INFO  (jetty-launcher-1-thread-2) [    ] o.a.s.s.SolrDispatchFilter / __| ___| |_ _   Starting in cloud mode on port null
   [junit4]   2> 17932 INFO  (jetty-launcher-1-thread-2) [    ] o.a.s.s.SolrDispatchFilter \__ \/ _ \ | '_|  Install dir: null
   [junit4]   2> 18946 INFO  (jetty-launcher-1-thread-1) [    ] o.a.s.s.SolrDispatchFilter |___/\___/_|_|    Start time: 2018-02-05T23:42:03.169Z
   [junit4]   2> 18964 INFO  (jetty-launcher-1-thread-2) [    ] o.a.s.s.SolrDispatchFilter |___/\___/_|_|    Start time: 2018-02-05T23:42:03.169Z
   [junit4]   2> 18964 INFO  (jetty-launcher-1-thread-4) [    ] o.a.s.s.SolrDispatchFilter |___/\___/_|_|    Start time: 2018-02-05T23:42:03.169Z
   [junit4]   2> 19007 INFO  (jetty-launcher-1-thread-3) [    ] o.a.s.s.SolrDispatchFilter |___/\___/_|_|    Start time: 2018-02-05T23:42:03.166Z
   [junit4]   2> 19355 INFO  (jetty-launcher-1-thread-4) [    ] o.a.s.c.SolrResourceLoader solr home defaulted to 'solr/' (could not find system property or JNDI)
   [junit4]   2> 20504 INFO  (zkConnectionManagerCallback-8-thread-1) [    ] o.a.s.c.c.ConnectionManager zkClient has connected
   [junit4]   2> 20580 INFO  (zkConnectionManagerCallback-6-thread-1) [    ] o.a.s.c.c.ConnectionManager zkClient has connected
   [junit4]   2> 20580 INFO  (zkConnectionManagerCallback-12-thread-1) [    ] o.a.s.c.c.ConnectionManager zkClient has connected
   [junit4]   2> 20656 INFO  (zkConnectionManagerCallback-10-thread-1) [    ] o.a.s.c.c.ConnectionManager zkClient has connected
   [junit4]   2> 20665 INFO  (jetty-launcher-1-thread-1) [    ] o.a.s.s.SolrDispatchFilter solr.xml found in ZooKeeper. Loading...
   [junit4]   2> 20667 INFO  (jetty-launcher-1-thread-3) [    ] o.a.s.s.SolrDispatchFilter solr.xml found in ZooKeeper. Loading...
   [junit4]   2> 20724 INFO  (jetty-launcher-1-thread-2) [    ] o.a.s.s.SolrDispatchFilter solr.xml found in ZooKeeper. Loading...
   [junit4]   2> 20725 INFO  (jetty-launcher-1-thread-4) [    ] o.a.s.s.SolrDispatchFilter solr.xml found in ZooKeeper. Loading...
   [junit4]   2> 22870 WARN  (NIOServerCxn.Factory:0.0.0.0/0.0.0.0:0) [    ] o.a.z.s.NIOServerCnxn Unable to read additional data from client sessionid 0x104386535e70001, likely client has closed socket
   [junit4]   2> 26482 INFO  (jetty-launcher-1-thread-4) [    ] o.a.s.c.ZkContainer Zookeeper client=127.0.0.1:52354/solr
   [junit4]   2> 26492 INFO  (jetty-launcher-1-thread-3) [    ] o.a.s.c.ZkContainer Zookeeper client=127.0.0.1:52354/solr
   [junit4]   2> 26512 INFO  (jetty-launcher-1-thread-2) [    ] o.a.s.c.ZkContainer Zookeeper client=127.0.0.1:52354/solr
   [junit4]   2> 26568 INFO  (jetty-launcher-1-thread-1) [    ] o.a.s.c.ZkContainer Zookeeper client=127.0.0.1:52354/solr
   [junit4]   2> 26937 INFO  (zkConnectionManagerCallback-22-thread-1) [    ] o.a.s.c.c.ConnectionManager zkClient has connected
   [junit4]   2> 26937 INFO  (zkConnectionManagerCallback-24-thread-1) [    ] o.a.s.c.c.ConnectionManager zkClient has connected
   [junit4]   2> 26948 INFO  (zkConnectionManagerCallback-28-thread-1) [    ] o.a.s.c.c.ConnectionManager zkClient has connected
   [junit4]   2> 26938 INFO  (zkConnectionManagerCallback-26-thread-1) [    ] o.a.s.c.c.ConnectionManager zkClient has connected
   [junit4]   2> 27046 DEBUG (jetty-launcher-1-thread-4) [n:127.0.0.1:36441_solr    ] o.a.s.c.ZkController Added new OnReconnect listener org.apache.solr.cloud.ZkController$$Lambda$42/1167714566@122108be
   [junit4]   2> 27056 DEBUG (jetty-launcher-1-thread-2) [n:127.0.0.1:51910_solr    ] o.a.s.c.ZkController Added new OnReconnect listener org.apache.solr.cloud.ZkController$$Lambda$42/1167714566@2af3e196
   [junit4]   2> 27104 DEBUG (jetty-launcher-1-thread-1) [n:127.0.0.1:56319_solr    ] o.a.s.c.ZkController Added new OnReconnect listener org.apache.solr.cloud.ZkController$$Lambda$42/1167714566@42bc1b05
   [junit4]   2> 27112 DEBUG (jetty-launcher-1-thread-3) [n:127.0.0.1:41516_solr    ] o.a.s.c.ZkController Added new OnReconnect listener org.apache.solr.cloud.ZkController$$Lambda$42/1167714566@6fc67729
   [junit4]   2> 27213 INFO  (zkConnectionManagerCallback-30-thread-1-processing-n:127.0.0.1:36441_solr) [n:127.0.0.1:36441_solr    ] o.a.s.c.c.ConnectionManager zkClient has connected
   [junit4]   2> 27232 INFO  (zkConnectionManagerCallback-36-thread-1-processing-n:127.0.0.1:41516_solr) [n:127.0.0.1:41516_solr    ] o.a.s.c.c.ConnectionManager zkClient has connected
   [junit4]   2> 27248 INFO  (zkConnectionManagerCallback-34-thread-1-processing-n:127.0.0.1:56319_solr) [n:127.0.0.1:56319_solr    ] o.a.s.c.c.ConnectionManager zkClient has connected
   [junit4]   2> 27284 INFO  (zkConnectionManagerCallback-32-thread-1-processing-n:127.0.0.1:51910_solr) [n:127.0.0.1:51910_solr    ] o.a.s.c.c.ConnectionManager zkClient has connected
   [junit4]   2> 32184 DEBUG (SyncThread:0) [    ] o.a.s.c.ZkTestServer Watch added: data: /solr/clusterprops.json
   [junit4]   2> 32195 DEBUG (SyncThread:0) [    ] o.a.s.c.ZkTestServer Watch added: data: /solr/clusterprops.json
   [junit4]   2> 32195 DEBUG (SyncThread:0) [    ] o.a.s.c.ZkTestServer Watch added: data: /solr/clusterprops.json
   [junit4]   2> 32196 DEBUG (SyncThread:0) [    ] o.a.s.c.ZkTestServer Watch added: children: /solr/live_nodes
   [junit4]   2> 32197 DEBUG (SyncThread:0) [    ] o.a.s.c.ZkTestServer Watch added: children: /solr/live_nodes
   [junit4]   2> 32198 DEBUG (SyncThread:0) [    ] o.a.s.c.ZkTestServer Watch added: children: /solr/live_nodes
   [junit4]   2> 32198 DEBUG (SyncThread:0) [    ] o.a.s.c.ZkTestServer Watch added: data: /solr/clusterstate.json
   [junit4]   2> 32200 DEBUG (SyncThread:0) [    ] o.a.s.c.ZkTestServer Watch added: data: /solr/clusterstate.json
   [junit4]   2> 32201 DEBUG (SyncThread:0) [    ] o.a.s.c.ZkTestServer Watch added: data: /solr/clusterstate.json
   [junit4]   2> 32202 DEBUG (SyncThread:0) [    ] o.a.s.c.ZkTestServer Watch added: children: /solr/collections
   [junit4]   2> 32203 DEBUG (SyncThread:0) [    ] o.a.s.c.ZkTestServer Watch added: children: /solr/collections
   [junit4]   2> 32203 DEBUG (SyncThread:0) [    ] o.a.s.c.ZkTestServer Watch added: children: /solr/collections
   [junit4]   2> 32204 DEBUG (SyncThread:0) [    ] o.a.s.c.ZkTestServer Watch added: create/delete: /solr/aliases.json
   [junit4]   2> 32204 DEBUG (SyncThread:0) [    ] o.a.s.c.ZkTestServer Watch added: create/delete: /solr/aliases.json
   [junit4]   2> 32204 DEBUG (SyncThread:0) [    ] o.a.s.c.ZkTestServer Watch added: create/delete: /solr/aliases.json
   [junit4]   2> 32265 DEBUG (SyncThread:0) [    ] o.a.s.c.ZkTestServer Watch added: create/delete: /solr/security.json
   [junit4]   2> 32268 DEBUG (SyncThread:0) [    ] o.a.s.c.ZkTestServer Watch added: create/delete: /solr/security.json
   [junit4]   2> 32268 DEBUG (SyncThread:0) [    ] o.a.s.c.ZkTestServer Watch added: create/delete: /solr/security.json
   [junit4]   2> 32324 INFO  (jetty-launcher-1-thread-3) [n:127.0.0.1:41516_solr    ] o.a.s.c.Overseer Overseer (id=null) closing
   [junit4]   2> 32324 INFO  (jetty-launcher-1-thread-1) [n:127.0.0.1:56319_solr    ] o.a.s.c.Overseer Overseer (id=null) closing
   [junit4]   2> 32336 DEBUG (jetty-launcher-1-thread-3) [n:127.0.0.1:41516_solr    ] o.a.s.c.LeaderElector Joined leadership election with path: /overseer_elect/election/73245501291954186-127.0.0.1:41516_solr-n_0000000000
   [junit4]   2> 32337 DEBUG (jetty-launcher-1-thread-1) [n:127.0.0.1:56319_solr    ] o.a.s.c.LeaderElector Joined leadership election with path: /overseer_elect/election/73245501291954188-127.0.0.1:56319_solr-n_0000000001
   [junit4]   2> 32338 INFO  (jetty-launcher-1-thread-2) [n:127.0.0.1:51910_solr    ] o.a.s.c.Overseer Overseer (id=null) closing
   [junit4]   2> 32339 INFO  (jetty-launcher-1-thread-3) [n:127.0.0.1:41516_solr    ] o.a.s.c.OverseerElectionContext I am going to be the leader 127.0.0.1:41516_solr
   [junit4]   2> 32357 DEBUG (jetty-launcher-1-thread-2) [n:127.0.0.1:51910_solr    ] o.a.s.c.LeaderElector Joined leadership election with path: /overseer_elect/election/73245501291954187-127.0.0.1:51910_solr-n_0000000002
   [junit4]   2> 32360 DEBUG (SyncThread:0) [    ] o.a.s.c.ZkTestServer Watch added: data: /solr/overseer_elect/election/73245501291954186-127.0.0.1:41516_solr-n_0000000000
   [junit4]   2> 32360 DEBUG (jetty-launcher-1-thread-1) [n:127.0.0.1:56319_solr    ] o.a.s.c.LeaderElector Watching path /overseer_elect/election/73245501291954186-127.0.0.1:41516_solr-n_0000000000 to know if I could be the leader
   [junit4]   2> 32368 INFO  (jetty-launcher-1-thread-1) [n:127.0.0.1:56319_solr    ] o.a.s.c.ZkController Register node as live in ZooKeeper:/live_nodes/127.0.0.1:56319_solr
   [junit4]   2> 32387 DEBUG (SyncThread:0) [    ] o.a.s.c.ZkTestServer Watch added: data: /solr/overseer_elect/election/73245501291954188-127.0.0.1:56319_solr-n_0000000001
   [junit4]   2> 32387 DEBUG (jetty-launcher-1-thread-2) [n:127.0.0.1:51910_solr    ] o.a.s.c.LeaderElector Watching path /overseer_elect/election/73245501291954188-127.0.0.1:56319_solr-n_0000000001 to know if I could be the leader
   [junit4]   2> 32404 INFO  (jetty-launcher-1-thread-2) [n:127.0.0.1:51910_solr    ] o.a.s.c.ZkController Register node as live in ZooKeeper:/live_nodes/127.0.0.1:51910_solr
   [junit4]   2> 32404 INFO  (jetty-launcher-1-thread-3) [n:127.0.0.1:41516_solr    ] o.a.s.c.Overseer Overseer (id=73245501291954186-127.0.0.1:41516_solr-n_0000000000) starting
   [junit4]   2> 32436 DEBUG (SyncThread:0) [    ] o.a.s.c.ZkTestServer Watch fired: children: /solr/live_nodes
   [junit4]   2> 32464 DEBUG (SyncThread:0) [    ] o.a.s.c.ZkTestServer Watch fired: children: /solr/live_nodes
   [junit4]   2> 32468 DEBUG (SyncThread:0) [    ] o.a.s.c.ZkTestServer Watch fired: children: /solr/live_nodes
   [junit4]   2> 32500 DEBUG (SyncThread:0) [    ] o.a.s.c.ZkTestServer Watch added: children: /solr/live_nodes
   [junit4]   2> 32568 DEBUG (SyncThread:0) [    ] o.a.s.c.ZkTestServer Watch added: children: /solr/live_nodes
   [junit4]   2> 32652 INFO  (zkCallback-31-thread-1-processing-n:127.0.0.1:51910_solr) [n:127.0.0.1:51910_solr    ] o.a.s.c.c.ZkStateReader Updated live nodes from ZooKeeper... (0) -> (2)
   [junit4]   2> 32653 INFO  (zkCallback-35-thread-1-processing-n:127.0.0.1:41516_solr) [n:127.0.0.1:41516_solr    ] o.a.s.c.c.ZkStateReader Updated live nodes from ZooKeeper... (0) -> (2)
   [junit4]   2> 33000 DEBUG (SyncThread:0) [    ] o.a.s.c.ZkTestServer Watch added: children: /solr/live_nodes
   [junit4]   2> 33052 INFO  (zkCallback-33-thread-1-processing-n:127.0.0.1:56319_solr) [n:127.0.0.1:56319_solr    ] o.a.s.c.c.ZkStateReader Updated live nodes from ZooKeeper... (0) -> (2)
   [junit4]   2> 33653 DEBUG (SyncThread:0) [    ] o.a.s.c.ZkTestServer Watch added: data: /solr/clusterprops.json
   [junit4]   2> 33654 DEBUG (SyncThread:0) [    ] o.a.s.c.ZkTestServer Watch added: children: /solr/live_nodes
   [junit4]   2> 33654 INFO  (jetty-launcher-1-thread-4) [n:127.0.0.1:36441_solr    ] o.a.s.c.c.ZkStateReader Updated live nodes from ZooKeeper... (0) -> (2)
   [junit4]   2> 33654 DEBUG (SyncThread:0) [    ] o.a.s.c.ZkTestServer Watch added: data: /solr/clusterstate.json
   [junit4]   2> 33664 DEBUG (SyncThread:0) [    ] o.a.s.c.ZkTestServer Watch added: children: /solr/collections
   [junit4]   2> 33664 DEBUG (SyncThread:0) [    ] o.a.s.c.ZkTestServer Watch added: create/delete: /solr/aliases.json
   [junit4]   2> 33682 DEBUG (SyncThread:0) [    ] o.a.s.c.ZkTestServer Watch added: create/delete: /solr/security.json
   [junit4]   2> 33684 INFO  (jetty-launcher-1-thread-4) [n:127.0.0.1:36441_solr    ] o.a.s.c.Overseer Overseer (id=null) closing
   [junit4]   2> 34044 DEBUG (jetty-launcher-1-thread-4) [n:127.0.0.1:36441_solr    ] o.a.s.c.LeaderElector Joined leadership election with path: /overseer_elect/election/73245501291954185-127.0.0.1:36441_solr-n_0000000003
   [junit4]   2> 34044 DEBUG (SyncThread:0) [    ] o.a.s.c.ZkTestServer Watch added: data: /solr/overseer_elect/election/73245501291954187-127.0.0.1:51910_solr-n_0000000002
   [junit4]   2> 34045 DEBUG (jetty-launcher-1-thread-4) [n:127.0.0.1:36441_solr    ] o.a.s.c.LeaderElector Watching path /overseer_elect/election/73245501291954187-127.0.0.1:51910_solr-n_0000000002 to know if I could be the leader
   [junit4]   2> 34045 DEBUG (jetty-launcher-1-thread-4) [n:127.0.0.1:36441_solr    ] o.a.s.c.ZkController Publish node=127.0.0.1:36441_solr as DOWN
   [junit4]   2> 34095 INFO  (jetty-launcher-1-thread-4) [n:127.0.0.1:36441_solr    ] o.a.s.c.ZkController Register node as live in ZooKeeper:/live_nodes/127.0.0.1:36441_solr
   [junit4]   2> 34128 DEBUG (SyncThread:0) [    ] o.a.s.c.ZkTestServer Watch fired: children: /solr/live_nodes
   [junit4]   2> 34129 DEBUG (SyncThread:0) [    ] o.a.s.c.ZkTestServer Watch fired: children: /solr/live_nodes
   [junit4]   2> 34129 DEBUG (SyncThread:0) [    ] o.a.s.c.ZkTestServer Watch fired: children: /solr/live_nodes
   [junit4]   2> 34129 DEBUG (SyncThread:0) [    ] o.a.s.c.ZkTestServer Watch fired: children: /solr/live_nodes
   [junit4]   2> 34130 DEBUG (SyncThread:0) [    ] o.a.s.c.ZkTestServer Watch added: children: /solr/live_nodes
   [junit4]   2> 34131 INFO  (zkCallback-33-thread-1-processing-n:127.0.0.1:56319_solr) [n:127.0.0.1:56319_solr    ] o.a.s.c.c.ZkStateReader Updated live nodes from ZooKeeper... (2) -> (3)
   [junit4]   2> 34142 DEBUG (SyncThread:0) [    ] o.a.s.c.ZkTestServer Watch added: children: /solr/live_nodes
   [junit4]   2> 34142 INFO  (zkCallback-31-thread-1-processing-n:127.0.0.1:51910_solr) [n:127.0.0.1:51910_solr    ] o.a.s.c.c.ZkStateReader Updated live nodes from ZooKeeper... (2) -> (3)
   [junit4]   2> 34142 DEBUG (SyncThread:0) [    ] o.a.s.c.ZkTestServer Watch added: children: /solr/live_nodes
   [junit4]   2> 34143 INFO  (zkCallback-35-thread-1-processing-n:127.0.0.1:41516_solr) [n:127.0.0.1:41516_solr    ] o.a.s.c.c.ZkStateReader Updated live nodes from ZooKeeper... (2) -> (3)
   [junit4]   2> 34344 DEBUG (SyncThread:0) [    ] o.a.s.c.ZkTestServer Watch added: children: /solr/live_nodes
   [junit4]   2> 34368 INFO  (zkCallback-29-thread-1-processing-n:127.0.0.1:36441_solr) [n:127.0.0.1:36441_solr    ] o.a.s.c.c.ZkStateReader Updated live nodes from ZooKeeper... (2) -> (3)
   [junit4]   2> 34955 DEBUG (OverseerStateUpdate-73245501291954186-127.0.0.1:41516_solr-n_0000000000) [n:127.0.0.1:41516_solr    ] o.a.s.c.Overseer Starting to work on the main queue
   [junit4]   2> 34973 DEBUG (OverseerCollectionConfigSetProcessor-73245501291954186-127.0.0.1:41516_solr-n_0000000000) [n:127.0.0.1:41516_solr    ] o.a.s.c.OverseerTaskProcessor Process current queue of overseer operations
   [junit4]   2> 35020 DEBUG (jetty-launcher-1-thread-3) [n:127.0.0.1:41516_solr    ] o.a.s.c.ZkController Publish node=127.0.0.1:41516_solr as DOWN
   [junit4]   2> 35022 INFO  (jetty-launcher-1-thread-3) [n:127.0.0.1:41516_solr    ] o.a.s.c.ZkController Register node as live in ZooKeeper:/live_nodes/127.0.0.1:41516_solr
   [junit4]   2> 35023 DEBUG (SyncThread:0) [    ] o.a.s.c.ZkTestServer Watch fired: children: /solr/live_nodes
   [junit4]   2> 35023 DEBUG (SyncThread:0) [    ] o.a.s.c.ZkTestServer Watch fired: children: /solr/live_nodes
   [junit4]   2> 35023 DEBUG (SyncThread:0) [    ] o.a.s.c.ZkTestServer Watch fired: children: /solr/live_nodes
   [junit4]   2> 35023 DEBUG (SyncThread:0) [    ] o.a.s.c.ZkTestServer Watch fired: children: /solr/live_nodes
   [junit4]   2> 35024 DEBUG (SyncThread:0) [    ] o.a.s.c.ZkTestServer Watch added: children: /solr/live_nodes
   [junit4]   2> 35024 DEBUG (SyncThread:0) [    ] o.a.s.c.ZkTestServer Watch added: children: /solr/live_nodes
   [junit4]   2> 35028 INFO  (zkCallback-31-thread-1-processing-n:127.0.0.1:51910_solr) [n:127.0.0.1:51910_solr    ] o.a.s.c.c.ZkStateReader Updated live nodes from ZooKeeper... (3) -> (4)
   [junit4]   2> 35028 INFO  (zkCallback-29-thread-1-processing-n:127.0.0.1:36441_solr) [n:127.0.0.1:36441_solr    ] o.a.s.c.c.ZkStateReader Updated live nodes from ZooKeeper... (3) -> (4)
   [junit4]   2> 35028 DEBUG (SyncThread:0) [    ] o.a.s.c.ZkTestServer Watch added: children: /solr/live_nodes
   [junit4]   2> 35029 DEBUG (SyncThread:0) [    ] o.a.s.c.ZkTestServer Watch added: children: /solr/live_nodes
   [junit4]   2> 35029 INFO  (zkCallback-35-thread-1-processing-n:127.0.0.1:41516_solr) [n:127.0.0.1:41516_solr    ] o.a.s.c.c.ZkStateReader Updated live nodes from ZooKeeper... (3) -> (4)
   [junit4]   2> 35031 INFO  (zkCallback-33-thread-1-processing-n:127.0.0.1:56319_solr) [n:127.0.0.1:56319_solr    ] o.a.s.c.c.ZkStateReader Updated live nodes from ZooKeeper... (3) -> (4)
   [junit4]   2> 35061 DEBUG (OverseerCollectionConfigSetProcessor-73245501291954186-127.0.0.1:41516_solr-n_0000000000) [n:127.0.0.1:41516_solr    ] o.a.s.c.OverseerTaskProcessor Cleaning up work-queue. #Running tasks: 0
   [junit4]   2> 35061 DEBUG (OverseerCollectionConfigSetProcessor-73245501291954186-127.0.0.1:41516_solr-n_0000000000) [n:127.0.0.1:41516_solr    ] o.a.s.c.OverseerTaskProcessor RunningTasks: []
   [junit4]   2> 35062 DEBUG (OverseerCollectionConfigSetProcessor-73245501291954186-127.0.0.1:41516_solr-n_0000000000) [n:127.0.0.1:41516_solr    ] o.a.s.c.OverseerTaskProcessor BlockedTasks: []
   [junit4]   2> 35062 DEBUG (OverseerCollectionConfigSetProcessor-73245501291954186-127.0.0.1:41516_solr-n_0000000000) [n:127.0.0.1:41516_solr    ] o.a.s.c.OverseerTaskProcessor CompletedTasks: []
   [junit4]   2> 35062 DEBUG (OverseerCollectionConfigSetProcessor-73245501291954186-127.0.0.1:41516_solr-n_0000000000) [n:127.0.0.1:41516_solr    ] o.a.s.c.OverseerTaskProcessor RunningZKTasks: []
   [junit4]   2> 35062 DEBUG (OverseerCollectionConfigSetProcessor-73245501291954186-127.0.0.1:41516_solr-n_0000000000) [n:127.0.0.1:41516_solr    ] o.a.s.c.OverseerTaskQueue Peeking for top 100 elements. ExcludeSet: []
   [junit4]   2> 35084 DEBUG (SyncThread:0) [    ] o.a.s.c.ZkTestServer Watch added: children: /solr/overseer/queue-work
   [junit4]   2> 35100 DEBUG (SyncThread:0) [    ] o.a.s.c.ZkTestServer Watch added: children: /solr/overseer/queue
   [junit4]   2> 35102 DEBUG (OverseerStateUpdate-73245501291954186-127.0.0.1:41516_solr-n_0000000000) [n:127.0.0.1:41516_solr    ] o.a.s.c.Overseer processMessage: queueSize: 2, message = {
   [junit4]   2>   "operation":"downnode",
   [junit4]   2>   "node_name":"127.0.0.1:36441_solr"} current state version: 0
   [junit4]   2> 35104 DEBUG (SyncThread:0) [    ] o.a.s.c.ZkTestServer Watch added: children: /solr/overseer/collection-queue-work
   [junit4]   2> 35169 DEBUG (OverseerStateUpdate-73245501291954186-127.0.0.1:41516_solr-n_0000000000) [n:127.0.0.1:41516_solr    ] o.a.s.c.o.NodeMutator DownNode state invoked for node: 127.0.0.1:36441_solr
   [junit4]   2> 35170 DEBUG (OverseerStateUpdate-73245501291954186-127.0.0.1:41516_solr-n_0000000000) [n:127.0.0.1:41516_solr    ] o.a.s.c.Overseer processMessage: queueSize: 0, message = {
   [junit4]   2>   "operation":"downnode",
   [junit4]   2>   "node_name":"127.0.0.1:41516_solr"} current state version: 0
   [junit4]   2> 35170 DEBUG (OverseerStateUpdate-73245501291954186-127.0.0.1:41516_solr-n_0000000000) [n:127.0.0.1:41516_solr    ] o.a.s.c.o.NodeMutator DownNode state invoked for node: 127.0.0.1:41516_solr
   [junit4]   2> 35402 DEBUG (SyncThread:0) [    ] o.a.s.c.ZkTestServer Watch fired: children: /solr/overseer/queue
   [junit4]   2> 35425 DEBUG (SyncThread:0) [    ] o.a.s.c.ZkTestServer Watch added: children: /solr/overseer/queue
   [junit4]   2> 37025 DEBUG (OverseerAutoScalingTriggerThread-73245501291954186-127.0.0.1:41516_solr-n_0000000000) [n:127.0.0.1:41516_solr    ] o.a.s.c.a.OverseerTriggerThread Adding .autoAddReplicas trigger
   [junit4]   2> 37104 DEBUG (OverseerCollectionConfigSetProcessor-73245501291954186-127.0.0.1:41516_solr-n_0000000000) [n:127.0.0.1:41516_solr    ] o.a.s.c.OverseerTaskProcessor Got 0 tasks from work-queue : [[]]
   [junit4]   2> 37548 DEBUG (OverseerCollectionConfigSetProcessor-73245501291954186-127.0.0.1:41516_solr-n_0000000000) [n:127.0.0.1:41516_solr    ] o.a.s.c.OverseerTaskProcessor Cleaning up work-queue. #Running tasks: 0
   [junit4]   2> 37548 DEBUG (OverseerCollectionConfigSetProcessor-73245501291954186-127.0.0.1:41516_solr-n_0000000000) [n:127.0.0.1:41516_solr    ] o.a.s.c.OverseerTaskProcessor RunningTasks: []
   [junit4]   2> 37549 DEBUG (OverseerCollectionConfigSetProcessor-73245501291954186-127.0.0.1:41516_solr-n_0000000000) [n:127.0.0.1:41516_solr    ] o.a.s.c.OverseerTaskProcessor BlockedTasks: []
   [junit4]   2> 37549 DEBUG (OverseerCollectionConfigSetProcessor-73245501291954186-127.0.0.1:41516_solr-n_0000000000) [n:127.0.0.1:41516_solr    ] o.a.s.c.OverseerTaskProcessor CompletedTasks: []
   [junit4]   2> 37549 DEBUG (OverseerCollectionConfigSetProcessor-73245501291954186-127.0.0.1:41516_solr-n_0000000000) [n:127.0.0.1:41516_solr    ] o.a.s.c.OverseerTaskProcessor RunningZKTasks: []
   [junit4]   2> 37549 DEBUG (OverseerCollectionConfigSetProcessor-73245501291954186-127.0.0.1:41516_solr-n_0000000000) [n:127.0.0.1:41516_solr    ] o.a.s.c.OverseerTaskQueue Peeking for top 100 elements. ExcludeSet: []
   [junit4]   2> 37550 DEBUG (SyncThread:0) [    ] o.a.s.c.ZkTestServer Watch added: data: /solr/autoscaling.json
   [junit4]   2> 37550 DEBUG (OverseerAutoScalingTriggerThread-73245501291954186-127.0.0.1:41516_solr-n_0000000000) [n:127.0.0.1:41516_solr    ] o.a.s.c.a.OverseerTriggerThread Refreshing /autoscaling.json with znode version 1
   [junit4]   2> 39731 DEBUG (OverseerCollectionConfigSetProcessor-73245501291954186-127.0.0.1:41516_solr-n_0000000000) [n:127.0.0.1:41516_solr    ] o.a.s.c.OverseerTaskProcessor Got 0 tasks from work-queue : [[]]
   [junit4]   2> 39732 DEBUG (OverseerAutoScalingTriggerThread-73245501291954186-127.0.0.1:41516_solr-n_0000000000) [n:127.0.0.1:41516_solr    ] o.a.s.c.a.NodeLostTrigger Initial livenodes: [127.0.0.1:41516_solr, 127.0.0.1:51910_solr, 127.0.0.1:36441_solr, 127.0.0.1:56319_solr]
   [junit4]   2> 39732 DEBUG (OverseerAutoScalingTriggerThread-73245501291954186-127.0.0.1:41516_solr-n_0000000000) [n:127.0.0.1:41516_solr    ] o.a.s.c.a.OverseerTriggerThread Current znodeVersion 1, lastZnodeVersion -1
   [junit4]   2> 39732 DEBUG (OverseerAutoScalingTriggerThread-73245501291954186-127.0.0.1:41516_solr-n_0000000000) [n:127.0.0.1:41516_solr    ] o.a.s.c.a.OverseerTriggerThread Processed trigger updates upto znodeVersion 1
   [junit4]   2> 39808 DEBUG (OverseerCollectionConfigSetProcessor-73245501291954186-127.0.0.1:41516_solr-n_0000000000) [n:127.0.0.1:41516_solr    ] o.a.s.c.OverseerTaskProcessor Cleaning up work-queue. #Running tasks: 0
   [junit4]   2> 39808 DEBUG (OverseerCollectionConfigSetProcessor-73245501291954186-127.0.0.1:41516_solr-n_0000000000) [n:127.0.0.1:41516_solr    ] o.a.s.c.OverseerTaskProcessor RunningTasks: []
   [junit4]   2> 39808 DEBUG (OverseerCollectionConfigSetProcessor-73245501291954186-127.0.0.1:41516_solr-n_0000000000) [n:127.0.0.1:41516_solr    ] o.a.s.c.OverseerTaskProcessor BlockedTasks: []
   [junit4]   2> 39808 DEBUG (OverseerCollectionConfigSetProcessor-73245501291954186-127.0.0.1:41516_solr-n_0000000000) [n:127.0.0.1:41516_solr    ] o.a.s.c.OverseerTaskProcessor CompletedTasks: []
   [junit4]   2> 39808 DEBUG (OverseerCollectionConfigSetProcessor-73245501291954186-127.0.0.1:41516_solr-n_0000000000) [n:127.0.0.1:41516_solr    ] o.a.s.c.OverseerTaskProcessor RunningZKTasks: []
   [junit4]   2> 39808 DEBUG (OverseerCollectionConfigSetProcessor-73245501291954186-127.0.0.1:41516_solr-n_0000000000) [n:127.0.0.1:41516_solr    ] o.a.s.c.OverseerTaskQueue Peeking for top 100 elements. ExcludeSet: []
   [junit4]   2> 41381 DEBUG (OverseerAutoScalingTriggerThread-73245501291954186-127.0.0.1:41516_solr-n_0000000000) [n:127.0.0.1:41516_solr    ] o.a.s.c.a.OverseerTriggerThread -- clean old nodeAdded markers
   [junit4]   2> 41453 DEBUG (OverseerAutoScalingTriggerThread-73245501291954186-127.0.0.1:41516_solr-n_0000000000) [n:127.0.0.1:41516_solr    ] o.a.s.c.a.OverseerTriggerThread Current znodeVersion 1, lastZnodeVersion 1
   [junit4]   2> 41453 DEBUG (SyncThread:0) [    ] o.a.s.c.ZkTestServer Watch added: children: /solr/autoscaling/events/.auto_add_replicas
   [junit4]   2> 41584 DEBUG (ScheduledTrigger-18-thread-1) [n:127.0.0.1:41516_solr    ] o.a.s.c.a.NodeLostTrigger Running NodeLostTrigger: .auto_add_replicas with currently live nodes: 4
   [junit4]   2> 41982 DEBUG (OverseerCollectionConfigSetProcessor-73245501291954186-127.0.0.1:41516_solr-n_0000000000) [n:127.0.0.1:41516_solr    ] o.a.s.c.OverseerTaskProcessor Got 0 tasks from work-queue : [[]]
   [junit4]   2> 41992 DEBUG (OverseerCollectionConfigSetProcessor-73245501291954186-127.0.0.1:41516_solr-n_0000000000) [n:127.0.0.1:41516_solr    ] o.a.s.c.OverseerTaskProcessor Cleaning up work-queue. #Running tasks: 0
   [junit4]   2> 41992 DEBUG (OverseerCollectionConfigSetProcessor-73245501291954186-127.0.0.1:41516_solr-n_0000000000) [n:127.0.0.1:41516_solr    ] o.a.s.c.OverseerTaskProcessor RunningTasks: []
   [junit4]   2> 41992 DEBUG (OverseerCollectionConfigSetProcessor-73245501291954186-127.0.0.1:41516_solr-n_0000000000) [n:127.0.0.1:41516_solr    ] o.a.s.c.OverseerTaskProcessor BlockedTasks: []
   [junit4]   2> 41992 DEBUG (OverseerCollectionConfigSetProcessor-73245501291954186-127.0.0.1:41516_solr-n_0000000000) [n:127.0.0.1:41516_solr    ] o.a.s.c.OverseerTaskProcessor CompletedTasks: []
   [junit4]   2> 41992 DEBUG (OverseerCollectionConfigSetProcessor-73245501291954186-127.0.0.1:41516_solr-n_0000000000) [n:127.0.0.1:41516_solr    ] o.a.s.c.OverseerTaskProcessor RunningZKTasks: []
   [junit4]   2> 41992 DEBUG (OverseerCollectionConfigSetProcessor-73245501291954186-127.0.0.1:41516_solr-n_0000000000) [n:127.0.0.1:41516_solr    ] o.a.s.c.OverseerTaskQueue Peeking for top 100 elements. ExcludeSet: []
   [junit4]   2> 42644 DEBUG (ScheduledTrigger-18-thread-1) [n:127.0.0.1:41516_solr    ] o.a.s.c.a.NodeLostTrigger Running NodeLostTrigger: .auto_add_replicas with currently live nodes: 4
   [junit4]   2> 44388 DEBUG (OverseerCollectionConfigSetProcessor-73245501291954186-127.0.0.1:41516_solr-n_0000000000) [n:127.0.0.1:41516_solr    ] o.a.s.c.OverseerTaskProcessor Got 0 tasks from work-queue : [[]]
   [junit4]   2> 44428 DEBUG (OverseerCollectionConfigSetProcessor-73245501291954186-127.0.0.1:41516_solr-n_0000000000) [n:127.0.0.1:41516_solr    ] o.a.s.c.OverseerTaskProcessor Cleaning up work-queue. #Running tasks: 0
   [junit4]   2> 44428 DEBUG (OverseerCollectionConfigSetProcessor-73245501291954186-127.0.0.1:41516_solr-n_0000000000) [n:127.0.0.1:41516_solr    ] o.a.s.c.OverseerTaskProcessor RunningTasks: []
   [junit4]   2> 44428 DEBUG (OverseerCollectionConfigSetProcessor-73245501291954186-127.0.0.1:41516_solr-n_0000000000) [n:127.0.0.1:41516_solr    ] o.a.s.c.OverseerTaskProcessor BlockedTasks: []
   [junit4]   2> 44428 DEBUG (OverseerCollectionConfigSetProcessor-73245501291954186-127.0.0.1:41516_solr-n_0000000000) [n:127.0.0.1:41516_solr    ] o.a.s.c.OverseerTaskProcessor CompletedTasks: []
   [junit4]   2> 44428 DEBUG (OverseerCollectionConfigSetProcessor-73245501291954186-127.0.0.1:41516_solr-n_0000000000) [n:127.0.0.1:41516_solr    ] o.a.s.c.OverseerTaskProcessor RunningZKTasks: []
   [junit4]   2> 44428 DEBUG (OverseerCollectionConfigSetProcessor-73245501291954186-127.0.0.1:41516_solr-n_0000000000) [n:127.0.0.1:41516_solr    ] o.a.s.c.OverseerTaskQueue Peeking for top 100 elements. ExcludeSet: []
   [junit4]   2> 44437 DEBUG (ScheduledTrigger-18-thread-2) [n:127.0.0.1:41516_solr    ] o.a.s.c.a.NodeLostTrigger Running NodeLostTrigger: .auto_add_replicas with currently live nodes: 4
   [junit4]   2> 44507 INFO  (jetty-launcher-1-thread-3) [n:127.0.0.1:41516_solr    ] o.a.s.m.r.SolrJmxReporter JMX monitoring for 'solr_41516.solr.node' (registry 'solr.node') enabled at server: com.sun.jmx.mbeanserver.JmxMBeanServer@338de450
   [junit4]   2> 44526 INFO  (jetty-launcher-1-thread-2) [n:127.0.0.1:51910_solr    ] o.a.s.m.r.SolrJmxReporter JMX monitoring for 'solr_51910.solr.node' (registry 'solr.node') enabled at server: com.sun.jmx.mbeanserver.JmxMBeanServer@338de450
   [junit4]   2> 44527 INFO  (jetty-launcher-1-thread-4) [n:127.0.0.1:36441_solr    ] o.a.s.m.r.SolrJmxReporter JMX monitoring for 'solr_36441.solr.node' (registry 'solr.node') enabled at server: com.sun.jmx.mbeanserver.JmxMBeanServer@338de450
   [junit4]   2> 44528 INFO  (jetty-launcher-1-thread-4) [n:127.0.0.1:36441_solr    ] o.a.s.m.r.SolrJmxReporter JMX monitoring for 'solr_36441.solr.jvm' (registry 'solr.jvm') enabled at server: com.sun.jmx.mbeanserver.JmxMBeanServer@338de450
   [junit4]   2> 44529 INFO  (jetty-launcher-1-thread-4) [n:127.0.0.1:36441_solr    ] o.a.s.m.r.SolrJmxReporter JMX monitoring for 'solr_36441.solr.jetty' (registry 'solr.jetty') enabled at server: com.sun.jmx.mbeanserver.JmxMBeanServer@338de450
   [junit4]   2> 44568 INFO  (jetty-launcher-1-thread-3) [n:127.0.0.1:41516_solr    ] o.a.s.m.r.SolrJmxReporter JMX monitoring for 'solr_41516.solr.jvm' (registry 'solr.jvm') enabled at server: com.sun.jmx.mbeanserver.JmxMBeanServer@338de450
   [junit4]   2> 44568 INFO  (jetty-launcher-1-thread-3) [n:127.0.0.1:41516_solr    ] o.a.s.m.r.SolrJmxReporter JMX monitoring for 'solr_41516.solr.jetty' (registry 'solr.jetty') enabled at server: com.sun.jmx.mbeanserver.JmxMBeanServer@338de450
   [junit4]   2> 44588 INFO  (jetty-launcher-1-thread-2) [n:127.0.0.1:51910_solr    ] o.a.s.m.r.SolrJmxReporter JMX monitoring for 'solr_51910.solr.jvm' (registry 'solr.jvm') enabled at server: com.sun.jmx.mbeanserver.JmxMBeanServer@338de450
   [junit4]   2> 44588 INFO  (jetty-launcher-1-thread-2) [n:127.0.0.1:51910_solr    ] o.a.s.m.r.SolrJmxReporter JMX monitoring for 'solr_51910.solr.jetty' (registry 'solr.jetty') enabled at server: com.sun.jmx.mbeanserver.JmxMBeanServer@338de450
   [junit4]   2> 44635 INFO  (jetty-launcher-1-thread-1) [n:127.0.0.1:56319_solr    ] o.a.s.m.r.SolrJmxReporter JMX monitoring for 'solr_56319.solr.node' (registry 'solr.node') enabled at server: com.sun.jmx.mbeanserver.JmxMBeanServer@338de450
   [junit4]   2> 44635 INFO  (jetty-launcher-1-thread-1) [n:127.0.0.1:56319_solr    ] o.a.s.m.r.SolrJmxReporter JMX monitoring for 'solr_56319.solr.jvm' (registry 'solr.jvm') enabled at server: com.sun.jmx.mbeanserver.JmxMBeanServer@338de450
   [junit4]   2> 44635 INFO  (jetty-launcher-1-thread-1) [n:127.0.0.1:56319_solr    ] o.a.s.m.r.SolrJmxReporter JMX monitoring for 'solr_56319.solr.jetty' (registry 'solr.jetty') enabled at server: com.sun.jmx.mbeanserver.JmxMBeanServer@338de450
   [junit4]   2> 44947 INFO  (jetty-launcher-1-thread-3) [n:127.0.0.1:41516_solr    ] o.a.s.c.CorePropertiesLocator Found 0 core definitions underneath /x1/jenkins/jenkins-slave/workspace/Lucene-Solr-Tests-master/solr/build/solr-core/test/J0/temp/solr.cloud.MoveReplicaHDFSTest_E297651F29BF3751-001/tempDir-001/node3/.
   [junit4]   2> 44973 INFO  (jetty-launcher-1-thread-1) [n:127.0.0.1:56319_solr    ] o.a.s.c.CorePropertiesLocator Found 0 core definitions underneath /x1/jenkins/jenkins-slave/workspace/Lucene-Solr-Tests-master/solr/build/solr-core/test/J0/temp/solr.cloud.MoveReplicaHDFSTest_E297651F29BF3751-001/tempDir-001/node1/.
   [junit4]   2> 44974 INFO  (jetty-launcher-1-thread-2) [n:127.0.0.1:51910_solr    ] o.a.s.c.CorePropertiesLocator Found 0 core definitions underneath /x1/jenkins/jenkins-slave/workspace/Lucene-Solr-Tests-master/solr/build/solr-core/test/J0/temp/solr.cloud.MoveReplicaHDFSTest_E297651F29BF3751-001/tempDir-001/node2/.
   [junit4]   2> 45133 INFO  (jetty-launcher-1-thread-4) [n:127.0.0.1:36441_solr    ] o.a.s.c.CorePropertiesLocator Found 0 core definitions underneath /x1/jenkins/jenkins-slave/workspace/Lucene-Solr-Tests-master/solr/build/solr-core/test/J0/temp/solr.cloud.MoveReplicaHDFSTest_E297651F29BF3751-001/tempDir-001/node4/.
   [junit4]   2> 45603 DEBUG (ScheduledTrigger-18-thread-1) [n:127.0.0.1:41516_solr    ] o.a.s.c.a.NodeLostTrigger Running NodeLostTrigger: .auto_add_replicas with currently live nodes: 4
   [junit4]   2> 46428 DEBUG (OverseerCollectionConfigSetProcessor-73245501291954186-127.0.0.1:41516_solr-n_0000000000) [n:127.0.0.1:41516_solr    ] o.a.s.c.OverseerTaskProcessor Got 0 tasks from work-queue : [[]]
   [junit4]   2> 46444 DEBUG (OverseerCollectionConfigSetProcessor-73245501291954186-127.0.0.1:41516_solr-n_0000000000) [n:127.0.0.1:41516_solr    ] o.a.s.c.OverseerTaskProcessor Cleaning up work-queue. #Running tasks: 0
   [junit4]   2> 46444 DEBUG (OverseerCollectionConfigSetProcessor-73245501291954186-127.0.0.1:41516_solr-n_0000000000) [n:127.0.0.1:41516_solr    ] o.a.s.c.OverseerTaskProcessor RunningTasks: []
   [junit4]   2> 46444 DEBUG (OverseerCollectionConfigSetProcessor-73245501291954186-127.0.0.1:41516_solr-n_0000000000) [n:127.0.0.1:41516_solr    ] o.a.s.c.OverseerTaskProcessor BlockedTasks: []
   [junit4]   2> 46444 DEBUG (OverseerCollectionConfigSetProcessor-73245501291954186-127.0.0.1:41516_solr-n_0000000000) [n:127.0.0.1:41516_solr    ] o.a.s.c.OverseerTaskProcessor CompletedTasks: []
   [junit4]   2> 46444 DEBUG (OverseerCollectionConfigSetProcessor-73245501291954186-127.0.0.1:41516_solr-n_0000000000) [n:127.0.0.1:41516_solr    ] o.a.s.c.OverseerTaskProcessor RunningZKTasks: []
   [junit4]   2> 46445 DEBUG (OverseerCollectionConfigSetProcessor-73245501291954186-127.0.0.1:41516_solr-n_0000000000) [n:127.0.0.1:41516_solr    ] o.a.s.c.OverseerTaskQueue Peeking for top 100 elements. ExcludeSet: []
   [junit4]   2> 46604 DEBUG (ScheduledTrigger-18-thread-1) [n:127.0.0.1:41516_solr    ] o.a.s.c.a.NodeLostTrigger Running NodeLostTrigger: .auto_add_replicas with currently live nodes: 4
   [junit4]   2> 47604 DEBUG (ScheduledTrigger-18-thread-1) [n:127.0.0.1:41516_solr    ] o.a.s.c.a.NodeLostTrigger Running NodeLostTrigger: .auto_add_replicas with currently live nodes: 4
   [junit4]   2> 48452 DEBUG (OverseerCollectionConfigSetProcessor-73245501291954186-127.0.0.1:41516_solr-n_0000000000) [n:127.0.0.1:41516_solr    ] o.a.s.c.OverseerTaskProcessor Got 0 tasks from work-queue : [[]]
   [junit4]   2> 48464 DEBUG (OverseerCollectionConfigSetProcessor-73245501291954186-127.0.0.1:41516_solr-n_0000000000) [n:127.0.0.1:41516_solr    ] o.a.s.c.OverseerTaskProcessor Cleaning up work-queue. #Running tasks: 0
   [junit4]   2> 48464 DEBUG (OverseerCollectionConfigSetProcessor-73245501291954186-127.0.0.1:41516_solr-n_0000000000) [n:127.0.0.1:41516_solr    ] o.a.s.c.OverseerTaskProcessor RunningTasks: []
   [junit4]   2> 48464 DEBUG (OverseerCollectionConfigSetProcessor-73245501291954186-127.0.0.1:41516_solr-n_0000000000) [n:127.0.0.1:41516_solr    ] o.a.s.c.OverseerTaskProcessor BlockedTasks: []
   [junit4]   2> 48464 DEBUG (OverseerCollectionConfigSetProcessor-73245501291954186-127.0.0.1:41516_solr-n_0000000000) [n:127.0.0.1:41516_solr    ] o.a.s.c.OverseerTaskProcessor CompletedTasks: []
   [junit4]   2> 48464 DEBUG (OverseerCollectionConf

[...truncated too long message...]

s-interceptors-admin-2.0.0-M15.jar:/x1/jenkins/jenkins-slave/workspace/Lucene-Solr-Tests-master/solr/core/test-lib/apacheds-interceptors-authn-2.0.0-M15.jar:/x1/jenkins/jenkins-slave/workspace/Lucene-Solr-Tests-master/solr/core/test-lib/apacheds-interceptors-authz-2.0.0-M15.jar:/x1/jenkins/jenkins-slave/workspace/Lucene-Solr-Tests-master/solr/core/test-lib/apacheds-interceptors-changelog-2.0.0-M15.jar:/x1/jenkins/jenkins-slave/workspace/Lucene-Solr-Tests-master/solr/core/test-lib/apacheds-interceptors-collective-2.0.0-M15.jar:/x1/jenkins/jenkins-slave/workspace/Lucene-Solr-Tests-master/solr/core/test-lib/apacheds-interceptors-event-2.0.0-M15.jar:/x1/jenkins/jenkins-slave/workspace/Lucene-Solr-Tests-master/solr/core/test-lib/apacheds-interceptors-exception-2.0.0-M15.jar:/x1/jenkins/jenkins-slave/workspace/Lucene-Solr-Tests-master/solr/core/test-lib/apacheds-interceptors-journal-2.0.0-M15.jar:/x1/jenkins/jenkins-slave/workspace/Lucene-Solr-Tests-master/solr/core/test-lib/apacheds-interceptors-normalization-2.0.0-M15.jar:/x1/jenkins/jenkins-slave/workspace/Lucene-Solr-Tests-master/solr/core/test-lib/apacheds-interceptors-operational-2.0.0-M15.jar:/x1/jenkins/jenkins-slave/workspace/Lucene-Solr-Tests-master/solr/core/test-lib/apacheds-interceptors-referral-2.0.0-M15.jar:/x1/jenkins/jenkins-slave/workspace/Lucene-Solr-Tests-master/solr/core/test-lib/apacheds-interceptors-schema-2.0.0-M15.jar:/x1/jenkins/jenkins-slave/workspace/Lucene-Solr-Tests-master/solr/core/test-lib/apacheds-interceptors-subtree-2.0.0-M15.jar:/x1/jenkins/jenkins-slave/workspace/Lucene-Solr-Tests-master/solr/core/test-lib/apacheds-interceptors-trigger-2.0.0-M15.jar:/x1/jenkins/jenkins-slave/workspace/Lucene-Solr-Tests-master/solr/core/test-lib/apacheds-jdbm-partition-2.0.0-M15.jar:/x1/jenkins/jenkins-slave/workspace/Lucene-Solr-Tests-master/solr/core/test-lib/apacheds-jdbm1-2.0.0-M2.jar:/x1/jenkins/jenkins-slave/workspace/Lucene-Solr-Tests-master/solr/core/test-lib/apacheds-kerberos-codec-2.0.0-M15.jar:/x1/jenkins/jenkins-slave/workspace/Lucene-Solr-Tests-master/solr/core/test-lib/apacheds-ldif-partition-2.0.0-M15.jar:/x1/jenkins/jenkins-slave/workspace/Lucene-Solr-Tests-master/solr/core/test-lib/apacheds-mavibot-partition-2.0.0-M15.jar:/x1/jenkins/jenkins-slave/workspace/Lucene-Solr-Tests-master/solr/core/test-lib/apacheds-protocol-kerberos-2.0.0-M15.jar:/x1/jenkins/jenkins-slave/workspace/Lucene-Solr-Tests-master/solr/core/test-lib/apacheds-protocol-ldap-2.0.0-M15.jar:/x1/jenkins/jenkins-slave/workspace/Lucene-Solr-Tests-master/solr/core/test-lib/apacheds-protocol-shared-2.0.0-M15.jar:/x1/jenkins/jenkins-slave/workspace/Lucene-Solr-Tests-master/solr/core/test-lib/apacheds-xdbm-partition-2.0.0-M15.jar:/x1/jenkins/jenkins-slave/workspace/Lucene-Solr-Tests-master/solr/core/test-lib/api-all-1.0.0-M20.jar:/x1/jenkins/jenkins-slave/workspace/Lucene-Solr-Tests-master/solr/core/test-lib/bcprov-jdk15on-1.54.jar:/x1/jenkins/jenkins-slave/workspace/Lucene-Solr-Tests-master/solr/core/test-lib/byte-buddy-1.6.2.jar:/x1/jenkins/jenkins-slave/workspace/Lucene-Solr-Tests-master/solr/core/test-lib/commons-collections-3.2.2.jar:/x1/jenkins/jenkins-slave/workspace/Lucene-Solr-Tests-master/solr/core/test-lib/commons-math3-3.6.1.jar:/x1/jenkins/jenkins-slave/workspace/Lucene-Solr-Tests-master/solr/core/test-lib/ehcache-core-2.4.4.jar:/x1/jenkins/jenkins-slave/workspace/Lucene-Solr-Tests-master/solr/core/test-lib/hadoop-common-2.7.4-tests.jar:/x1/jenkins/jenkins-slave/workspace/Lucene-Solr-Tests-master/solr/core/test-lib/hadoop-hdfs-2.7.4-tests.jar:/x1/jenkins/jenkins-slave/workspace/Lucene-Solr-Tests-master/solr/core/test-lib/hadoop-minikdc-2.7.4.jar:/x1/jenkins/jenkins-slave/workspace/Lucene-Solr-Tests-master/solr/core/test-lib/htrace-core-3.2.0-incubating.jar:/x1/jenkins/jenkins-slave/workspace/Lucene-Solr-Tests-master/solr/core/test-lib/jersey-core-1.9.jar:/x1/jenkins/jenkins-slave/workspace/Lucene-Solr-Tests-master/solr/core/test-lib/jersey-server-1.9.jar:/x1/jenkins/jenkins-slave/workspace/Lucene-Solr-Tests-master/solr/core/test-lib/jetty-6.1.26.jar:/x1/jenkins/jenkins-slave/workspace/Lucene-Solr-Tests-master/solr/core/test-lib/jetty-sslengine-6.1.26.jar:/x1/jenkins/jenkins-slave/workspace/Lucene-Solr-Tests-master/solr/core/test-lib/jetty-util-6.1.26.jar:/x1/jenkins/jenkins-slave/workspace/Lucene-Solr-Tests-master/solr/core/test-lib/mina-core-2.0.0-M5.jar:/x1/jenkins/jenkins-slave/workspace/Lucene-Solr-Tests-master/solr/core/test-lib/mockito-core-2.6.2.jar:/x1/jenkins/jenkins-slave/workspace/Lucene-Solr-Tests-master/solr/core/test-lib/netty-all-4.0.36.Final.jar:/x1/jenkins/jenkins-slave/workspace/Lucene-Solr-Tests-master/solr/core/test-lib/objenesis-2.5.jar:/x1/jenkins/jenkins-slave/workspace/Lucene-Solr-Tests-master/lucene/build/analysis/icu/lucene-analyzers-icu-8.0.0-SNAPSHOT.jar:/x1/jenkins/jenkins-slave/workspace/Lucene-Solr-Tests-master/solr/build/contrib/solr-analysis-extras/classes/java:/x1/jenkins/jenkins-slave/workspace/Lucene-Solr-Tests-master/lucene/build/queryparser/classes/test:/x1/jenkins/jenkins-slave/workspace/Lucene-Solr-Tests-master/lucene/build/backward-codecs/classes/test:/x1/jenkins/jenkins-slave/workspace/Lucene-Solr-Tests-master/solr/contrib/analysis-extras/lib/icu4j-60.2.jar:/home/jenkins/tools/ant/apache-ant-1.8.4/lib/ant-launcher.jar:/x1/jenkins/.ant/lib/ivy-2.4.0.jar:/home/jenkins/tools/ant/apache-ant-1.8.4/lib/ant-junit.jar:/home/jenkins/tools/ant/apache-ant-1.8.4/lib/ant-apache-log4j.jar:/home/jenkins/tools/ant/apache-ant-1.8.4/lib/ant-junit4.jar:/home/jenkins/tools/ant/apache-ant-1.8.4/lib/ant-jai.jar:/home/jenkins/tools/ant/apache-ant-1.8.4/lib/ant-javamail.jar:/home/jenkins/tools/ant/apache-ant-1.8.4/lib/ant-apache-bsf.jar:/home/jenkins/tools/ant/apache-ant-1.8.4/lib/ant-commons-net.jar:/home/jenkins/tools/ant/apache-ant-1.8.4/lib/ant-antlr.jar:/home/jenkins/tools/ant/apache-ant-1.8.4/lib/ant-jsch.jar:/home/jenkins/tools/ant/apache-ant-1.8.4/lib/ant-apache-oro.jar:/home/jenkins/tools/ant/apache-ant-1.8.4/lib/ant-commons-logging.jar:/home/jenkins/tools/ant/apache-ant-1.8.4/lib/ant.jar:/home/jenkins/tools/ant/apache-ant-1.8.4/lib/ant-netrexx.jar:/home/jenkins/tools/ant/apache-ant-1.8.4/lib/ant-testutil.jar:/home/jenkins/tools/ant/apache-ant-1.8.4/lib/ant-jdepend.jar:/home/jenkins/tools/ant/apache-ant-1.8.4/lib/ant-apache-bcel.jar:/home/jenkins/tools/ant/apache-ant-1.8.4/lib/ant-apache-xalan2.jar:/home/jenkins/tools/ant/apache-ant-1.8.4/lib/ant-apache-resolver.jar:/home/jenkins/tools/ant/apache-ant-1.8.4/lib/ant-jmf.jar:/home/jenkins/tools/ant/apache-ant-1.8.4/lib/ant-apache-regexp.jar:/home/jenkins/tools/ant/apache-ant-1.8.4/lib/ant-swing.jar:/usr/local/asfpackages/java/jdk1.8.0_144/lib/tools.jar:/x1/jenkins/.ivy2/cache/com.carrotsearch.randomizedtesting/junit4-ant/jars/junit4-ant-2.5.3.jar com.carrotsearch.ant.tasks.junit4.slave.SlaveMainSafe -eventsfile /x1/jenkins/jenkins-slave/workspace/Lucene-Solr-Tests-master/solr/build/solr-core/test/temp/junit4-J2-20180205_234122_7945824743021885113754.events @/x1/jenkins/jenkins-slave/workspace/Lucene-Solr-Tests-master/solr/build/solr-core/test/temp/junit4-J2-20180205_234122_7941189289891600612354.suites -stdin
   [junit4] ERROR: JVM J2 ended with an exception: Forked process returned with error code: 1. Very likely a JVM crash.  See process stdout at: /x1/jenkins/jenkins-slave/workspace/Lucene-Solr-Tests-master/solr/build/solr-core/test/temp/junit4-J2-20180205_234122_7948299514348767912311.sysout See process stderr at: /x1/jenkins/jenkins-slave/workspace/Lucene-Solr-Tests-master/solr/build/solr-core/test/temp/junit4-J2-20180205_234122_7946110078234687775817.syserr
   [junit4] 	at com.carrotsearch.ant.tasks.junit4.JUnit4.executeSlave(JUnit4.java:1519)
   [junit4] 	at com.carrotsearch.ant.tasks.junit4.JUnit4.access$000(JUnit4.java:126)
   [junit4] 	at com.carrotsearch.ant.tasks.junit4.JUnit4$2.call(JUnit4.java:982)
   [junit4] 	at com.carrotsearch.ant.tasks.junit4.JUnit4$2.call(JUnit4.java:979)
   [junit4] 	at java.util.concurrent.FutureTask.run(FutureTask.java:266)
   [junit4] 	at java.util.concurrent.ThreadPoolExecutor.runWorker(ThreadPoolExecutor.java:1149)
   [junit4] 	at java.util.concurrent.ThreadPoolExecutor$Worker.run(ThreadPoolExecutor.java:624)
   [junit4] 	at java.lang.Thread.run(Thread.java:748)

BUILD FAILED
/x1/jenkins/jenkins-slave/workspace/Lucene-Solr-Tests-master/build.xml:836: The following error occurred while executing this line:
/x1/jenkins/jenkins-slave/workspace/Lucene-Solr-Tests-master/build.xml:780: The following error occurred while executing this line:
/x1/jenkins/jenkins-slave/workspace/Lucene-Solr-Tests-master/build.xml:59: The following error occurred while executing this line:
/x1/jenkins/jenkins-slave/workspace/Lucene-Solr-Tests-master/solr/build.xml:262: The following error occurred while executing this line:
/x1/jenkins/jenkins-slave/workspace/Lucene-Solr-Tests-master/solr/common-build.xml:556: The following error occurred while executing this line:
/x1/jenkins/jenkins-slave/workspace/Lucene-Solr-Tests-master/lucene/common-build.xml:1555: The following error occurred while executing this line:
/x1/jenkins/jenkins-slave/workspace/Lucene-Solr-Tests-master/lucene/common-build.xml:1080: At least one slave process threw an exception, first: Forked process returned with error code: 1. Very likely a JVM crash.  See process stdout at: /x1/jenkins/jenkins-slave/workspace/Lucene-Solr-Tests-master/solr/build/solr-core/test/temp/junit4-J0-20180205_234122_7714813712607160112434.sysout See process stderr at: /x1/jenkins/jenkins-slave/workspace/Lucene-Solr-Tests-master/solr/build/solr-core/test/temp/junit4-J0-20180205_234122_7712441013538493743376.syserr

Total time: 204 minutes 14 seconds
Build step 'Invoke Ant' marked build as failure
Archiving artifacts
[Fast Archiver] No artifacts from Lucene-Solr-Tests-master #2298 to compare, so performing full copy of artifacts
Recording test results
Email was triggered for: Failure - Any
Sending email for trigger: Failure - Any