You are viewing a plain text version of this content. The canonical link for it is here.
Posted to dev@kafka.apache.org by Apache Jenkins Server <je...@builds.apache.org> on 2019/01/19 07:50:44 UTC

Build failed in Jenkins: kafka-trunk-jdk11 #225

See <https://builds.apache.org/job/kafka-trunk-jdk11/225/display/redirect?page=changes>

Changes:

[ismael] MINOR: Log partition info when creating new request batch in controller

------------------------------------------
[...truncated 2.27 MB...]

org.apache.kafka.connect.runtime.WorkerConfigTransformerTest > testReplaceVariableWithTTLFirstCancelThenScheduleRestart STARTED

org.apache.kafka.connect.runtime.WorkerConfigTransformerTest > testReplaceVariableWithTTLFirstCancelThenScheduleRestart PASSED

org.apache.kafka.connect.runtime.WorkerConfigTransformerTest > testTransformNullConfiguration STARTED

org.apache.kafka.connect.runtime.WorkerConfigTransformerTest > testTransformNullConfiguration PASSED

org.apache.kafka.connect.runtime.WorkerSinkTaskThreadedTest > testCommitSuccessFollowedByFailure STARTED

org.apache.kafka.connect.runtime.WorkerSinkTaskThreadedTest > testCommitSuccessFollowedByFailure PASSED

org.apache.kafka.connect.runtime.WorkerSinkTaskThreadedTest > testCommitConsumerFailure STARTED

org.apache.kafka.connect.runtime.WorkerSinkTaskThreadedTest > testCommitConsumerFailure PASSED

org.apache.kafka.connect.runtime.WorkerSinkTaskThreadedTest > testCommitTimeout STARTED

org.apache.kafka.connect.runtime.WorkerSinkTaskThreadedTest > testCommitTimeout PASSED

org.apache.kafka.connect.runtime.WorkerSinkTaskThreadedTest > testAssignmentPauseResume STARTED

org.apache.kafka.connect.runtime.WorkerSinkTaskThreadedTest > testAssignmentPauseResume PASSED

org.apache.kafka.connect.runtime.WorkerSinkTaskThreadedTest > testRewind STARTED

org.apache.kafka.connect.runtime.WorkerSinkTaskThreadedTest > testRewind PASSED

org.apache.kafka.connect.runtime.WorkerSinkTaskThreadedTest > testRewindOnRebalanceDuringPoll STARTED

org.apache.kafka.connect.runtime.WorkerSinkTaskThreadedTest > testRewindOnRebalanceDuringPoll PASSED

org.apache.kafka.connect.runtime.WorkerSinkTaskThreadedTest > testPollsInBackground STARTED

org.apache.kafka.connect.runtime.WorkerSinkTaskThreadedTest > testPollsInBackground PASSED

org.apache.kafka.connect.runtime.WorkerSinkTaskThreadedTest > testCommit STARTED

org.apache.kafka.connect.runtime.WorkerSinkTaskThreadedTest > testCommit PASSED

org.apache.kafka.connect.runtime.WorkerSinkTaskThreadedTest > testCommitFailure STARTED

org.apache.kafka.connect.runtime.WorkerSinkTaskThreadedTest > testCommitFailure PASSED

org.apache.kafka.connect.runtime.distributed.DistributedHerderTest > testPutConnectorConfig STARTED

org.apache.kafka.connect.runtime.distributed.DistributedHerderTest > testPutConnectorConfig PASSED

org.apache.kafka.connect.runtime.distributed.DistributedHerderTest > testCreateConnector STARTED

org.apache.kafka.connect.runtime.distributed.DistributedHerderTest > testCreateConnector PASSED

org.apache.kafka.connect.runtime.distributed.DistributedHerderTest > testAccessors STARTED

org.apache.kafka.connect.runtime.distributed.DistributedHerderTest > testAccessors PASSED

org.apache.kafka.connect.runtime.distributed.DistributedHerderTest > testCreateConnectorFailedBasicValidation STARTED

org.apache.kafka.connect.runtime.distributed.DistributedHerderTest > testCreateConnectorFailedBasicValidation PASSED

org.apache.kafka.connect.runtime.distributed.DistributedHerderTest > testCreateConnectorFailedCustomValidation STARTED

org.apache.kafka.connect.runtime.distributed.DistributedHerderTest > testCreateConnectorFailedCustomValidation PASSED

org.apache.kafka.connect.runtime.distributed.DistributedHerderTest > testCreateConnectorAlreadyExists STARTED

org.apache.kafka.connect.runtime.distributed.DistributedHerderTest > testCreateConnectorAlreadyExists PASSED

org.apache.kafka.connect.runtime.distributed.DistributedHerderTest > testDestroyConnector STARTED

org.apache.kafka.connect.runtime.distributed.DistributedHerderTest > testDestroyConnector PASSED

org.apache.kafka.connect.runtime.distributed.DistributedHerderTest > testRestartConnector STARTED

org.apache.kafka.connect.runtime.distributed.DistributedHerderTest > testRestartConnector PASSED

org.apache.kafka.connect.runtime.distributed.DistributedHerderTest > testRestartTask STARTED

org.apache.kafka.connect.runtime.distributed.DistributedHerderTest > testRestartTask PASSED

org.apache.kafka.connect.runtime.distributed.DistributedHerderTest > testJoinAssignment STARTED

org.apache.kafka.connect.runtime.distributed.DistributedHerderTest > testJoinAssignment PASSED

org.apache.kafka.connect.runtime.distributed.DistributedHerderTest > testRebalance STARTED

org.apache.kafka.connect.runtime.distributed.DistributedHerderTest > testRebalance PASSED

org.apache.kafka.connect.runtime.distributed.DistributedHerderTest > testRebalanceFailedConnector STARTED

org.apache.kafka.connect.runtime.distributed.DistributedHerderTest > testRebalanceFailedConnector PASSED

org.apache.kafka.connect.runtime.distributed.DistributedHerderTest > testHaltCleansUpWorker STARTED

org.apache.kafka.connect.runtime.distributed.DistributedHerderTest > testHaltCleansUpWorker PASSED

org.apache.kafka.connect.runtime.distributed.DistributedHerderTest > testConnectorNameConflictsWithWorkerGroupId STARTED

org.apache.kafka.connect.runtime.distributed.DistributedHerderTest > testConnectorNameConflictsWithWorkerGroupId PASSED

org.apache.kafka.connect.runtime.distributed.DistributedHerderTest > testRestartUnknownConnector STARTED

org.apache.kafka.connect.runtime.distributed.DistributedHerderTest > testRestartUnknownConnector PASSED

org.apache.kafka.connect.runtime.distributed.DistributedHerderTest > testRestartConnectorRedirectToLeader STARTED

org.apache.kafka.connect.runtime.distributed.DistributedHerderTest > testRestartConnectorRedirectToLeader PASSED

org.apache.kafka.connect.runtime.distributed.DistributedHerderTest > testRestartConnectorRedirectToOwner STARTED

org.apache.kafka.connect.runtime.distributed.DistributedHerderTest > testRestartConnectorRedirectToOwner PASSED

org.apache.kafka.connect.runtime.distributed.DistributedHerderTest > testRestartUnknownTask STARTED

org.apache.kafka.connect.runtime.distributed.DistributedHerderTest > testRestartUnknownTask PASSED

org.apache.kafka.connect.runtime.distributed.DistributedHerderTest > testRequestProcessingOrder STARTED

org.apache.kafka.connect.runtime.distributed.DistributedHerderTest > testRequestProcessingOrder PASSED

org.apache.kafka.connect.runtime.distributed.DistributedHerderTest > testRestartTaskRedirectToLeader STARTED

org.apache.kafka.connect.runtime.distributed.DistributedHerderTest > testRestartTaskRedirectToLeader PASSED

org.apache.kafka.connect.runtime.distributed.DistributedHerderTest > testRestartTaskRedirectToOwner STARTED

org.apache.kafka.connect.runtime.distributed.DistributedHerderTest > testRestartTaskRedirectToOwner PASSED

org.apache.kafka.connect.runtime.distributed.DistributedHerderTest > testConnectorConfigAdded STARTED

org.apache.kafka.connect.runtime.distributed.DistributedHerderTest > testConnectorConfigAdded PASSED

org.apache.kafka.connect.runtime.distributed.DistributedHerderTest > testConnectorConfigUpdate STARTED

org.apache.kafka.connect.runtime.distributed.DistributedHerderTest > testConnectorConfigUpdate PASSED

org.apache.kafka.connect.runtime.distributed.DistributedHerderTest > testConnectorPaused STARTED

org.apache.kafka.connect.runtime.distributed.DistributedHerderTest > testConnectorPaused PASSED

org.apache.kafka.connect.runtime.distributed.DistributedHerderTest > testConnectorResumed STARTED

org.apache.kafka.connect.runtime.distributed.DistributedHerderTest > testConnectorResumed PASSED

org.apache.kafka.connect.runtime.distributed.DistributedHerderTest > testUnknownConnectorPaused STARTED

org.apache.kafka.connect.runtime.distributed.DistributedHerderTest > testUnknownConnectorPaused PASSED

org.apache.kafka.connect.runtime.distributed.DistributedHerderTest > testConnectorPausedRunningTaskOnly STARTED

org.apache.kafka.connect.runtime.distributed.DistributedHerderTest > testConnectorPausedRunningTaskOnly PASSED

org.apache.kafka.connect.runtime.distributed.DistributedHerderTest > testConnectorResumedRunningTaskOnly STARTED

org.apache.kafka.connect.runtime.distributed.DistributedHerderTest > testConnectorResumedRunningTaskOnly PASSED

org.apache.kafka.connect.runtime.distributed.DistributedHerderTest > testTaskConfigAdded STARTED

org.apache.kafka.connect.runtime.distributed.DistributedHerderTest > testTaskConfigAdded PASSED

org.apache.kafka.connect.runtime.distributed.DistributedHerderTest > testJoinLeaderCatchUpFails STARTED

org.apache.kafka.connect.runtime.distributed.DistributedHerderTest > testJoinLeaderCatchUpFails PASSED

org.apache.kafka.connect.runtime.distributed.DistributedHerderTest > testInconsistentConfigs STARTED

org.apache.kafka.connect.runtime.distributed.DistributedHerderTest > testInconsistentConfigs PASSED

org.apache.kafka.connect.runtime.distributed.WorkerCoordinatorTest > testLeaderPerformAssignmentSingleTaskConnectors STARTED

org.apache.kafka.connect.runtime.distributed.WorkerCoordinatorTest > testLeaderPerformAssignmentSingleTaskConnectors PASSED

org.apache.kafka.connect.runtime.distributed.WorkerCoordinatorTest > testNormalJoinGroupFollower STARTED

org.apache.kafka.connect.runtime.distributed.WorkerCoordinatorTest > testNormalJoinGroupFollower PASSED

org.apache.kafka.connect.runtime.distributed.WorkerCoordinatorTest > testMetadata STARTED

org.apache.kafka.connect.runtime.distributed.WorkerCoordinatorTest > testMetadata PASSED

org.apache.kafka.connect.runtime.distributed.WorkerCoordinatorTest > testLeaderPerformAssignment1 STARTED

org.apache.kafka.connect.runtime.distributed.WorkerCoordinatorTest > testLeaderPerformAssignment1 PASSED

org.apache.kafka.connect.runtime.distributed.WorkerCoordinatorTest > testLeaderPerformAssignment2 STARTED

org.apache.kafka.connect.runtime.distributed.WorkerCoordinatorTest > testLeaderPerformAssignment2 PASSED

org.apache.kafka.connect.runtime.distributed.WorkerCoordinatorTest > testJoinLeaderCannotAssign STARTED

org.apache.kafka.connect.runtime.distributed.WorkerCoordinatorTest > testJoinLeaderCannotAssign PASSED

org.apache.kafka.connect.runtime.distributed.WorkerCoordinatorTest > testRejoinGroup STARTED

org.apache.kafka.connect.runtime.distributed.WorkerCoordinatorTest > testRejoinGroup PASSED

org.apache.kafka.connect.runtime.distributed.WorkerCoordinatorTest > testNormalJoinGroupLeader STARTED

org.apache.kafka.connect.runtime.distributed.WorkerCoordinatorTest > testNormalJoinGroupLeader PASSED

org.apache.kafka.connect.runtime.WorkerTaskTest > cancelBeforeStopping STARTED

org.apache.kafka.connect.runtime.WorkerTaskTest > cancelBeforeStopping PASSED

org.apache.kafka.connect.runtime.WorkerTaskTest > standardStartup STARTED

org.apache.kafka.connect.runtime.WorkerTaskTest > standardStartup PASSED

org.apache.kafka.connect.runtime.WorkerTaskTest > stopBeforeStarting STARTED

org.apache.kafka.connect.runtime.WorkerTaskTest > stopBeforeStarting PASSED

org.apache.kafka.connect.runtime.WorkerTaskTest > updateMetricsOnListenerEventsForStartupPauseResumeAndShutdown STARTED

org.apache.kafka.connect.runtime.WorkerTaskTest > updateMetricsOnListenerEventsForStartupPauseResumeAndShutdown PASSED

org.apache.kafka.connect.runtime.WorkerTaskTest > updateMetricsOnListenerEventsForStartupPauseResumeAndFailure STARTED

org.apache.kafka.connect.runtime.WorkerTaskTest > updateMetricsOnListenerEventsForStartupPauseResumeAndFailure PASSED

384 tests completed, 1 failed

> Task :connect:runtime:test FAILED

FAILURE: Build failed with an exception.

* What went wrong:
Execution failed for task ':connect:runtime:test'.
> There were failing tests. See the report at: file://<https://builds.apache.org/job/kafka-trunk-jdk11/ws/connect/runtime/build/reports/tests/test/index.html>

* Try:
Run with --stacktrace option to get the stack trace. Run with --info or --debug option to get more log output. Run with --scan to get full insights.

* Get more help at https://help.gradle.org

Deprecated Gradle features were used in this build, making it incompatible with Gradle 6.0.
Use '--warning-mode all' to show the individual deprecation warnings.
See https://docs.gradle.org/5.1/userguide/command_line_interface.html#sec:command_line_warnings

BUILD FAILED in 2h 23m 43s
166 actionable tasks: 165 executed, 1 up-to-date
Build step 'Execute shell' marked build as failure
Recording test results
Setting GRADLE_4_10_2_HOME=/home/jenkins/tools/gradle/4.10.2
Setting GRADLE_4_10_2_HOME=/home/jenkins/tools/gradle/4.10.2
Not sending mail to unregistered user noreply@github.com
Not sending mail to unregistered user wangguoz@gmail.com
Not sending mail to unregistered user ismael@juma.me.uk

Jenkins build is back to normal : kafka-trunk-jdk11 #237

Posted by Apache Jenkins Server <je...@builds.apache.org>.
See <https://builds.apache.org/job/kafka-trunk-jdk11/237/display/redirect?page=changes>


Build failed in Jenkins: kafka-trunk-jdk11 #236

Posted by Apache Jenkins Server <je...@builds.apache.org>.
See <https://builds.apache.org/job/kafka-trunk-jdk11/236/display/redirect?page=changes>

Changes:

[me] KAFKA-5117: Stop resolving externalized configs in Connect REST API

------------------------------------------
[...truncated 2.27 MB...]

org.apache.kafka.connect.runtime.isolation.PluginsTest > shouldInstantiateAndConfigureConnectRestExtension STARTED

org.apache.kafka.connect.runtime.isolation.PluginsTest > shouldInstantiateAndConfigureConnectRestExtension PASSED

org.apache.kafka.connect.runtime.isolation.PluginsTest > shouldInstantiateAndConfigureConverters STARTED

org.apache.kafka.connect.runtime.isolation.PluginsTest > shouldInstantiateAndConfigureConverters PASSED

org.apache.kafka.connect.runtime.isolation.PluginsTest > shouldInstantiateAndConfigureInternalConverters STARTED

org.apache.kafka.connect.runtime.isolation.PluginsTest > shouldInstantiateAndConfigureInternalConverters PASSED

org.apache.kafka.connect.runtime.isolation.PluginsTest > shouldInstantiateAndConfigureDefaultHeaderConverter STARTED

org.apache.kafka.connect.runtime.isolation.PluginsTest > shouldInstantiateAndConfigureDefaultHeaderConverter PASSED

org.apache.kafka.connect.runtime.isolation.PluginsTest > shouldInstantiateAndConfigureExplicitlySetHeaderConverterWithCurrentClassLoader STARTED

org.apache.kafka.connect.runtime.isolation.PluginsTest > shouldInstantiateAndConfigureExplicitlySetHeaderConverterWithCurrentClassLoader PASSED

org.apache.kafka.connect.runtime.isolation.PluginDescTest > testPluginDescWithNullVersion STARTED

org.apache.kafka.connect.runtime.isolation.PluginDescTest > testPluginDescWithNullVersion PASSED

org.apache.kafka.connect.runtime.isolation.PluginDescTest > testPluginDescComparison STARTED

org.apache.kafka.connect.runtime.isolation.PluginDescTest > testPluginDescComparison PASSED

org.apache.kafka.connect.runtime.isolation.PluginDescTest > testRegularPluginDesc STARTED

org.apache.kafka.connect.runtime.isolation.PluginDescTest > testRegularPluginDesc PASSED

org.apache.kafka.connect.runtime.isolation.PluginDescTest > testPluginDescEquality STARTED

org.apache.kafka.connect.runtime.isolation.PluginDescTest > testPluginDescEquality PASSED

org.apache.kafka.connect.runtime.isolation.PluginDescTest > testPluginDescWithSystemClassLoader STARTED

org.apache.kafka.connect.runtime.isolation.PluginDescTest > testPluginDescWithSystemClassLoader PASSED

org.apache.kafka.connect.runtime.isolation.PluginUtilsTest > testPluginUrlsWithRelativeSymlinkForwards STARTED

org.apache.kafka.connect.runtime.isolation.PluginUtilsTest > testPluginUrlsWithRelativeSymlinkForwards PASSED

org.apache.kafka.connect.runtime.isolation.PluginUtilsTest > testOrderOfPluginUrlsWithJars STARTED

org.apache.kafka.connect.runtime.isolation.PluginUtilsTest > testOrderOfPluginUrlsWithJars PASSED

org.apache.kafka.connect.runtime.isolation.PluginUtilsTest > testPluginUrlsWithClasses STARTED

org.apache.kafka.connect.runtime.isolation.PluginUtilsTest > testPluginUrlsWithClasses PASSED

org.apache.kafka.connect.runtime.isolation.PluginUtilsTest > testConnectFrameworkClasses STARTED

org.apache.kafka.connect.runtime.isolation.PluginUtilsTest > testConnectFrameworkClasses PASSED

org.apache.kafka.connect.runtime.isolation.PluginUtilsTest > testThirdPartyClasses STARTED

org.apache.kafka.connect.runtime.isolation.PluginUtilsTest > testThirdPartyClasses PASSED

org.apache.kafka.connect.runtime.isolation.PluginUtilsTest > testClientConfigProvider STARTED

org.apache.kafka.connect.runtime.isolation.PluginUtilsTest > testClientConfigProvider PASSED

org.apache.kafka.connect.runtime.isolation.PluginUtilsTest > testAllowedConnectFrameworkClasses STARTED

org.apache.kafka.connect.runtime.isolation.PluginUtilsTest > testAllowedConnectFrameworkClasses PASSED

org.apache.kafka.connect.runtime.isolation.PluginUtilsTest > testJavaLibraryClasses STARTED

org.apache.kafka.connect.runtime.isolation.PluginUtilsTest > testJavaLibraryClasses PASSED

org.apache.kafka.connect.runtime.isolation.PluginUtilsTest > testEmptyPluginUrls STARTED

org.apache.kafka.connect.runtime.isolation.PluginUtilsTest > testEmptyPluginUrls PASSED

org.apache.kafka.connect.runtime.isolation.PluginUtilsTest > testPluginUrlsWithJars STARTED

org.apache.kafka.connect.runtime.isolation.PluginUtilsTest > testPluginUrlsWithJars PASSED

org.apache.kafka.connect.runtime.isolation.PluginUtilsTest > testPluginUrlsWithZips STARTED

org.apache.kafka.connect.runtime.isolation.PluginUtilsTest > testPluginUrlsWithZips PASSED

org.apache.kafka.connect.runtime.isolation.PluginUtilsTest > testPluginUrlsWithRelativeSymlinkBackwards STARTED

org.apache.kafka.connect.runtime.isolation.PluginUtilsTest > testPluginUrlsWithRelativeSymlinkBackwards PASSED

org.apache.kafka.connect.runtime.isolation.PluginUtilsTest > testPluginUrlsWithAbsoluteSymlink STARTED

org.apache.kafka.connect.runtime.isolation.PluginUtilsTest > testPluginUrlsWithAbsoluteSymlink PASSED

org.apache.kafka.connect.runtime.isolation.PluginUtilsTest > testEmptyStructurePluginUrls STARTED

org.apache.kafka.connect.runtime.isolation.PluginUtilsTest > testEmptyStructurePluginUrls PASSED

org.apache.kafka.connect.runtime.AbstractHerderTest > connectorStatus STARTED

org.apache.kafka.connect.runtime.AbstractHerderTest > connectorStatus PASSED

org.apache.kafka.connect.runtime.AbstractHerderTest > testReverseTransformConfigs STARTED

org.apache.kafka.connect.runtime.AbstractHerderTest > testReverseTransformConfigs PASSED

org.apache.kafka.connect.runtime.AbstractHerderTest > testConfigValidationEmptyConfig STARTED

org.apache.kafka.connect.runtime.AbstractHerderTest > testConfigValidationEmptyConfig PASSED

org.apache.kafka.connect.runtime.AbstractHerderTest > testConfigValidationMissingName STARTED

org.apache.kafka.connect.runtime.AbstractHerderTest > testConfigValidationMissingName PASSED

org.apache.kafka.connect.runtime.AbstractHerderTest > testConfigValidationInvalidTopics STARTED

org.apache.kafka.connect.runtime.AbstractHerderTest > testConfigValidationInvalidTopics PASSED

org.apache.kafka.connect.runtime.AbstractHerderTest > testConfigValidationTransformsExtendResults STARTED

org.apache.kafka.connect.runtime.AbstractHerderTest > testConfigValidationTransformsExtendResults PASSED

org.apache.kafka.connect.runtime.AbstractHerderTest > taskStatus STARTED

org.apache.kafka.connect.runtime.AbstractHerderTest > taskStatus PASSED

org.apache.kafka.connect.runtime.standalone.StandaloneHerderTest > testPutTaskConfigs STARTED

org.apache.kafka.connect.runtime.standalone.StandaloneHerderTest > testPutTaskConfigs PASSED

org.apache.kafka.connect.runtime.standalone.StandaloneHerderTest > testPutConnectorConfig STARTED

org.apache.kafka.connect.runtime.standalone.StandaloneHerderTest > testPutConnectorConfig PASSED

org.apache.kafka.connect.runtime.standalone.StandaloneHerderTest > testCreateConnectorFailedCustomValidation STARTED

org.apache.kafka.connect.runtime.standalone.StandaloneHerderTest > testCreateConnectorFailedCustomValidation PASSED

org.apache.kafka.connect.runtime.standalone.StandaloneHerderTest > testCreateConnectorAlreadyExists STARTED

org.apache.kafka.connect.runtime.standalone.StandaloneHerderTest > testCreateConnectorAlreadyExists PASSED

org.apache.kafka.connect.runtime.standalone.StandaloneHerderTest > testDestroyConnector STARTED

org.apache.kafka.connect.runtime.standalone.StandaloneHerderTest > testDestroyConnector PASSED

org.apache.kafka.connect.runtime.standalone.StandaloneHerderTest > testRestartConnector STARTED

org.apache.kafka.connect.runtime.standalone.StandaloneHerderTest > testRestartConnector PASSED

org.apache.kafka.connect.runtime.standalone.StandaloneHerderTest > testRestartTask STARTED

org.apache.kafka.connect.runtime.standalone.StandaloneHerderTest > testRestartTask PASSED

org.apache.kafka.connect.runtime.standalone.StandaloneHerderTest > testAccessors STARTED

org.apache.kafka.connect.runtime.standalone.StandaloneHerderTest > testAccessors PASSED

org.apache.kafka.connect.runtime.standalone.StandaloneHerderTest > testCreateConnectorFailedBasicValidation STARTED

org.apache.kafka.connect.runtime.standalone.StandaloneHerderTest > testCreateConnectorFailedBasicValidation PASSED

org.apache.kafka.connect.runtime.standalone.StandaloneHerderTest > testCreateSourceConnector STARTED

org.apache.kafka.connect.runtime.standalone.StandaloneHerderTest > testCreateSourceConnector PASSED

org.apache.kafka.connect.runtime.standalone.StandaloneHerderTest > testCreateSinkConnector STARTED

org.apache.kafka.connect.runtime.standalone.StandaloneHerderTest > testCreateSinkConnector PASSED

org.apache.kafka.connect.runtime.standalone.StandaloneHerderTest > testRestartConnectorFailureOnStart STARTED

org.apache.kafka.connect.runtime.standalone.StandaloneHerderTest > testRestartConnectorFailureOnStart PASSED

org.apache.kafka.connect.runtime.standalone.StandaloneHerderTest > testRestartTaskFailureOnStart STARTED

org.apache.kafka.connect.runtime.standalone.StandaloneHerderTest > testRestartTaskFailureOnStart PASSED

org.apache.kafka.connect.runtime.standalone.StandaloneHerderTest > testCreateAndStop STARTED

org.apache.kafka.connect.runtime.standalone.StandaloneHerderTest > testCreateAndStop PASSED

org.apache.kafka.connect.runtime.standalone.StandaloneHerderTest > testCorruptConfig STARTED

org.apache.kafka.connect.runtime.standalone.StandaloneHerderTest > testCorruptConfig PASSED

384 tests completed, 1 failed

> Task :connect:runtime:test FAILED

> Task :generator:test

org.apache.kafka.message.MessageGeneratorTest > testToSnakeCase STARTED

org.apache.kafka.message.MessageGeneratorTest > testToSnakeCase PASSED

org.apache.kafka.message.MessageGeneratorTest > testCapitalizeFirst STARTED

org.apache.kafka.message.MessageGeneratorTest > testCapitalizeFirst PASSED

org.apache.kafka.message.MessageGeneratorTest > testLowerCaseFirst STARTED

org.apache.kafka.message.MessageGeneratorTest > testLowerCaseFirst PASSED

org.apache.kafka.message.MessageGeneratorTest > testFirstIsCapitalized STARTED

org.apache.kafka.message.MessageGeneratorTest > testFirstIsCapitalized PASSED

org.apache.kafka.message.VersionsTest > testIntersections STARTED

org.apache.kafka.message.VersionsTest > testIntersections PASSED

org.apache.kafka.message.VersionsTest > testRoundTrips STARTED

org.apache.kafka.message.VersionsTest > testRoundTrips PASSED

org.apache.kafka.message.VersionsTest > testVersionsParse STARTED

org.apache.kafka.message.VersionsTest > testVersionsParse PASSED

org.apache.kafka.message.VersionsTest > testContains STARTED

org.apache.kafka.message.VersionsTest > testContains PASSED

FAILURE: Build failed with an exception.

* What went wrong:
Execution failed for task ':connect:runtime:test'.
> There were failing tests. See the report at: file://<https://builds.apache.org/job/kafka-trunk-jdk11/ws/connect/runtime/build/reports/tests/test/index.html>

* Try:
Run with --stacktrace option to get the stack trace. Run with --info or --debug option to get more log output. Run with --scan to get full insights.

* Get more help at https://help.gradle.org

Deprecated Gradle features were used in this build, making it incompatible with Gradle 6.0.
Use '--warning-mode all' to show the individual deprecation warnings.
See https://docs.gradle.org/5.1/userguide/command_line_interface.html#sec:command_line_warnings

BUILD FAILED in 2h 31m 18s
173 actionable tasks: 171 executed, 2 up-to-date
Build step 'Execute shell' marked build as failure
Recording test results
Setting GRADLE_4_10_2_HOME=/home/jenkins/tools/gradle/4.10.2
Setting GRADLE_4_10_2_HOME=/home/jenkins/tools/gradle/4.10.2
Not sending mail to unregistered user ismael@juma.me.uk
Not sending mail to unregistered user manikumar.reddy@gmail.com
Not sending mail to unregistered user wangguoz@gmail.com
Not sending mail to unregistered user vahid.hashemian@gmail.com
Not sending mail to unregistered user noreply@github.com

Build failed in Jenkins: kafka-trunk-jdk11 #235

Posted by Apache Jenkins Server <je...@builds.apache.org>.
See <https://builds.apache.org/job/kafka-trunk-jdk11/235/display/redirect?page=changes>

Changes:

[github] MINOR: Cleanup handling of mixed transactional/idempotent records

------------------------------------------
[...truncated 2.27 MB...]
org.apache.kafka.connect.transforms.RegexRouterTest > slice STARTED

org.apache.kafka.connect.transforms.RegexRouterTest > slice PASSED

org.apache.kafka.connect.transforms.RegexRouterTest > staticReplacement STARTED

org.apache.kafka.connect.transforms.RegexRouterTest > staticReplacement PASSED

org.apache.kafka.connect.transforms.util.NonEmptyListValidatorTest > testNullList STARTED

org.apache.kafka.connect.transforms.util.NonEmptyListValidatorTest > testNullList PASSED

org.apache.kafka.connect.transforms.util.NonEmptyListValidatorTest > testEmptyList STARTED

org.apache.kafka.connect.transforms.util.NonEmptyListValidatorTest > testEmptyList PASSED

org.apache.kafka.connect.transforms.util.NonEmptyListValidatorTest > testValidList STARTED

org.apache.kafka.connect.transforms.util.NonEmptyListValidatorTest > testValidList PASSED

org.apache.kafka.connect.transforms.ExtractFieldTest > withSchema STARTED

org.apache.kafka.connect.transforms.ExtractFieldTest > withSchema PASSED

org.apache.kafka.connect.transforms.ExtractFieldTest > testNullWithSchema STARTED

org.apache.kafka.connect.transforms.ExtractFieldTest > testNullWithSchema PASSED

org.apache.kafka.connect.transforms.ExtractFieldTest > schemaless STARTED

org.apache.kafka.connect.transforms.ExtractFieldTest > schemaless PASSED

org.apache.kafka.connect.transforms.ExtractFieldTest > testNullSchemaless STARTED

org.apache.kafka.connect.transforms.ExtractFieldTest > testNullSchemaless PASSED

org.apache.kafka.connect.transforms.MaskFieldTest > withSchema STARTED

org.apache.kafka.connect.transforms.MaskFieldTest > withSchema PASSED

org.apache.kafka.connect.transforms.MaskFieldTest > schemaless STARTED

org.apache.kafka.connect.transforms.MaskFieldTest > schemaless PASSED

org.apache.kafka.connect.transforms.InsertFieldTest > schemalessInsertConfiguredFields STARTED

org.apache.kafka.connect.transforms.InsertFieldTest > schemalessInsertConfiguredFields PASSED

org.apache.kafka.connect.transforms.InsertFieldTest > topLevelStructRequired STARTED

org.apache.kafka.connect.transforms.InsertFieldTest > topLevelStructRequired PASSED

org.apache.kafka.connect.transforms.InsertFieldTest > copySchemaAndInsertConfiguredFields STARTED

org.apache.kafka.connect.transforms.InsertFieldTest > copySchemaAndInsertConfiguredFields PASSED

org.apache.kafka.connect.transforms.ValueToKeyTest > withSchema STARTED

org.apache.kafka.connect.transforms.ValueToKeyTest > withSchema PASSED

org.apache.kafka.connect.transforms.ValueToKeyTest > schemaless STARTED

org.apache.kafka.connect.transforms.ValueToKeyTest > schemaless PASSED

org.apache.kafka.connect.transforms.TimestampRouterTest > defaultConfiguration STARTED

org.apache.kafka.connect.transforms.TimestampRouterTest > defaultConfiguration PASSED

> Task :streams:streams-scala:test

org.apache.kafka.streams.scala.StreamToTableJoinScalaIntegrationTestImplicitSerdes > testShouldCountClicksPerRegionWithNamedRepartitionTopic STARTED

org.apache.kafka.streams.scala.StreamToTableJoinScalaIntegrationTestImplicitSerdes > testShouldCountClicksPerRegionWithNamedRepartitionTopic PASSED

org.apache.kafka.streams.scala.StreamToTableJoinScalaIntegrationTestImplicitSerdes > testShouldCountClicksPerRegionJava STARTED

org.apache.kafka.streams.scala.StreamToTableJoinScalaIntegrationTestImplicitSerdes > testShouldCountClicksPerRegionJava PASSED

org.apache.kafka.streams.scala.StreamToTableJoinScalaIntegrationTestImplicitSerdes > testShouldCountClicksPerRegion STARTED

org.apache.kafka.streams.scala.StreamToTableJoinScalaIntegrationTestImplicitSerdes > testShouldCountClicksPerRegion PASSED

org.apache.kafka.streams.scala.kstream.ConsumedTest > Create a Consumed should create a Consumed with Serdes STARTED

org.apache.kafka.streams.scala.kstream.ConsumedTest > Create a Consumed should create a Consumed with Serdes PASSED

org.apache.kafka.streams.scala.kstream.ConsumedTest > Create a Consumed with timestampExtractor and resetPolicy should create a Consumed with Serdes, timestampExtractor and resetPolicy STARTED

org.apache.kafka.streams.scala.kstream.ConsumedTest > Create a Consumed with timestampExtractor and resetPolicy should create a Consumed with Serdes, timestampExtractor and resetPolicy PASSED

org.apache.kafka.streams.scala.kstream.ConsumedTest > Create a Consumed with timestampExtractor should create a Consumed with Serdes and timestampExtractor STARTED

org.apache.kafka.streams.scala.kstream.ConsumedTest > Create a Consumed with timestampExtractor should create a Consumed with Serdes and timestampExtractor PASSED

org.apache.kafka.streams.scala.kstream.ConsumedTest > Create a Consumed with resetPolicy should create a Consumed with Serdes and resetPolicy STARTED

org.apache.kafka.streams.scala.kstream.ConsumedTest > Create a Consumed with resetPolicy should create a Consumed with Serdes and resetPolicy PASSED

org.apache.kafka.streams.scala.kstream.ProducedTest > Create a Produced should create a Produced with Serdes STARTED

org.apache.kafka.streams.scala.kstream.ProducedTest > Create a Produced should create a Produced with Serdes PASSED

org.apache.kafka.streams.scala.kstream.ProducedTest > Create a Produced with timestampExtractor and resetPolicy should create a Consumed with Serdes, timestampExtractor and resetPolicy STARTED

org.apache.kafka.streams.scala.kstream.ProducedTest > Create a Produced with timestampExtractor and resetPolicy should create a Consumed with Serdes, timestampExtractor and resetPolicy PASSED

org.apache.kafka.streams.scala.kstream.GroupedTest > Create a Grouped should create a Grouped with Serdes STARTED

org.apache.kafka.streams.scala.kstream.GroupedTest > Create a Grouped should create a Grouped with Serdes PASSED

org.apache.kafka.streams.scala.kstream.GroupedTest > Create a Grouped with repartition topic name should create a Grouped with Serdes, and repartition topic name STARTED

org.apache.kafka.streams.scala.kstream.GroupedTest > Create a Grouped with repartition topic name should create a Grouped with Serdes, and repartition topic name PASSED

org.apache.kafka.streams.scala.kstream.JoinedTest > Create a Joined should create a Joined with Serdes STARTED

org.apache.kafka.streams.scala.kstream.JoinedTest > Create a Joined should create a Joined with Serdes PASSED

org.apache.kafka.streams.scala.kstream.JoinedTest > Create a Joined should create a Joined with Serdes and repartition topic name STARTED

org.apache.kafka.streams.scala.kstream.JoinedTest > Create a Joined should create a Joined with Serdes and repartition topic name PASSED

org.apache.kafka.streams.scala.kstream.KTableTest > filter a KTable should filter records satisfying the predicate STARTED

org.apache.kafka.streams.scala.kstream.KTableTest > filter a KTable should filter records satisfying the predicate PASSED

org.apache.kafka.streams.scala.kstream.KTableTest > filterNot a KTable should filter records not satisfying the predicate STARTED

org.apache.kafka.streams.scala.kstream.KTableTest > filterNot a KTable should filter records not satisfying the predicate PASSED

org.apache.kafka.streams.scala.kstream.KTableTest > join 2 KTables should join correctly records STARTED

org.apache.kafka.streams.scala.kstream.KTableTest > join 2 KTables should join correctly records PASSED

org.apache.kafka.streams.scala.kstream.KTableTest > join 2 KTables with a Materialized should join correctly records and state store STARTED

org.apache.kafka.streams.scala.kstream.KTableTest > join 2 KTables with a Materialized should join correctly records and state store PASSED

org.apache.kafka.streams.scala.kstream.MaterializedTest > Create a Materialized should create a Materialized with Serdes STARTED

org.apache.kafka.streams.scala.kstream.MaterializedTest > Create a Materialized should create a Materialized with Serdes PASSED

org.apache.kafka.streams.scala.kstream.MaterializedTest > Create a Materialize with a store name should create a Materialized with Serdes and a store name STARTED

org.apache.kafka.streams.scala.kstream.MaterializedTest > Create a Materialize with a store name should create a Materialized with Serdes and a store name PASSED

org.apache.kafka.streams.scala.kstream.MaterializedTest > Create a Materialize with a window store supplier should create a Materialized with Serdes and a store supplier STARTED

org.apache.kafka.streams.scala.kstream.MaterializedTest > Create a Materialize with a window store supplier should create a Materialized with Serdes and a store supplier PASSED

org.apache.kafka.streams.scala.kstream.MaterializedTest > Create a Materialize with a key value store supplier should create a Materialized with Serdes and a store supplier STARTED

org.apache.kafka.streams.scala.kstream.MaterializedTest > Create a Materialize with a key value store supplier should create a Materialized with Serdes and a store supplier PASSED

org.apache.kafka.streams.scala.kstream.MaterializedTest > Create a Materialize with a session store supplier should create a Materialized with Serdes and a store supplier STARTED

org.apache.kafka.streams.scala.kstream.MaterializedTest > Create a Materialize with a session store supplier should create a Materialized with Serdes and a store supplier PASSED

org.apache.kafka.streams.scala.kstream.KStreamTest > filter a KStream should filter records satisfying the predicate STARTED

org.apache.kafka.streams.scala.kstream.KStreamTest > filter a KStream should filter records satisfying the predicate PASSED

org.apache.kafka.streams.scala.kstream.KStreamTest > filterNot a KStream should filter records not satisfying the predicate STARTED

org.apache.kafka.streams.scala.kstream.KStreamTest > filterNot a KStream should filter records not satisfying the predicate PASSED

org.apache.kafka.streams.scala.kstream.KStreamTest > foreach a KStream should run foreach actions on records STARTED

org.apache.kafka.streams.scala.kstream.KStreamTest > foreach a KStream should run foreach actions on records PASSED

org.apache.kafka.streams.scala.kstream.KStreamTest > peek a KStream should run peek actions on records STARTED

org.apache.kafka.streams.scala.kstream.KStreamTest > peek a KStream should run peek actions on records PASSED

org.apache.kafka.streams.scala.kstream.KStreamTest > selectKey a KStream should select a new key STARTED

org.apache.kafka.streams.scala.kstream.KStreamTest > selectKey a KStream should select a new key PASSED

org.apache.kafka.streams.scala.kstream.KStreamTest > join 2 KStreams should join correctly records STARTED

org.apache.kafka.streams.scala.kstream.KStreamTest > join 2 KStreams should join correctly records PASSED

org.apache.kafka.streams.scala.WordCountTest > testShouldCountWordsMaterialized STARTED

org.apache.kafka.streams.scala.WordCountTest > testShouldCountWordsMaterialized PASSED

org.apache.kafka.streams.scala.WordCountTest > testShouldCountWordsJava STARTED

org.apache.kafka.streams.scala.WordCountTest > testShouldCountWordsJava PASSED

org.apache.kafka.streams.scala.WordCountTest > testShouldCountWords STARTED

org.apache.kafka.streams.scala.WordCountTest > testShouldCountWords PASSED

org.apache.kafka.streams.scala.TopologyTest > shouldBuildIdenticalTopologyInJavaNScalaJoin STARTED

org.apache.kafka.streams.scala.TopologyTest > shouldBuildIdenticalTopologyInJavaNScalaJoin PASSED

org.apache.kafka.streams.scala.TopologyTest > shouldBuildIdenticalTopologyInJavaNScalaSimple STARTED

org.apache.kafka.streams.scala.TopologyTest > shouldBuildIdenticalTopologyInJavaNScalaSimple PASSED

org.apache.kafka.streams.scala.TopologyTest > shouldBuildIdenticalTopologyInJavaNScalaAggregate STARTED

org.apache.kafka.streams.scala.TopologyTest > shouldBuildIdenticalTopologyInJavaNScalaAggregate PASSED

org.apache.kafka.streams.scala.TopologyTest > shouldBuildIdenticalTopologyInJavaNScalaTransform STARTED

org.apache.kafka.streams.scala.TopologyTest > shouldBuildIdenticalTopologyInJavaNScalaTransform PASSED

FAILURE: Build completed with 2 failures.

1: Task failed with an exception.
-----------
* What went wrong:
Execution failed for task ':streams:test'.
> There were failing tests. See the report at: file://<https://builds.apache.org/job/kafka-trunk-jdk11/ws/streams/build/reports/tests/test/index.html>

* Try:
Run with --stacktrace option to get the stack trace. Run with --info or --debug option to get more log output. Run with --scan to get full insights.
==============================================================================

2: Task failed with an exception.
-----------
* What went wrong:
Execution failed for task ':connect:runtime:test'.
> There were failing tests. See the report at: file://<https://builds.apache.org/job/kafka-trunk-jdk11/ws/connect/runtime/build/reports/tests/test/index.html>

* Try:
Run with --stacktrace option to get the stack trace. Run with --info or --debug option to get more log output. Run with --scan to get full insights.
==============================================================================

* Get more help at https://help.gradle.org

Deprecated Gradle features were used in this build, making it incompatible with Gradle 6.0.
Use '--warning-mode all' to show the individual deprecation warnings.
See https://docs.gradle.org/5.1/userguide/command_line_interface.html#sec:command_line_warnings

BUILD FAILED in 2h 33m 43s
173 actionable tasks: 171 executed, 2 up-to-date
Build step 'Execute shell' marked build as failure
Recording test results
Setting GRADLE_4_10_2_HOME=/home/jenkins/tools/gradle/4.10.2
Setting GRADLE_4_10_2_HOME=/home/jenkins/tools/gradle/4.10.2
Not sending mail to unregistered user ismael@juma.me.uk
Not sending mail to unregistered user manikumar.reddy@gmail.com
Not sending mail to unregistered user wangguoz@gmail.com
Not sending mail to unregistered user vahid.hashemian@gmail.com
Not sending mail to unregistered user noreply@github.com

Build failed in Jenkins: kafka-trunk-jdk11 #234

Posted by Apache Jenkins Server <je...@builds.apache.org>.
See <https://builds.apache.org/job/kafka-trunk-jdk11/234/display/redirect?page=changes>

Changes:

[ismael] KAFKA-7844: Use regular subproject for generator to fix *All targets

------------------------------------------
[...truncated 2.27 MB...]

org.apache.kafka.connect.json.JsonConverterTest > timestampToConnect PASSED

org.apache.kafka.connect.json.JsonConverterTest > timestampToConnectWithDefaultValue STARTED

org.apache.kafka.connect.json.JsonConverterTest > timestampToConnectWithDefaultValue PASSED

org.apache.kafka.connect.json.JsonConverterTest > timeToConnectOptional STARTED

org.apache.kafka.connect.json.JsonConverterTest > timeToConnectOptional PASSED

org.apache.kafka.connect.json.JsonConverterTest > dateToConnectWithDefaultValue STARTED

org.apache.kafka.connect.json.JsonConverterTest > dateToConnectWithDefaultValue PASSED

org.apache.kafka.connect.json.JsonConverterTest > nullValueToJson STARTED

org.apache.kafka.connect.json.JsonConverterTest > nullValueToJson PASSED

org.apache.kafka.connect.json.JsonConverterTest > decimalToConnect STARTED

org.apache.kafka.connect.json.JsonConverterTest > decimalToConnect PASSED

org.apache.kafka.connect.json.JsonConverterTest > stringHeaderToConnect STARTED

org.apache.kafka.connect.json.JsonConverterTest > stringHeaderToConnect PASSED

org.apache.kafka.connect.json.JsonConverterTest > mapToJsonNonStringKeys STARTED

org.apache.kafka.connect.json.JsonConverterTest > mapToJsonNonStringKeys PASSED

org.apache.kafka.connect.json.JsonConverterTest > longToJson STARTED

org.apache.kafka.connect.json.JsonConverterTest > longToJson PASSED

org.apache.kafka.connect.json.JsonConverterTest > mismatchSchemaJson STARTED

org.apache.kafka.connect.json.JsonConverterTest > mismatchSchemaJson PASSED

org.apache.kafka.connect.json.JsonConverterTest > mapToConnectNonStringKeys STARTED

org.apache.kafka.connect.json.JsonConverterTest > mapToConnectNonStringKeys PASSED

org.apache.kafka.connect.json.JsonConverterTest > testJsonSchemaMetadataTranslation STARTED

org.apache.kafka.connect.json.JsonConverterTest > testJsonSchemaMetadataTranslation PASSED

org.apache.kafka.connect.json.JsonConverterTest > bytesToJson STARTED

org.apache.kafka.connect.json.JsonConverterTest > bytesToJson PASSED

org.apache.kafka.connect.json.JsonConverterTest > shortToConnect STARTED

org.apache.kafka.connect.json.JsonConverterTest > shortToConnect PASSED

org.apache.kafka.connect.json.JsonConverterTest > intToJson STARTED

org.apache.kafka.connect.json.JsonConverterTest > intToJson PASSED

org.apache.kafka.connect.json.JsonConverterTest > nullSchemaAndNullValueToJson STARTED

org.apache.kafka.connect.json.JsonConverterTest > nullSchemaAndNullValueToJson PASSED

org.apache.kafka.connect.json.JsonConverterTest > timestampToConnectOptional STARTED

org.apache.kafka.connect.json.JsonConverterTest > timestampToConnectOptional PASSED

org.apache.kafka.connect.json.JsonConverterTest > structToConnect STARTED

org.apache.kafka.connect.json.JsonConverterTest > structToConnect PASSED

org.apache.kafka.connect.json.JsonConverterTest > stringToJson STARTED

org.apache.kafka.connect.json.JsonConverterTest > stringToJson PASSED

org.apache.kafka.connect.json.JsonConverterTest > nullSchemaAndArrayToJson STARTED

org.apache.kafka.connect.json.JsonConverterTest > nullSchemaAndArrayToJson PASSED

org.apache.kafka.connect.json.JsonConverterTest > byteToConnect STARTED

org.apache.kafka.connect.json.JsonConverterTest > byteToConnect PASSED

org.apache.kafka.connect.json.JsonConverterTest > nullSchemaPrimitiveToConnect STARTED

org.apache.kafka.connect.json.JsonConverterTest > nullSchemaPrimitiveToConnect PASSED

org.apache.kafka.connect.json.JsonConverterTest > byteToJson STARTED

org.apache.kafka.connect.json.JsonConverterTest > byteToJson PASSED

org.apache.kafka.connect.json.JsonConverterTest > intToConnect STARTED

org.apache.kafka.connect.json.JsonConverterTest > intToConnect PASSED

org.apache.kafka.connect.json.JsonConverterTest > dateToJson STARTED

org.apache.kafka.connect.json.JsonConverterTest > dateToJson PASSED

org.apache.kafka.connect.json.JsonConverterTest > noSchemaToConnect STARTED

org.apache.kafka.connect.json.JsonConverterTest > noSchemaToConnect PASSED

org.apache.kafka.connect.json.JsonConverterTest > noSchemaToJson STARTED

org.apache.kafka.connect.json.JsonConverterTest > noSchemaToJson PASSED

org.apache.kafka.connect.json.JsonConverterTest > nullSchemaAndPrimitiveToJson STARTED

org.apache.kafka.connect.json.JsonConverterTest > nullSchemaAndPrimitiveToJson PASSED

org.apache.kafka.connect.json.JsonConverterTest > decimalToConnectOptionalWithDefaultValue STARTED

org.apache.kafka.connect.json.JsonConverterTest > decimalToConnectOptionalWithDefaultValue PASSED

org.apache.kafka.connect.json.JsonConverterTest > mapToJsonStringKeys STARTED

org.apache.kafka.connect.json.JsonConverterTest > mapToJsonStringKeys PASSED

org.apache.kafka.connect.json.JsonConverterTest > arrayToJson STARTED

org.apache.kafka.connect.json.JsonConverterTest > arrayToJson PASSED

org.apache.kafka.connect.json.JsonConverterTest > nullToConnect STARTED

org.apache.kafka.connect.json.JsonConverterTest > nullToConnect PASSED

org.apache.kafka.connect.json.JsonConverterTest > timeToJson STARTED

org.apache.kafka.connect.json.JsonConverterTest > timeToJson PASSED

org.apache.kafka.connect.json.JsonConverterTest > structToJson STARTED

org.apache.kafka.connect.json.JsonConverterTest > structToJson PASSED

org.apache.kafka.connect.json.JsonConverterTest > testConnectSchemaMetadataTranslation STARTED

org.apache.kafka.connect.json.JsonConverterTest > testConnectSchemaMetadataTranslation PASSED

org.apache.kafka.connect.json.JsonConverterTest > shortToJson STARTED

org.apache.kafka.connect.json.JsonConverterTest > shortToJson PASSED

org.apache.kafka.connect.json.JsonConverterTest > dateToConnect STARTED

org.apache.kafka.connect.json.JsonConverterTest > dateToConnect PASSED

org.apache.kafka.connect.json.JsonConverterTest > doubleToJson STARTED

org.apache.kafka.connect.json.JsonConverterTest > doubleToJson PASSED

org.apache.kafka.connect.json.JsonConverterTest > testStringHeaderToJson STARTED

org.apache.kafka.connect.json.JsonConverterTest > testStringHeaderToJson PASSED

org.apache.kafka.connect.json.JsonConverterTest > decimalToConnectOptional STARTED

org.apache.kafka.connect.json.JsonConverterTest > decimalToConnectOptional PASSED

org.apache.kafka.connect.json.JsonConverterTest > structSchemaIdentical STARTED

org.apache.kafka.connect.json.JsonConverterTest > structSchemaIdentical PASSED

org.apache.kafka.connect.json.JsonConverterTest > timeToConnectWithDefaultValue STARTED

org.apache.kafka.connect.json.JsonConverterTest > timeToConnectWithDefaultValue PASSED

org.apache.kafka.connect.json.JsonConverterTest > timeToConnect STARTED

org.apache.kafka.connect.json.JsonConverterTest > timeToConnect PASSED

org.apache.kafka.connect.json.JsonConverterTest > dateToConnectOptionalWithDefaultValue STARTED

org.apache.kafka.connect.json.JsonConverterTest > dateToConnectOptionalWithDefaultValue PASSED

org.apache.kafka.connect.json.JsonConverterTest > mapToConnectStringKeys STARTED

org.apache.kafka.connect.json.JsonConverterTest > mapToConnectStringKeys PASSED

org.apache.kafka.connect.json.JsonConverterTest > dateToConnectOptional STARTED

org.apache.kafka.connect.json.JsonConverterTest > dateToConnectOptional PASSED

org.apache.kafka.connect.json.JsonConverterTest > timeToConnectOptionalWithDefaultValue STARTED

org.apache.kafka.connect.json.JsonConverterTest > timeToConnectOptionalWithDefaultValue PASSED

org.apache.kafka.connect.json.JsonConverterTest > floatToConnect STARTED

org.apache.kafka.connect.json.JsonConverterTest > floatToConnect PASSED

org.apache.kafka.connect.json.JsonConverterTest > decimalToConnectWithDefaultValue STARTED

org.apache.kafka.connect.json.JsonConverterTest > decimalToConnectWithDefaultValue PASSED

org.apache.kafka.connect.json.JsonConverterTest > decimalToJson STARTED

org.apache.kafka.connect.json.JsonConverterTest > decimalToJson PASSED

org.apache.kafka.connect.json.JsonConverterTest > arrayToConnect STARTED

org.apache.kafka.connect.json.JsonConverterTest > arrayToConnect PASSED

org.apache.kafka.connect.json.JsonConverterTest > testCacheSchemaToConnectConversion STARTED

org.apache.kafka.connect.json.JsonConverterTest > testCacheSchemaToConnectConversion PASSED

org.apache.kafka.connect.json.JsonConverterTest > booleanToJson STARTED

org.apache.kafka.connect.json.JsonConverterTest > booleanToJson PASSED

org.apache.kafka.connect.json.JsonConverterTest > bytesToConnect STARTED

org.apache.kafka.connect.json.JsonConverterTest > bytesToConnect PASSED

org.apache.kafka.connect.json.JsonConverterTest > doubleToConnect STARTED

org.apache.kafka.connect.json.JsonConverterTest > doubleToConnect PASSED

org.apache.kafka.connect.json.JsonConverterTest > timestampToConnectOptionalWithDefaultValue STARTED

org.apache.kafka.connect.json.JsonConverterTest > timestampToConnectOptionalWithDefaultValue PASSED

FAILURE: Build failed with an exception.

* What went wrong:
Execution failed for task ':connect:runtime:test'.
> There were failing tests. See the report at: file://<https://builds.apache.org/job/kafka-trunk-jdk11/ws/connect/runtime/build/reports/tests/test/index.html>

* Try:
Run with --stacktrace option to get the stack trace. Run with --info or --debug option to get more log output. Run with --scan to get full insights.

* Get more help at https://help.gradle.org

Deprecated Gradle features were used in this build, making it incompatible with Gradle 6.0.
Use '--warning-mode all' to show the individual deprecation warnings.
See https://docs.gradle.org/5.1/userguide/command_line_interface.html#sec:command_line_warnings

BUILD FAILED in 2h 22m 21s
173 actionable tasks: 171 executed, 2 up-to-date
Build step 'Execute shell' marked build as failure
Recording test results
Setting GRADLE_4_10_2_HOME=/home/jenkins/tools/gradle/4.10.2
Setting GRADLE_4_10_2_HOME=/home/jenkins/tools/gradle/4.10.2
Not sending mail to unregistered user ismael@juma.me.uk
Not sending mail to unregistered user manikumar.reddy@gmail.com
Not sending mail to unregistered user wangguoz@gmail.com
Not sending mail to unregistered user vahid.hashemian@gmail.com
Not sending mail to unregistered user noreply@github.com

Build failed in Jenkins: kafka-trunk-jdk11 #233

Posted by Apache Jenkins Server <je...@builds.apache.org>.
See <https://builds.apache.org/job/kafka-trunk-jdk11/233/display/redirect?page=changes>

Changes:

[vahid.hashemian] Fix Documentation for cleanup.policy is out of date (#6181)

------------------------------------------
[...truncated 2.27 MB...]

org.apache.kafka.streams.test.OutputVerifierTest > shouldFailIfValueIsDifferentWithNullForCompareKeyValue STARTED

org.apache.kafka.streams.test.OutputVerifierTest > shouldFailIfValueIsDifferentWithNullForCompareKeyValue PASSED

org.apache.kafka.streams.test.OutputVerifierTest > shouldFailIfKeyIsDifferentWithNullForCompareKeyValueTimestamp STARTED

org.apache.kafka.streams.test.OutputVerifierTest > shouldFailIfKeyIsDifferentWithNullForCompareKeyValueTimestamp PASSED

org.apache.kafka.streams.test.OutputVerifierTest > shouldFailIfKeyIsDifferentForCompareKeyValueWithProducerRecord STARTED

org.apache.kafka.streams.test.OutputVerifierTest > shouldFailIfKeyIsDifferentForCompareKeyValueWithProducerRecord PASSED

org.apache.kafka.streams.test.OutputVerifierTest > shouldFailIfValueIsDifferentWithNullForCompareKeyValueTimestamp STARTED

org.apache.kafka.streams.test.OutputVerifierTest > shouldFailIfValueIsDifferentWithNullForCompareKeyValueTimestamp PASSED

org.apache.kafka.streams.test.OutputVerifierTest > shouldFailIfTimestampIsDifferentForCompareValueTimestampWithProducerRecord STARTED

org.apache.kafka.streams.test.OutputVerifierTest > shouldFailIfTimestampIsDifferentForCompareValueTimestampWithProducerRecord PASSED

org.apache.kafka.streams.test.OutputVerifierTest > shouldPassIfKeyAndValueIsEqualForCompareKeyValue STARTED

org.apache.kafka.streams.test.OutputVerifierTest > shouldPassIfKeyAndValueIsEqualForCompareKeyValue PASSED

org.apache.kafka.streams.test.OutputVerifierTest > shouldNotAllowNullProducerRecordForCompareKeyValueTimestamp STARTED

org.apache.kafka.streams.test.OutputVerifierTest > shouldNotAllowNullProducerRecordForCompareKeyValueTimestamp PASSED

org.apache.kafka.streams.test.OutputVerifierTest > shouldPassIfKeyAndValueIsEqualWithNullForCompareKeyValueTimestamp STARTED

org.apache.kafka.streams.test.OutputVerifierTest > shouldPassIfKeyAndValueIsEqualWithNullForCompareKeyValueTimestamp PASSED

org.apache.kafka.streams.test.OutputVerifierTest > shouldPassIfValueAndTimestampIsEqualForCompareValueTimestamp STARTED

org.apache.kafka.streams.test.OutputVerifierTest > shouldPassIfValueAndTimestampIsEqualForCompareValueTimestamp PASSED

org.apache.kafka.streams.test.OutputVerifierTest > shouldNotAllowNullExpectedRecordForCompareKeyValue STARTED

org.apache.kafka.streams.test.OutputVerifierTest > shouldNotAllowNullExpectedRecordForCompareKeyValue PASSED

org.apache.kafka.streams.test.OutputVerifierTest > shouldFailIfValueIsDifferentForCompareValueTimestampWithProducerRecord STARTED

org.apache.kafka.streams.test.OutputVerifierTest > shouldFailIfValueIsDifferentForCompareValueTimestampWithProducerRecord PASSED

org.apache.kafka.streams.test.OutputVerifierTest > shouldFailIfValueIsDifferentWithNullReversForCompareKeyValue STARTED

org.apache.kafka.streams.test.OutputVerifierTest > shouldFailIfValueIsDifferentWithNullReversForCompareKeyValue PASSED

org.apache.kafka.streams.test.OutputVerifierTest > shouldNotAllowNullExpectedRecordForCompareKeyValueTimestamp STARTED

org.apache.kafka.streams.test.OutputVerifierTest > shouldNotAllowNullExpectedRecordForCompareKeyValueTimestamp PASSED

org.apache.kafka.streams.test.OutputVerifierTest > shouldFailIfValueIsDifferentForCompareValueWithProducerRecord STARTED

org.apache.kafka.streams.test.OutputVerifierTest > shouldFailIfValueIsDifferentForCompareValueWithProducerRecord PASSED

org.apache.kafka.streams.test.OutputVerifierTest > shouldPassIfValueIsEqualForCompareValue STARTED

org.apache.kafka.streams.test.OutputVerifierTest > shouldPassIfValueIsEqualForCompareValue PASSED

org.apache.kafka.streams.test.OutputVerifierTest > shouldNotAllowNullProducerRecordWithExpectedRecordForCompareKeyValueTimestamp STARTED

org.apache.kafka.streams.test.OutputVerifierTest > shouldNotAllowNullProducerRecordWithExpectedRecordForCompareKeyValueTimestamp PASSED

org.apache.kafka.streams.test.OutputVerifierTest > shouldFailIfKeyIsDifferentForCompareKeyValue STARTED

org.apache.kafka.streams.test.OutputVerifierTest > shouldFailIfKeyIsDifferentForCompareKeyValue PASSED

org.apache.kafka.streams.test.OutputVerifierTest > shouldNotAllowNullProducerRecordWithExpectedRecordForCompareKeyValue STARTED

org.apache.kafka.streams.test.OutputVerifierTest > shouldNotAllowNullProducerRecordWithExpectedRecordForCompareKeyValue PASSED

org.apache.kafka.streams.test.OutputVerifierTest > shouldFailIfKeyIsDifferentWithNullForCompareKeyValueWithProducerRecord STARTED

org.apache.kafka.streams.test.OutputVerifierTest > shouldFailIfKeyIsDifferentWithNullForCompareKeyValueWithProducerRecord PASSED

org.apache.kafka.streams.test.OutputVerifierTest > shouldPassIfKeyAndValueAndTimestampIsEqualForCompareKeyValueTimestampWithProducerRecord STARTED

org.apache.kafka.streams.test.OutputVerifierTest > shouldPassIfKeyAndValueAndTimestampIsEqualForCompareKeyValueTimestampWithProducerRecord PASSED

org.apache.kafka.streams.test.OutputVerifierTest > shouldPassIfValueIsEqualWithNullForCompareValue STARTED

org.apache.kafka.streams.test.OutputVerifierTest > shouldPassIfValueIsEqualWithNullForCompareValue PASSED

org.apache.kafka.streams.test.OutputVerifierTest > shouldPassIfValueAndTimestampIsEqualWithNullForCompareValueTimestamp STARTED

org.apache.kafka.streams.test.OutputVerifierTest > shouldPassIfValueAndTimestampIsEqualWithNullForCompareValueTimestamp PASSED

org.apache.kafka.streams.test.OutputVerifierTest > shouldFailIfValueIsDifferentWithNullForCompareValueTimestampWithProducerRecord STARTED

org.apache.kafka.streams.test.OutputVerifierTest > shouldFailIfValueIsDifferentWithNullForCompareValueTimestampWithProducerRecord PASSED

org.apache.kafka.streams.test.OutputVerifierTest > shouldFailIfValueIsDifferentWithNullForCompareValueWithProducerRecord STARTED

org.apache.kafka.streams.test.OutputVerifierTest > shouldFailIfValueIsDifferentWithNullForCompareValueWithProducerRecord PASSED

org.apache.kafka.streams.test.OutputVerifierTest > shouldFailIfKeyIsDifferentWithNullReversForCompareKeyValueTimestampWithProducerRecord STARTED

org.apache.kafka.streams.test.OutputVerifierTest > shouldFailIfKeyIsDifferentWithNullReversForCompareKeyValueTimestampWithProducerRecord PASSED

org.apache.kafka.streams.test.OutputVerifierTest > shouldFailIfKeyIsDifferentWithNullReversForCompareKeyValue STARTED

org.apache.kafka.streams.test.OutputVerifierTest > shouldFailIfKeyIsDifferentWithNullReversForCompareKeyValue PASSED

org.apache.kafka.streams.test.OutputVerifierTest > shouldPassIfKeyAndValueIsEqualForCompareKeyValueWithProducerRecord STARTED

org.apache.kafka.streams.test.OutputVerifierTest > shouldPassIfKeyAndValueIsEqualForCompareKeyValueWithProducerRecord PASSED

org.apache.kafka.streams.test.OutputVerifierTest > shouldFailIfValueIsDifferentForCompareKeyValueWithProducerRecord STARTED

org.apache.kafka.streams.test.OutputVerifierTest > shouldFailIfValueIsDifferentForCompareKeyValueWithProducerRecord PASSED

org.apache.kafka.streams.test.OutputVerifierTest > shouldFailIfValueIsDifferentForCompareValueTimestamp STARTED

org.apache.kafka.streams.test.OutputVerifierTest > shouldFailIfValueIsDifferentForCompareValueTimestamp PASSED

org.apache.kafka.streams.test.OutputVerifierTest > shouldNotAllowNullProducerRecordForCompareValue STARTED

org.apache.kafka.streams.test.OutputVerifierTest > shouldNotAllowNullProducerRecordForCompareValue PASSED

org.apache.kafka.streams.test.OutputVerifierTest > shouldFailIfValueIsDifferentWithNullForCompareValueTimestamp STARTED

org.apache.kafka.streams.test.OutputVerifierTest > shouldFailIfValueIsDifferentWithNullForCompareValueTimestamp PASSED

org.apache.kafka.streams.test.OutputVerifierTest > shouldFailIfKeyIsDifferentForCompareKeyValueTimestamp STARTED

org.apache.kafka.streams.test.OutputVerifierTest > shouldFailIfKeyIsDifferentForCompareKeyValueTimestamp PASSED

org.apache.kafka.streams.test.OutputVerifierTest > shouldFailIfKeyIsDifferentForCompareKeyValueTimestampWithProducerRecord STARTED

org.apache.kafka.streams.test.OutputVerifierTest > shouldFailIfKeyIsDifferentForCompareKeyValueTimestampWithProducerRecord PASSED

org.apache.kafka.streams.test.OutputVerifierTest > shouldPassIfValueIsEqualWithNullForCompareValueWithProducerRecord STARTED

org.apache.kafka.streams.test.OutputVerifierTest > shouldPassIfValueIsEqualWithNullForCompareValueWithProducerRecord PASSED

org.apache.kafka.streams.test.OutputVerifierTest > shouldFailIfValueIsDifferentWithNullReverseForCompareValueTimestamp STARTED

org.apache.kafka.streams.test.OutputVerifierTest > shouldFailIfValueIsDifferentWithNullReverseForCompareValueTimestamp PASSED

org.apache.kafka.streams.test.OutputVerifierTest > shouldFailIfValueIsDifferentWithNullReverseForCompareValue STARTED

org.apache.kafka.streams.test.OutputVerifierTest > shouldFailIfValueIsDifferentWithNullReverseForCompareValue PASSED

org.apache.kafka.streams.test.OutputVerifierTest > shouldFailIfTimestampIsDifferentForCompareValueTimestamp STARTED

org.apache.kafka.streams.test.OutputVerifierTest > shouldFailIfTimestampIsDifferentForCompareValueTimestamp PASSED

org.apache.kafka.streams.test.OutputVerifierTest > shouldPassIfKeyAndValueAndTimestampIsEqualWithNullForCompareKeyValueTimestampWithProducerRecord STARTED

org.apache.kafka.streams.test.OutputVerifierTest > shouldPassIfKeyAndValueAndTimestampIsEqualWithNullForCompareKeyValueTimestampWithProducerRecord PASSED

org.apache.kafka.streams.test.OutputVerifierTest > shouldFailIfValueIsDifferentWithNullForCompareKeyValueWithProducerRecord STARTED

org.apache.kafka.streams.test.OutputVerifierTest > shouldFailIfValueIsDifferentWithNullForCompareKeyValueWithProducerRecord PASSED

org.apache.kafka.streams.test.OutputVerifierTest > shouldFailIfValueIsDifferentForCompareKeyValueTimestampWithProducerRecord STARTED

org.apache.kafka.streams.test.OutputVerifierTest > shouldFailIfValueIsDifferentForCompareKeyValueTimestampWithProducerRecord PASSED

org.apache.kafka.streams.test.OutputVerifierTest > shouldNotAllowNullProducerRecordWithExpectedRecordForCompareValueTimestamp STARTED

org.apache.kafka.streams.test.OutputVerifierTest > shouldNotAllowNullProducerRecordWithExpectedRecordForCompareValueTimestamp PASSED

org.apache.kafka.streams.test.OutputVerifierTest > shouldNotAllowNullExpectedRecordForCompareValue STARTED

org.apache.kafka.streams.test.OutputVerifierTest > shouldNotAllowNullExpectedRecordForCompareValue PASSED

org.apache.kafka.streams.test.OutputVerifierTest > shouldFailIfValueIsDifferentWithNullReversForCompareKeyValueTimestampWithProducerRecord STARTED

org.apache.kafka.streams.test.OutputVerifierTest > shouldFailIfValueIsDifferentWithNullReversForCompareKeyValueTimestampWithProducerRecord PASSED

org.apache.kafka.streams.test.OutputVerifierTest > shouldNotAllowNullProducerRecordForCompareKeyValue STARTED

org.apache.kafka.streams.test.OutputVerifierTest > shouldNotAllowNullProducerRecordForCompareKeyValue PASSED

org.apache.kafka.streams.test.OutputVerifierTest > shouldFailIfValueIsDifferentWithNullReversForCompareKeyValueWithProducerRecord STARTED

org.apache.kafka.streams.test.OutputVerifierTest > shouldFailIfValueIsDifferentWithNullReversForCompareKeyValueWithProducerRecord PASSED

org.apache.kafka.streams.test.OutputVerifierTest > shouldPassIfKeyAndValueAndTimestampIsEqualForCompareKeyValueTimestamp STARTED

org.apache.kafka.streams.test.OutputVerifierTest > shouldPassIfKeyAndValueAndTimestampIsEqualForCompareKeyValueTimestamp PASSED

org.apache.kafka.streams.test.OutputVerifierTest > shouldFailIfValueIsDifferentWithNullForCompareKeyValueTimestampWithProducerRecord STARTED

org.apache.kafka.streams.test.OutputVerifierTest > shouldFailIfValueIsDifferentWithNullForCompareKeyValueTimestampWithProducerRecord PASSED

org.apache.kafka.streams.test.OutputVerifierTest > shouldFailIfKeyIsDifferentWithNullReversForCompareKeyValueWithProducerRecord STARTED

org.apache.kafka.streams.test.OutputVerifierTest > shouldFailIfKeyIsDifferentWithNullReversForCompareKeyValueWithProducerRecord PASSED

org.apache.kafka.streams.test.OutputVerifierTest > shouldPassIfKeyAndValueIsEqualWithNullForCompareKeyValueWithProducerRecord STARTED

org.apache.kafka.streams.test.OutputVerifierTest > shouldPassIfKeyAndValueIsEqualWithNullForCompareKeyValueWithProducerRecord PASSED

org.apache.kafka.streams.test.OutputVerifierTest > shouldFailIfKeyIsDifferentWithNullForCompareKeyValueTimestampWithProducerRecord STARTED

org.apache.kafka.streams.test.OutputVerifierTest > shouldFailIfKeyIsDifferentWithNullForCompareKeyValueTimestampWithProducerRecord PASSED

org.apache.kafka.streams.test.OutputVerifierTest > shouldFailIfValueIsDifferentForCompareKeyValueTimestamp STARTED

org.apache.kafka.streams.test.OutputVerifierTest > shouldFailIfValueIsDifferentForCompareKeyValueTimestamp PASSED

org.apache.kafka.streams.test.OutputVerifierTest > shouldPassIfValueAndTimestampIsEqualForCompareValueTimestampWithProducerRecord STARTED

org.apache.kafka.streams.test.OutputVerifierTest > shouldPassIfValueAndTimestampIsEqualForCompareValueTimestampWithProducerRecord PASSED

org.apache.kafka.streams.test.OutputVerifierTest > shouldFailIfValueIsDifferentWithNullReversForCompareKeyValueTimestamp STARTED

org.apache.kafka.streams.test.OutputVerifierTest > shouldFailIfValueIsDifferentWithNullReversForCompareKeyValueTimestamp PASSED

org.apache.kafka.streams.test.OutputVerifierTest > shouldFailIfValueIsDifferentWithNullReverseForCompareValueTimestampWithProducerRecord STARTED

org.apache.kafka.streams.test.OutputVerifierTest > shouldFailIfValueIsDifferentWithNullReverseForCompareValueTimestampWithProducerRecord PASSED

> Task :streams:examples:test

org.apache.kafka.streams.examples.wordcount.WordCountProcessorTest > test STARTED

org.apache.kafka.streams.examples.wordcount.WordCountProcessorTest > test PASSED

FAILURE: Build failed with an exception.

* What went wrong:
Execution failed for task ':connect:runtime:test'.
> There were failing tests. See the report at: file://<https://builds.apache.org/job/kafka-trunk-jdk11/ws/connect/runtime/build/reports/tests/test/index.html>

* Try:
Run with --stacktrace option to get the stack trace. Run with --info or --debug option to get more log output. Run with --scan to get full insights.

* Get more help at https://help.gradle.org

Deprecated Gradle features were used in this build, making it incompatible with Gradle 6.0.
Use '--warning-mode all' to show the individual deprecation warnings.
See https://docs.gradle.org/5.1/userguide/command_line_interface.html#sec:command_line_warnings

BUILD FAILED in 2h 27m 15s
166 actionable tasks: 165 executed, 1 up-to-date
Build step 'Execute shell' marked build as failure
Recording test results
Setting GRADLE_4_10_2_HOME=/home/jenkins/tools/gradle/4.10.2
Setting GRADLE_4_10_2_HOME=/home/jenkins/tools/gradle/4.10.2
Not sending mail to unregistered user ismael@juma.me.uk
Not sending mail to unregistered user manikumar.reddy@gmail.com
Not sending mail to unregistered user wangguoz@gmail.com
Not sending mail to unregistered user vahid.hashemian@gmail.com
Not sending mail to unregistered user noreply@github.com

Build failed in Jenkins: kafka-trunk-jdk11 #232

Posted by Apache Jenkins Server <je...@builds.apache.org>.
See <https://builds.apache.org/job/kafka-trunk-jdk11/232/display/redirect?page=changes>

Changes:

[github] MINOR: increase timeouts for KafkaStreamsTest (#6178)

------------------------------------------
[...truncated 2.27 MB...]

kafka.utils.PasswordEncoderTest > testEncoderConfigChange PASSED

kafka.utils.PasswordEncoderTest > testEncodeDecodeAlgorithms STARTED

kafka.utils.PasswordEncoderTest > testEncodeDecodeAlgorithms PASSED

kafka.utils.PasswordEncoderTest > testEncodeDecode STARTED

kafka.utils.PasswordEncoderTest > testEncodeDecode PASSED

kafka.utils.json.JsonValueTest > testJsonObjectIterator STARTED

kafka.utils.json.JsonValueTest > testJsonObjectIterator PASSED

kafka.utils.json.JsonValueTest > testDecodeLong STARTED

kafka.utils.json.JsonValueTest > testDecodeLong PASSED

kafka.utils.json.JsonValueTest > testAsJsonObject STARTED

kafka.utils.json.JsonValueTest > testAsJsonObject PASSED

kafka.utils.json.JsonValueTest > testDecodeDouble STARTED

kafka.utils.json.JsonValueTest > testDecodeDouble PASSED

kafka.utils.json.JsonValueTest > testDecodeOption STARTED

kafka.utils.json.JsonValueTest > testDecodeOption PASSED

kafka.utils.json.JsonValueTest > testDecodeString STARTED

kafka.utils.json.JsonValueTest > testDecodeString PASSED

kafka.utils.json.JsonValueTest > testJsonValueToString STARTED

kafka.utils.json.JsonValueTest > testJsonValueToString PASSED

kafka.utils.json.JsonValueTest > testAsJsonObjectOption STARTED

kafka.utils.json.JsonValueTest > testAsJsonObjectOption PASSED

kafka.utils.json.JsonValueTest > testAsJsonArrayOption STARTED

kafka.utils.json.JsonValueTest > testAsJsonArrayOption PASSED

kafka.utils.json.JsonValueTest > testAsJsonArray STARTED

kafka.utils.json.JsonValueTest > testAsJsonArray PASSED

kafka.utils.json.JsonValueTest > testJsonValueHashCode STARTED

kafka.utils.json.JsonValueTest > testJsonValueHashCode PASSED

kafka.utils.json.JsonValueTest > testDecodeInt STARTED

kafka.utils.json.JsonValueTest > testDecodeInt PASSED

kafka.utils.json.JsonValueTest > testDecodeMap STARTED

kafka.utils.json.JsonValueTest > testDecodeMap PASSED

kafka.utils.json.JsonValueTest > testDecodeSeq STARTED

kafka.utils.json.JsonValueTest > testDecodeSeq PASSED

kafka.utils.json.JsonValueTest > testJsonObjectGet STARTED

kafka.utils.json.JsonValueTest > testJsonObjectGet PASSED

kafka.utils.json.JsonValueTest > testJsonValueEquals STARTED

kafka.utils.json.JsonValueTest > testJsonValueEquals PASSED

kafka.utils.json.JsonValueTest > testJsonArrayIterator STARTED

kafka.utils.json.JsonValueTest > testJsonArrayIterator PASSED

kafka.utils.json.JsonValueTest > testJsonObjectApply STARTED

kafka.utils.json.JsonValueTest > testJsonObjectApply PASSED

kafka.utils.json.JsonValueTest > testDecodeBoolean STARTED

kafka.utils.json.JsonValueTest > testDecodeBoolean PASSED

kafka.utils.CoreUtilsTest > testGenerateUuidAsBase64 STARTED

kafka.utils.CoreUtilsTest > testGenerateUuidAsBase64 PASSED

kafka.utils.CoreUtilsTest > testAbs STARTED

kafka.utils.CoreUtilsTest > testAbs PASSED

kafka.utils.CoreUtilsTest > testReplaceSuffix STARTED

kafka.utils.CoreUtilsTest > testReplaceSuffix PASSED

kafka.utils.CoreUtilsTest > testCircularIterator STARTED

kafka.utils.CoreUtilsTest > testCircularIterator PASSED

kafka.utils.CoreUtilsTest > testReadBytes STARTED

kafka.utils.CoreUtilsTest > testReadBytes PASSED

kafka.utils.CoreUtilsTest > testCsvList STARTED

kafka.utils.CoreUtilsTest > testCsvList PASSED

kafka.utils.CoreUtilsTest > testReadInt STARTED

kafka.utils.CoreUtilsTest > testReadInt PASSED

kafka.utils.CoreUtilsTest > testAtomicGetOrUpdate STARTED

kafka.utils.CoreUtilsTest > testAtomicGetOrUpdate PASSED

kafka.utils.CoreUtilsTest > testUrlSafeBase64EncodeUUID STARTED

kafka.utils.CoreUtilsTest > testUrlSafeBase64EncodeUUID PASSED

kafka.utils.CoreUtilsTest > testCsvMap STARTED

kafka.utils.CoreUtilsTest > testCsvMap PASSED

kafka.utils.CoreUtilsTest > testInLock STARTED

kafka.utils.CoreUtilsTest > testInLock PASSED

kafka.utils.CoreUtilsTest > testTryAll STARTED

kafka.utils.CoreUtilsTest > testTryAll PASSED

kafka.utils.CoreUtilsTest > testSwallow STARTED

kafka.utils.CoreUtilsTest > testSwallow PASSED

kafka.utils.ShutdownableThreadTest > testShutdownWhenCalledAfterThreadStart STARTED

kafka.utils.ShutdownableThreadTest > testShutdownWhenCalledAfterThreadStart PASSED

kafka.utils.TopicFilterTest > testWhitelists STARTED

kafka.utils.TopicFilterTest > testWhitelists PASSED

kafka.utils.JsonTest > testParseToWithInvalidJson STARTED

kafka.utils.JsonTest > testParseToWithInvalidJson PASSED

kafka.utils.JsonTest > testParseTo STARTED

kafka.utils.JsonTest > testParseTo PASSED

kafka.utils.JsonTest > testJsonParse STARTED

kafka.utils.JsonTest > testJsonParse PASSED

kafka.utils.JsonTest > testLegacyEncodeAsString STARTED

kafka.utils.JsonTest > testLegacyEncodeAsString PASSED

kafka.utils.JsonTest > testEncodeAsBytes STARTED

kafka.utils.JsonTest > testEncodeAsBytes PASSED

kafka.utils.JsonTest > testEncodeAsString STARTED

kafka.utils.JsonTest > testEncodeAsString PASSED

kafka.utils.CommandLineUtilsTest > testParseEmptyArg STARTED

kafka.utils.CommandLineUtilsTest > testParseEmptyArg PASSED

kafka.utils.CommandLineUtilsTest > testMaybeMergeOptionsOverwriteExisting STARTED

kafka.utils.CommandLineUtilsTest > testMaybeMergeOptionsOverwriteExisting PASSED

kafka.utils.CommandLineUtilsTest > testParseSingleArg STARTED

kafka.utils.CommandLineUtilsTest > testParseSingleArg PASSED

kafka.utils.CommandLineUtilsTest > testParseArgs STARTED

kafka.utils.CommandLineUtilsTest > testParseArgs PASSED

kafka.utils.CommandLineUtilsTest > testParseArgsWithMultipleDelimiters STARTED

kafka.utils.CommandLineUtilsTest > testParseArgsWithMultipleDelimiters PASSED

kafka.utils.CommandLineUtilsTest > testMaybeMergeOptionsDefaultValueIfNotExist STARTED

kafka.utils.CommandLineUtilsTest > testMaybeMergeOptionsDefaultValueIfNotExist PASSED

kafka.utils.CommandLineUtilsTest > testParseEmptyArgWithNoDelimiter STARTED

kafka.utils.CommandLineUtilsTest > testParseEmptyArgWithNoDelimiter PASSED

kafka.utils.CommandLineUtilsTest > testMaybeMergeOptionsDefaultOverwriteExisting STARTED

kafka.utils.CommandLineUtilsTest > testMaybeMergeOptionsDefaultOverwriteExisting PASSED

kafka.utils.CommandLineUtilsTest > testParseEmptyArgAsValid STARTED

kafka.utils.CommandLineUtilsTest > testParseEmptyArgAsValid PASSED

kafka.utils.CommandLineUtilsTest > testMaybeMergeOptionsNotOverwriteExisting STARTED

kafka.utils.CommandLineUtilsTest > testMaybeMergeOptionsNotOverwriteExisting PASSED

kafka.utils.LoggingTest > testLog4jControllerIsRegistered STARTED

kafka.utils.LoggingTest > testLog4jControllerIsRegistered PASSED

kafka.utils.LoggingTest > testLogName STARTED

kafka.utils.LoggingTest > testLogName PASSED

kafka.utils.LoggingTest > testLogNameOverride STARTED

kafka.utils.LoggingTest > testLogNameOverride PASSED

FAILURE: Build failed with an exception.

* What went wrong:
Execution failed for task ':connect:runtime:test'.
> There were failing tests. See the report at: file://<https://builds.apache.org/job/kafka-trunk-jdk11/ws/connect/runtime/build/reports/tests/test/index.html>

* Try:
Run with --stacktrace option to get the stack trace. Run with --info or --debug option to get more log output. Run with --scan to get full insights.

* Get more help at https://help.gradle.org

Deprecated Gradle features were used in this build, making it incompatible with Gradle 6.0.
Use '--warning-mode all' to show the individual deprecation warnings.
See https://docs.gradle.org/5.1/userguide/command_line_interface.html#sec:command_line_warnings

BUILD FAILED in 2h 22m 54s
166 actionable tasks: 165 executed, 1 up-to-date
Build step 'Execute shell' marked build as failure
Recording test results
Setting GRADLE_4_10_2_HOME=/home/jenkins/tools/gradle/4.10.2
Setting GRADLE_4_10_2_HOME=/home/jenkins/tools/gradle/4.10.2
Not sending mail to unregistered user ismael@juma.me.uk
Not sending mail to unregistered user manikumar.reddy@gmail.com
Not sending mail to unregistered user wangguoz@gmail.com
Not sending mail to unregistered user vahid.hashemian@gmail.com
Not sending mail to unregistered user noreply@github.com

Build failed in Jenkins: kafka-trunk-jdk11 #231

Posted by Apache Jenkins Server <je...@builds.apache.org>.
See <https://builds.apache.org/job/kafka-trunk-jdk11/231/display/redirect?page=changes>

Changes:

[manikumar.reddy] MINOR: Rejoin split ssl principal mapping rules (#6099)

------------------------------------------
[...truncated 2.27 MB...]

org.apache.kafka.trogdor.agent.AgentTest > testCreateExpiredWorkerIsNotScheduled STARTED

org.apache.kafka.trogdor.agent.AgentTest > testCreateExpiredWorkerIsNotScheduled PASSED

org.apache.kafka.trogdor.agent.AgentTest > testAgentProgrammaticShutdown STARTED

org.apache.kafka.trogdor.agent.AgentTest > testAgentProgrammaticShutdown PASSED

org.apache.kafka.trogdor.agent.AgentTest > testDestroyWorkers STARTED

org.apache.kafka.trogdor.agent.AgentTest > testDestroyWorkers PASSED

org.apache.kafka.trogdor.agent.AgentTest > testKiboshFaults STARTED

org.apache.kafka.trogdor.agent.AgentTest > testKiboshFaults PASSED

org.apache.kafka.trogdor.agent.AgentTest > testWorkerCompletions STARTED

org.apache.kafka.trogdor.agent.AgentTest > testWorkerCompletions PASSED

org.apache.kafka.trogdor.agent.AgentTest > testAgentFinishesTasks STARTED

org.apache.kafka.trogdor.agent.AgentTest > testAgentFinishesTasks PASSED

org.apache.kafka.trogdor.coordinator.CoordinatorTest > testTaskRequest STARTED

org.apache.kafka.trogdor.coordinator.CoordinatorTest > testTaskRequest PASSED

org.apache.kafka.trogdor.coordinator.CoordinatorTest > testTaskDestruction STARTED

org.apache.kafka.trogdor.coordinator.CoordinatorTest > testTaskDestruction PASSED

org.apache.kafka.trogdor.coordinator.CoordinatorTest > testTasksRequestMatches STARTED

org.apache.kafka.trogdor.coordinator.CoordinatorTest > testTasksRequestMatches PASSED

org.apache.kafka.trogdor.coordinator.CoordinatorTest > testWorkersExitingAtDifferentTimes STARTED

org.apache.kafka.trogdor.coordinator.CoordinatorTest > testWorkersExitingAtDifferentTimes PASSED

org.apache.kafka.trogdor.coordinator.CoordinatorTest > testAgentFailureAndTaskExpiry STARTED

org.apache.kafka.trogdor.coordinator.CoordinatorTest > testAgentFailureAndTaskExpiry PASSED

org.apache.kafka.trogdor.coordinator.CoordinatorTest > testTaskDistribution STARTED

org.apache.kafka.trogdor.coordinator.CoordinatorTest > testTaskDistribution PASSED

org.apache.kafka.trogdor.coordinator.CoordinatorTest > testTaskRequestWithOldStartMsGetsUpdated STARTED

org.apache.kafka.trogdor.coordinator.CoordinatorTest > testTaskRequestWithOldStartMsGetsUpdated PASSED

org.apache.kafka.trogdor.coordinator.CoordinatorTest > testNetworkPartitionFault STARTED

org.apache.kafka.trogdor.coordinator.CoordinatorTest > testNetworkPartitionFault PASSED

org.apache.kafka.trogdor.coordinator.CoordinatorTest > testTaskRequestWithFutureStartMsDoesNotGetRun STARTED

org.apache.kafka.trogdor.coordinator.CoordinatorTest > testTaskRequestWithFutureStartMsDoesNotGetRun PASSED

org.apache.kafka.trogdor.coordinator.CoordinatorTest > testTaskCancellation STARTED

org.apache.kafka.trogdor.coordinator.CoordinatorTest > testTaskCancellation PASSED

org.apache.kafka.trogdor.coordinator.CoordinatorTest > testCreateTask STARTED

org.apache.kafka.trogdor.coordinator.CoordinatorTest > testCreateTask PASSED

org.apache.kafka.trogdor.coordinator.CoordinatorTest > testTasksRequest STARTED

org.apache.kafka.trogdor.coordinator.CoordinatorTest > testTasksRequest PASSED

org.apache.kafka.trogdor.coordinator.CoordinatorTest > testCoordinatorStatus STARTED

org.apache.kafka.trogdor.coordinator.CoordinatorTest > testCoordinatorStatus PASSED

org.apache.kafka.trogdor.coordinator.CoordinatorTest > testCoordinatorUptime STARTED

org.apache.kafka.trogdor.coordinator.CoordinatorTest > testCoordinatorUptime PASSED

> Task :streams:streams-scala:test

org.apache.kafka.streams.scala.kstream.JoinedTest > Create a Joined should create a Joined with Serdes STARTED

org.apache.kafka.streams.scala.kstream.JoinedTest > Create a Joined should create a Joined with Serdes PASSED

org.apache.kafka.streams.scala.kstream.JoinedTest > Create a Joined should create a Joined with Serdes and repartition topic name STARTED

org.apache.kafka.streams.scala.kstream.JoinedTest > Create a Joined should create a Joined with Serdes and repartition topic name PASSED

org.apache.kafka.streams.scala.kstream.GroupedTest > Create a Grouped should create a Grouped with Serdes STARTED

org.apache.kafka.streams.scala.kstream.GroupedTest > Create a Grouped should create a Grouped with Serdes PASSED

org.apache.kafka.streams.scala.kstream.GroupedTest > Create a Grouped with repartition topic name should create a Grouped with Serdes, and repartition topic name STARTED

org.apache.kafka.streams.scala.kstream.GroupedTest > Create a Grouped with repartition topic name should create a Grouped with Serdes, and repartition topic name PASSED

org.apache.kafka.streams.scala.kstream.ProducedTest > Create a Produced should create a Produced with Serdes STARTED

org.apache.kafka.streams.scala.kstream.ProducedTest > Create a Produced should create a Produced with Serdes PASSED

org.apache.kafka.streams.scala.kstream.ProducedTest > Create a Produced with timestampExtractor and resetPolicy should create a Consumed with Serdes, timestampExtractor and resetPolicy STARTED

org.apache.kafka.streams.scala.kstream.ProducedTest > Create a Produced with timestampExtractor and resetPolicy should create a Consumed with Serdes, timestampExtractor and resetPolicy PASSED

org.apache.kafka.streams.scala.kstream.ConsumedTest > Create a Consumed should create a Consumed with Serdes STARTED

org.apache.kafka.streams.scala.kstream.ConsumedTest > Create a Consumed should create a Consumed with Serdes PASSED

org.apache.kafka.streams.scala.kstream.ConsumedTest > Create a Consumed with timestampExtractor and resetPolicy should create a Consumed with Serdes, timestampExtractor and resetPolicy STARTED

org.apache.kafka.streams.scala.kstream.ConsumedTest > Create a Consumed with timestampExtractor and resetPolicy should create a Consumed with Serdes, timestampExtractor and resetPolicy PASSED

org.apache.kafka.streams.scala.kstream.ConsumedTest > Create a Consumed with timestampExtractor should create a Consumed with Serdes and timestampExtractor STARTED

org.apache.kafka.streams.scala.kstream.ConsumedTest > Create a Consumed with timestampExtractor should create a Consumed with Serdes and timestampExtractor PASSED

org.apache.kafka.streams.scala.kstream.ConsumedTest > Create a Consumed with resetPolicy should create a Consumed with Serdes and resetPolicy STARTED

org.apache.kafka.streams.scala.kstream.ConsumedTest > Create a Consumed with resetPolicy should create a Consumed with Serdes and resetPolicy PASSED

org.apache.kafka.streams.scala.kstream.KStreamTest > filter a KStream should filter records satisfying the predicate STARTED

org.apache.kafka.streams.scala.kstream.KStreamTest > filter a KStream should filter records satisfying the predicate PASSED

org.apache.kafka.streams.scala.kstream.KStreamTest > filterNot a KStream should filter records not satisfying the predicate STARTED

org.apache.kafka.streams.scala.kstream.KStreamTest > filterNot a KStream should filter records not satisfying the predicate PASSED

org.apache.kafka.streams.scala.kstream.KStreamTest > foreach a KStream should run foreach actions on records STARTED

org.apache.kafka.streams.scala.kstream.KStreamTest > foreach a KStream should run foreach actions on records PASSED

org.apache.kafka.streams.scala.kstream.KStreamTest > peek a KStream should run peek actions on records STARTED

org.apache.kafka.streams.scala.kstream.KStreamTest > peek a KStream should run peek actions on records PASSED

org.apache.kafka.streams.scala.kstream.KStreamTest > selectKey a KStream should select a new key STARTED

org.apache.kafka.streams.scala.kstream.KStreamTest > selectKey a KStream should select a new key PASSED

org.apache.kafka.streams.scala.kstream.KStreamTest > join 2 KStreams should join correctly records STARTED

org.apache.kafka.streams.scala.kstream.KStreamTest > join 2 KStreams should join correctly records PASSED

org.apache.kafka.streams.scala.kstream.MaterializedTest > Create a Materialized should create a Materialized with Serdes STARTED

org.apache.kafka.streams.scala.kstream.MaterializedTest > Create a Materialized should create a Materialized with Serdes PASSED

org.apache.kafka.streams.scala.kstream.MaterializedTest > Create a Materialize with a store name should create a Materialized with Serdes and a store name STARTED

org.apache.kafka.streams.scala.kstream.MaterializedTest > Create a Materialize with a store name should create a Materialized with Serdes and a store name PASSED

org.apache.kafka.streams.scala.kstream.MaterializedTest > Create a Materialize with a window store supplier should create a Materialized with Serdes and a store supplier STARTED

org.apache.kafka.streams.scala.kstream.MaterializedTest > Create a Materialize with a window store supplier should create a Materialized with Serdes and a store supplier PASSED

org.apache.kafka.streams.scala.kstream.MaterializedTest > Create a Materialize with a key value store supplier should create a Materialized with Serdes and a store supplier STARTED

org.apache.kafka.streams.scala.kstream.MaterializedTest > Create a Materialize with a key value store supplier should create a Materialized with Serdes and a store supplier PASSED

org.apache.kafka.streams.scala.kstream.MaterializedTest > Create a Materialize with a session store supplier should create a Materialized with Serdes and a store supplier STARTED

org.apache.kafka.streams.scala.kstream.MaterializedTest > Create a Materialize with a session store supplier should create a Materialized with Serdes and a store supplier PASSED

org.apache.kafka.streams.scala.kstream.KTableTest > filter a KTable should filter records satisfying the predicate STARTED

org.apache.kafka.streams.scala.kstream.KTableTest > filter a KTable should filter records satisfying the predicate PASSED

org.apache.kafka.streams.scala.kstream.KTableTest > filterNot a KTable should filter records not satisfying the predicate STARTED

org.apache.kafka.streams.scala.kstream.KTableTest > filterNot a KTable should filter records not satisfying the predicate PASSED

org.apache.kafka.streams.scala.kstream.KTableTest > join 2 KTables should join correctly records STARTED

org.apache.kafka.streams.scala.kstream.KTableTest > join 2 KTables should join correctly records PASSED

org.apache.kafka.streams.scala.kstream.KTableTest > join 2 KTables with a Materialized should join correctly records and state store STARTED

org.apache.kafka.streams.scala.kstream.KTableTest > join 2 KTables with a Materialized should join correctly records and state store PASSED

org.apache.kafka.streams.scala.TopologyTest > shouldBuildIdenticalTopologyInJavaNScalaJoin STARTED

org.apache.kafka.streams.scala.TopologyTest > shouldBuildIdenticalTopologyInJavaNScalaJoin PASSED

org.apache.kafka.streams.scala.TopologyTest > shouldBuildIdenticalTopologyInJavaNScalaSimple STARTED

org.apache.kafka.streams.scala.TopologyTest > shouldBuildIdenticalTopologyInJavaNScalaSimple PASSED

org.apache.kafka.streams.scala.TopologyTest > shouldBuildIdenticalTopologyInJavaNScalaAggregate STARTED

org.apache.kafka.streams.scala.TopologyTest > shouldBuildIdenticalTopologyInJavaNScalaAggregate PASSED

org.apache.kafka.streams.scala.TopologyTest > shouldBuildIdenticalTopologyInJavaNScalaTransform STARTED

org.apache.kafka.streams.scala.TopologyTest > shouldBuildIdenticalTopologyInJavaNScalaTransform PASSED

org.apache.kafka.streams.scala.StreamToTableJoinScalaIntegrationTestImplicitSerdes > testShouldCountClicksPerRegionWithNamedRepartitionTopic STARTED

org.apache.kafka.streams.scala.StreamToTableJoinScalaIntegrationTestImplicitSerdes > testShouldCountClicksPerRegionWithNamedRepartitionTopic PASSED

org.apache.kafka.streams.scala.StreamToTableJoinScalaIntegrationTestImplicitSerdes > testShouldCountClicksPerRegionJava STARTED

org.apache.kafka.streams.scala.StreamToTableJoinScalaIntegrationTestImplicitSerdes > testShouldCountClicksPerRegionJava PASSED

org.apache.kafka.streams.scala.StreamToTableJoinScalaIntegrationTestImplicitSerdes > testShouldCountClicksPerRegion STARTED

org.apache.kafka.streams.scala.StreamToTableJoinScalaIntegrationTestImplicitSerdes > testShouldCountClicksPerRegion PASSED

org.apache.kafka.streams.scala.WordCountTest > testShouldCountWordsMaterialized STARTED

org.apache.kafka.streams.scala.WordCountTest > testShouldCountWordsMaterialized PASSED

org.apache.kafka.streams.scala.WordCountTest > testShouldCountWordsJava STARTED

org.apache.kafka.streams.scala.WordCountTest > testShouldCountWordsJava PASSED

org.apache.kafka.streams.scala.WordCountTest > testShouldCountWords STARTED

org.apache.kafka.streams.scala.WordCountTest > testShouldCountWords PASSED

FAILURE: Build failed with an exception.

* What went wrong:
Execution failed for task ':connect:runtime:test'.
> There were failing tests. See the report at: file://<https://builds.apache.org/job/kafka-trunk-jdk11/ws/connect/runtime/build/reports/tests/test/index.html>

* Try:
Run with --stacktrace option to get the stack trace. Run with --info or --debug option to get more log output. Run with --scan to get full insights.

* Get more help at https://help.gradle.org

Deprecated Gradle features were used in this build, making it incompatible with Gradle 6.0.
Use '--warning-mode all' to show the individual deprecation warnings.
See https://docs.gradle.org/5.1/userguide/command_line_interface.html#sec:command_line_warnings

BUILD FAILED in 2h 24m 15s
166 actionable tasks: 165 executed, 1 up-to-date
Build step 'Execute shell' marked build as failure
Recording test results
Setting GRADLE_4_10_2_HOME=/home/jenkins/tools/gradle/4.10.2
Setting GRADLE_4_10_2_HOME=/home/jenkins/tools/gradle/4.10.2
Not sending mail to unregistered user ismael@juma.me.uk
Not sending mail to unregistered user manikumar.reddy@gmail.com
Not sending mail to unregistered user wangguoz@gmail.com
Not sending mail to unregistered user vahid.hashemian@gmail.com
Not sending mail to unregistered user noreply@github.com

Build failed in Jenkins: kafka-trunk-jdk11 #230

Posted by Apache Jenkins Server <je...@builds.apache.org>.
See <https://builds.apache.org/job/kafka-trunk-jdk11/230/display/redirect?page=changes>

Changes:

[mjsax] MINOR: Handle case where connector status endpoints returns 404 (#6176)

------------------------------------------
[...truncated 2.27 MB...]
kafka.utils.PasswordEncoderTest > testEncoderConfigChange STARTED

kafka.utils.PasswordEncoderTest > testEncoderConfigChange PASSED

kafka.utils.PasswordEncoderTest > testEncodeDecodeAlgorithms STARTED

kafka.utils.PasswordEncoderTest > testEncodeDecodeAlgorithms PASSED

kafka.utils.PasswordEncoderTest > testEncodeDecode STARTED

kafka.utils.PasswordEncoderTest > testEncodeDecode PASSED

kafka.utils.json.JsonValueTest > testJsonObjectIterator STARTED

kafka.utils.json.JsonValueTest > testJsonObjectIterator PASSED

kafka.utils.json.JsonValueTest > testDecodeLong STARTED

kafka.utils.json.JsonValueTest > testDecodeLong PASSED

kafka.utils.json.JsonValueTest > testAsJsonObject STARTED

kafka.utils.json.JsonValueTest > testAsJsonObject PASSED

kafka.utils.json.JsonValueTest > testDecodeDouble STARTED

kafka.utils.json.JsonValueTest > testDecodeDouble PASSED

kafka.utils.json.JsonValueTest > testDecodeOption STARTED

kafka.utils.json.JsonValueTest > testDecodeOption PASSED

kafka.utils.json.JsonValueTest > testDecodeString STARTED

kafka.utils.json.JsonValueTest > testDecodeString PASSED

kafka.utils.json.JsonValueTest > testJsonValueToString STARTED

kafka.utils.json.JsonValueTest > testJsonValueToString PASSED

kafka.utils.json.JsonValueTest > testAsJsonObjectOption STARTED

kafka.utils.json.JsonValueTest > testAsJsonObjectOption PASSED

kafka.utils.json.JsonValueTest > testAsJsonArrayOption STARTED

kafka.utils.json.JsonValueTest > testAsJsonArrayOption PASSED

kafka.utils.json.JsonValueTest > testAsJsonArray STARTED

kafka.utils.json.JsonValueTest > testAsJsonArray PASSED

kafka.utils.json.JsonValueTest > testJsonValueHashCode STARTED

kafka.utils.json.JsonValueTest > testJsonValueHashCode PASSED

kafka.utils.json.JsonValueTest > testDecodeInt STARTED

kafka.utils.json.JsonValueTest > testDecodeInt PASSED

kafka.utils.json.JsonValueTest > testDecodeMap STARTED

kafka.utils.json.JsonValueTest > testDecodeMap PASSED

kafka.utils.json.JsonValueTest > testDecodeSeq STARTED

kafka.utils.json.JsonValueTest > testDecodeSeq PASSED

kafka.utils.json.JsonValueTest > testJsonObjectGet STARTED

kafka.utils.json.JsonValueTest > testJsonObjectGet PASSED

kafka.utils.json.JsonValueTest > testJsonValueEquals STARTED

kafka.utils.json.JsonValueTest > testJsonValueEquals PASSED

kafka.utils.json.JsonValueTest > testJsonArrayIterator STARTED

kafka.utils.json.JsonValueTest > testJsonArrayIterator PASSED

kafka.utils.json.JsonValueTest > testJsonObjectApply STARTED

kafka.utils.json.JsonValueTest > testJsonObjectApply PASSED

kafka.utils.json.JsonValueTest > testDecodeBoolean STARTED

kafka.utils.json.JsonValueTest > testDecodeBoolean PASSED

kafka.utils.CoreUtilsTest > testGenerateUuidAsBase64 STARTED

kafka.utils.CoreUtilsTest > testGenerateUuidAsBase64 PASSED

kafka.utils.CoreUtilsTest > testAbs STARTED

kafka.utils.CoreUtilsTest > testAbs PASSED

kafka.utils.CoreUtilsTest > testReplaceSuffix STARTED

kafka.utils.CoreUtilsTest > testReplaceSuffix PASSED

kafka.utils.CoreUtilsTest > testCircularIterator STARTED

kafka.utils.CoreUtilsTest > testCircularIterator PASSED

kafka.utils.CoreUtilsTest > testReadBytes STARTED

kafka.utils.CoreUtilsTest > testReadBytes PASSED

kafka.utils.CoreUtilsTest > testCsvList STARTED

kafka.utils.CoreUtilsTest > testCsvList PASSED

kafka.utils.CoreUtilsTest > testReadInt STARTED

kafka.utils.CoreUtilsTest > testReadInt PASSED

kafka.utils.CoreUtilsTest > testAtomicGetOrUpdate STARTED

kafka.utils.CoreUtilsTest > testAtomicGetOrUpdate PASSED

kafka.utils.CoreUtilsTest > testUrlSafeBase64EncodeUUID STARTED

kafka.utils.CoreUtilsTest > testUrlSafeBase64EncodeUUID PASSED

kafka.utils.CoreUtilsTest > testCsvMap STARTED

kafka.utils.CoreUtilsTest > testCsvMap PASSED

kafka.utils.CoreUtilsTest > testInLock STARTED

kafka.utils.CoreUtilsTest > testInLock PASSED

kafka.utils.CoreUtilsTest > testTryAll STARTED

kafka.utils.CoreUtilsTest > testTryAll PASSED

kafka.utils.CoreUtilsTest > testSwallow STARTED

kafka.utils.CoreUtilsTest > testSwallow PASSED

kafka.utils.ShutdownableThreadTest > testShutdownWhenCalledAfterThreadStart STARTED

kafka.utils.ShutdownableThreadTest > testShutdownWhenCalledAfterThreadStart PASSED

kafka.utils.TopicFilterTest > testWhitelists STARTED

kafka.utils.TopicFilterTest > testWhitelists PASSED

kafka.utils.JsonTest > testParseToWithInvalidJson STARTED

kafka.utils.JsonTest > testParseToWithInvalidJson PASSED

kafka.utils.JsonTest > testParseTo STARTED

kafka.utils.JsonTest > testParseTo PASSED

kafka.utils.JsonTest > testJsonParse STARTED

kafka.utils.JsonTest > testJsonParse PASSED

kafka.utils.JsonTest > testLegacyEncodeAsString STARTED

kafka.utils.JsonTest > testLegacyEncodeAsString PASSED

kafka.utils.JsonTest > testEncodeAsBytes STARTED

kafka.utils.JsonTest > testEncodeAsBytes PASSED

kafka.utils.JsonTest > testEncodeAsString STARTED

kafka.utils.JsonTest > testEncodeAsString PASSED

kafka.utils.CommandLineUtilsTest > testParseEmptyArg STARTED

kafka.utils.CommandLineUtilsTest > testParseEmptyArg PASSED

kafka.utils.CommandLineUtilsTest > testMaybeMergeOptionsOverwriteExisting STARTED

kafka.utils.CommandLineUtilsTest > testMaybeMergeOptionsOverwriteExisting PASSED

kafka.utils.CommandLineUtilsTest > testParseSingleArg STARTED

kafka.utils.CommandLineUtilsTest > testParseSingleArg PASSED

kafka.utils.CommandLineUtilsTest > testParseArgs STARTED

kafka.utils.CommandLineUtilsTest > testParseArgs PASSED

kafka.utils.CommandLineUtilsTest > testParseArgsWithMultipleDelimiters STARTED

kafka.utils.CommandLineUtilsTest > testParseArgsWithMultipleDelimiters PASSED

kafka.utils.CommandLineUtilsTest > testMaybeMergeOptionsDefaultValueIfNotExist STARTED

kafka.utils.CommandLineUtilsTest > testMaybeMergeOptionsDefaultValueIfNotExist PASSED

kafka.utils.CommandLineUtilsTest > testParseEmptyArgWithNoDelimiter STARTED

kafka.utils.CommandLineUtilsTest > testParseEmptyArgWithNoDelimiter PASSED

kafka.utils.CommandLineUtilsTest > testMaybeMergeOptionsDefaultOverwriteExisting STARTED

kafka.utils.CommandLineUtilsTest > testMaybeMergeOptionsDefaultOverwriteExisting PASSED

kafka.utils.CommandLineUtilsTest > testParseEmptyArgAsValid STARTED

kafka.utils.CommandLineUtilsTest > testParseEmptyArgAsValid PASSED

kafka.utils.CommandLineUtilsTest > testMaybeMergeOptionsNotOverwriteExisting STARTED

kafka.utils.CommandLineUtilsTest > testMaybeMergeOptionsNotOverwriteExisting PASSED

kafka.utils.LoggingTest > testLog4jControllerIsRegistered STARTED

kafka.utils.LoggingTest > testLog4jControllerIsRegistered PASSED

kafka.utils.LoggingTest > testLogName STARTED

kafka.utils.LoggingTest > testLogName PASSED

kafka.utils.LoggingTest > testLogNameOverride STARTED

kafka.utils.LoggingTest > testLogNameOverride PASSED

FAILURE: Build failed with an exception.

* What went wrong:
Execution failed for task ':connect:runtime:test'.
> There were failing tests. See the report at: file://<https://builds.apache.org/job/kafka-trunk-jdk11/ws/connect/runtime/build/reports/tests/test/index.html>

* Try:
Run with --stacktrace option to get the stack trace. Run with --info or --debug option to get more log output. Run with --scan to get full insights.

* Get more help at https://help.gradle.org

Deprecated Gradle features were used in this build, making it incompatible with Gradle 6.0.
Use '--warning-mode all' to show the individual deprecation warnings.
See https://docs.gradle.org/5.1/userguide/command_line_interface.html#sec:command_line_warnings

BUILD FAILED in 2h 24m 8s
166 actionable tasks: 165 executed, 1 up-to-date
Build step 'Execute shell' marked build as failure
Recording test results
Setting GRADLE_4_10_2_HOME=/home/jenkins/tools/gradle/4.10.2
Setting GRADLE_4_10_2_HOME=/home/jenkins/tools/gradle/4.10.2
Not sending mail to unregistered user ismael@juma.me.uk
Not sending mail to unregistered user wangguoz@gmail.com
Not sending mail to unregistered user vahid.hashemian@gmail.com
Not sending mail to unregistered user noreply@github.com

Build failed in Jenkins: kafka-trunk-jdk11 #229

Posted by Apache Jenkins Server <je...@builds.apache.org>.
See <https://builds.apache.org/job/kafka-trunk-jdk11/229/display/redirect?page=changes>

Changes:

[vahid.hashemian] MINOR: Remove unused imports, exceptions, and values (#6117)

------------------------------------------
[...truncated 2.27 MB...]
org.apache.kafka.connect.runtime.WorkerConfigTransformerTest > testReplaceVariableWithTTLFirstCancelThenScheduleRestart STARTED

org.apache.kafka.connect.runtime.WorkerConfigTransformerTest > testReplaceVariableWithTTLFirstCancelThenScheduleRestart PASSED

org.apache.kafka.connect.runtime.WorkerConfigTransformerTest > testTransformNullConfiguration STARTED

org.apache.kafka.connect.runtime.WorkerConfigTransformerTest > testTransformNullConfiguration PASSED

org.apache.kafka.connect.runtime.WorkerSinkTaskThreadedTest > testCommitSuccessFollowedByFailure STARTED

org.apache.kafka.connect.runtime.WorkerSinkTaskThreadedTest > testCommitSuccessFollowedByFailure PASSED

org.apache.kafka.connect.runtime.WorkerSinkTaskThreadedTest > testCommitConsumerFailure STARTED

org.apache.kafka.connect.runtime.WorkerSinkTaskThreadedTest > testCommitConsumerFailure PASSED

org.apache.kafka.connect.runtime.WorkerSinkTaskThreadedTest > testCommitTimeout STARTED

org.apache.kafka.connect.runtime.WorkerSinkTaskThreadedTest > testCommitTimeout PASSED

org.apache.kafka.connect.runtime.WorkerSinkTaskThreadedTest > testAssignmentPauseResume STARTED

org.apache.kafka.connect.runtime.WorkerSinkTaskThreadedTest > testAssignmentPauseResume PASSED

org.apache.kafka.connect.runtime.WorkerSinkTaskThreadedTest > testRewind STARTED

org.apache.kafka.connect.runtime.WorkerSinkTaskThreadedTest > testRewind PASSED

org.apache.kafka.connect.runtime.WorkerSinkTaskThreadedTest > testRewindOnRebalanceDuringPoll STARTED

org.apache.kafka.connect.runtime.WorkerSinkTaskThreadedTest > testRewindOnRebalanceDuringPoll PASSED

org.apache.kafka.connect.runtime.WorkerSinkTaskThreadedTest > testCommitFailure STARTED

org.apache.kafka.connect.runtime.WorkerSinkTaskThreadedTest > testCommitFailure PASSED

org.apache.kafka.connect.runtime.WorkerSinkTaskThreadedTest > testPollsInBackground STARTED

org.apache.kafka.connect.runtime.WorkerSinkTaskThreadedTest > testPollsInBackground PASSED

org.apache.kafka.connect.runtime.WorkerSinkTaskThreadedTest > testCommit STARTED

org.apache.kafka.connect.runtime.WorkerSinkTaskThreadedTest > testCommit PASSED

org.apache.kafka.connect.runtime.distributed.DistributedHerderTest > testPutConnectorConfig STARTED

org.apache.kafka.connect.runtime.distributed.DistributedHerderTest > testPutConnectorConfig PASSED

org.apache.kafka.connect.runtime.distributed.DistributedHerderTest > testCreateConnector STARTED

org.apache.kafka.connect.runtime.distributed.DistributedHerderTest > testCreateConnector PASSED

org.apache.kafka.connect.runtime.distributed.DistributedHerderTest > testCreateConnectorFailedBasicValidation STARTED

org.apache.kafka.connect.runtime.distributed.DistributedHerderTest > testCreateConnectorFailedBasicValidation PASSED

org.apache.kafka.connect.runtime.distributed.DistributedHerderTest > testCreateConnectorFailedCustomValidation STARTED

org.apache.kafka.connect.runtime.distributed.DistributedHerderTest > testCreateConnectorFailedCustomValidation PASSED

org.apache.kafka.connect.runtime.distributed.DistributedHerderTest > testCreateConnectorAlreadyExists STARTED

org.apache.kafka.connect.runtime.distributed.DistributedHerderTest > testCreateConnectorAlreadyExists PASSED

org.apache.kafka.connect.runtime.distributed.DistributedHerderTest > testDestroyConnector STARTED

org.apache.kafka.connect.runtime.distributed.DistributedHerderTest > testDestroyConnector PASSED

org.apache.kafka.connect.runtime.distributed.DistributedHerderTest > testRestartConnector STARTED

org.apache.kafka.connect.runtime.distributed.DistributedHerderTest > testRestartConnector PASSED

org.apache.kafka.connect.runtime.distributed.DistributedHerderTest > testRestartTask STARTED

org.apache.kafka.connect.runtime.distributed.DistributedHerderTest > testRestartTask PASSED

org.apache.kafka.connect.runtime.distributed.DistributedHerderTest > testAccessors STARTED

org.apache.kafka.connect.runtime.distributed.DistributedHerderTest > testAccessors PASSED

org.apache.kafka.connect.runtime.distributed.DistributedHerderTest > testJoinAssignment STARTED

org.apache.kafka.connect.runtime.distributed.DistributedHerderTest > testJoinAssignment PASSED

org.apache.kafka.connect.runtime.distributed.DistributedHerderTest > testRebalance STARTED

org.apache.kafka.connect.runtime.distributed.DistributedHerderTest > testRebalance PASSED

org.apache.kafka.connect.runtime.distributed.DistributedHerderTest > testRebalanceFailedConnector STARTED

org.apache.kafka.connect.runtime.distributed.DistributedHerderTest > testRebalanceFailedConnector PASSED

org.apache.kafka.connect.runtime.distributed.DistributedHerderTest > testHaltCleansUpWorker STARTED

org.apache.kafka.connect.runtime.distributed.DistributedHerderTest > testHaltCleansUpWorker PASSED

org.apache.kafka.connect.runtime.distributed.DistributedHerderTest > testConnectorNameConflictsWithWorkerGroupId STARTED

org.apache.kafka.connect.runtime.distributed.DistributedHerderTest > testConnectorNameConflictsWithWorkerGroupId PASSED

org.apache.kafka.connect.runtime.distributed.DistributedHerderTest > testRestartUnknownConnector STARTED

org.apache.kafka.connect.runtime.distributed.DistributedHerderTest > testRestartUnknownConnector PASSED

org.apache.kafka.connect.runtime.distributed.DistributedHerderTest > testRestartConnectorRedirectToLeader STARTED

org.apache.kafka.connect.runtime.distributed.DistributedHerderTest > testRestartConnectorRedirectToLeader PASSED

org.apache.kafka.connect.runtime.distributed.DistributedHerderTest > testRestartConnectorRedirectToOwner STARTED

org.apache.kafka.connect.runtime.distributed.DistributedHerderTest > testRestartConnectorRedirectToOwner PASSED

org.apache.kafka.connect.runtime.distributed.DistributedHerderTest > testRestartUnknownTask STARTED

org.apache.kafka.connect.runtime.distributed.DistributedHerderTest > testRestartUnknownTask PASSED

org.apache.kafka.connect.runtime.distributed.DistributedHerderTest > testRequestProcessingOrder STARTED

org.apache.kafka.connect.runtime.distributed.DistributedHerderTest > testRequestProcessingOrder PASSED

org.apache.kafka.connect.runtime.distributed.DistributedHerderTest > testRestartTaskRedirectToLeader STARTED

org.apache.kafka.connect.runtime.distributed.DistributedHerderTest > testRestartTaskRedirectToLeader PASSED

org.apache.kafka.connect.runtime.distributed.DistributedHerderTest > testRestartTaskRedirectToOwner STARTED

org.apache.kafka.connect.runtime.distributed.DistributedHerderTest > testRestartTaskRedirectToOwner PASSED

org.apache.kafka.connect.runtime.distributed.DistributedHerderTest > testConnectorConfigAdded STARTED

org.apache.kafka.connect.runtime.distributed.DistributedHerderTest > testConnectorConfigAdded PASSED

org.apache.kafka.connect.runtime.distributed.DistributedHerderTest > testConnectorConfigUpdate STARTED

org.apache.kafka.connect.runtime.distributed.DistributedHerderTest > testConnectorConfigUpdate PASSED

org.apache.kafka.connect.runtime.distributed.DistributedHerderTest > testConnectorPaused STARTED

org.apache.kafka.connect.runtime.distributed.DistributedHerderTest > testConnectorPaused PASSED

org.apache.kafka.connect.runtime.distributed.DistributedHerderTest > testConnectorResumed STARTED

org.apache.kafka.connect.runtime.distributed.DistributedHerderTest > testConnectorResumed PASSED

org.apache.kafka.connect.runtime.distributed.DistributedHerderTest > testUnknownConnectorPaused STARTED

org.apache.kafka.connect.runtime.distributed.DistributedHerderTest > testUnknownConnectorPaused PASSED

org.apache.kafka.connect.runtime.distributed.DistributedHerderTest > testConnectorPausedRunningTaskOnly STARTED

org.apache.kafka.connect.runtime.distributed.DistributedHerderTest > testConnectorPausedRunningTaskOnly PASSED

org.apache.kafka.connect.runtime.distributed.DistributedHerderTest > testConnectorResumedRunningTaskOnly STARTED

org.apache.kafka.connect.runtime.distributed.DistributedHerderTest > testConnectorResumedRunningTaskOnly PASSED

org.apache.kafka.connect.runtime.distributed.DistributedHerderTest > testTaskConfigAdded STARTED

org.apache.kafka.connect.runtime.distributed.DistributedHerderTest > testTaskConfigAdded PASSED

org.apache.kafka.connect.runtime.distributed.DistributedHerderTest > testJoinLeaderCatchUpFails STARTED

org.apache.kafka.connect.runtime.distributed.DistributedHerderTest > testJoinLeaderCatchUpFails PASSED

org.apache.kafka.connect.runtime.distributed.DistributedHerderTest > testInconsistentConfigs STARTED

org.apache.kafka.connect.runtime.distributed.DistributedHerderTest > testInconsistentConfigs PASSED

org.apache.kafka.connect.runtime.distributed.WorkerCoordinatorTest > testLeaderPerformAssignmentSingleTaskConnectors STARTED

org.apache.kafka.connect.runtime.distributed.WorkerCoordinatorTest > testLeaderPerformAssignmentSingleTaskConnectors PASSED

org.apache.kafka.connect.runtime.distributed.WorkerCoordinatorTest > testNormalJoinGroupFollower STARTED

org.apache.kafka.connect.runtime.distributed.WorkerCoordinatorTest > testNormalJoinGroupFollower PASSED

org.apache.kafka.connect.runtime.distributed.WorkerCoordinatorTest > testMetadata STARTED

org.apache.kafka.connect.runtime.distributed.WorkerCoordinatorTest > testMetadata PASSED

org.apache.kafka.connect.runtime.distributed.WorkerCoordinatorTest > testLeaderPerformAssignment1 STARTED

org.apache.kafka.connect.runtime.distributed.WorkerCoordinatorTest > testLeaderPerformAssignment1 PASSED

org.apache.kafka.connect.runtime.distributed.WorkerCoordinatorTest > testLeaderPerformAssignment2 STARTED

org.apache.kafka.connect.runtime.distributed.WorkerCoordinatorTest > testLeaderPerformAssignment2 PASSED

org.apache.kafka.connect.runtime.distributed.WorkerCoordinatorTest > testJoinLeaderCannotAssign STARTED

org.apache.kafka.connect.runtime.distributed.WorkerCoordinatorTest > testJoinLeaderCannotAssign PASSED

org.apache.kafka.connect.runtime.distributed.WorkerCoordinatorTest > testRejoinGroup STARTED

org.apache.kafka.connect.runtime.distributed.WorkerCoordinatorTest > testRejoinGroup PASSED

org.apache.kafka.connect.runtime.distributed.WorkerCoordinatorTest > testNormalJoinGroupLeader STARTED

org.apache.kafka.connect.runtime.distributed.WorkerCoordinatorTest > testNormalJoinGroupLeader PASSED

org.apache.kafka.connect.runtime.WorkerTaskTest > standardStartup STARTED

org.apache.kafka.connect.runtime.WorkerTaskTest > standardStartup PASSED

org.apache.kafka.connect.runtime.WorkerTaskTest > stopBeforeStarting STARTED

org.apache.kafka.connect.runtime.WorkerTaskTest > stopBeforeStarting PASSED

org.apache.kafka.connect.runtime.WorkerTaskTest > updateMetricsOnListenerEventsForStartupPauseResumeAndShutdown STARTED

org.apache.kafka.connect.runtime.WorkerTaskTest > updateMetricsOnListenerEventsForStartupPauseResumeAndShutdown PASSED

org.apache.kafka.connect.runtime.WorkerTaskTest > updateMetricsOnListenerEventsForStartupPauseResumeAndFailure STARTED

org.apache.kafka.connect.runtime.WorkerTaskTest > updateMetricsOnListenerEventsForStartupPauseResumeAndFailure PASSED

org.apache.kafka.connect.runtime.WorkerTaskTest > cancelBeforeStopping STARTED

org.apache.kafka.connect.runtime.WorkerTaskTest > cancelBeforeStopping PASSED

384 tests completed, 1 failed

> Task :connect:runtime:test FAILED

FAILURE: Build failed with an exception.

* What went wrong:
Execution failed for task ':connect:runtime:test'.
> There were failing tests. See the report at: file://<https://builds.apache.org/job/kafka-trunk-jdk11/ws/connect/runtime/build/reports/tests/test/index.html>

* Try:
Run with --stacktrace option to get the stack trace. Run with --info or --debug option to get more log output. Run with --scan to get full insights.

* Get more help at https://help.gradle.org

Deprecated Gradle features were used in this build, making it incompatible with Gradle 6.0.
Use '--warning-mode all' to show the individual deprecation warnings.
See https://docs.gradle.org/5.1/userguide/command_line_interface.html#sec:command_line_warnings

BUILD FAILED in 2h 22m 26s
166 actionable tasks: 165 executed, 1 up-to-date
Build step 'Execute shell' marked build as failure
Recording test results
Setting GRADLE_4_10_2_HOME=/home/jenkins/tools/gradle/4.10.2
Setting GRADLE_4_10_2_HOME=/home/jenkins/tools/gradle/4.10.2
Not sending mail to unregistered user ismael@juma.me.uk
Not sending mail to unregistered user wangguoz@gmail.com
Not sending mail to unregistered user vahid.hashemian@gmail.com
Not sending mail to unregistered user noreply@github.com

Build failed in Jenkins: kafka-trunk-jdk11 #228

Posted by Apache Jenkins Server <je...@builds.apache.org>.
See <https://builds.apache.org/job/kafka-trunk-jdk11/228/display/redirect?page=changes>

Changes:

[github] KAFKA-3522: Add internal RecordConverter interface (#6150)

------------------------------------------
[...truncated 2.47 MB...]

kafka.utils.json.JsonValueTest > testDecodeLong PASSED

kafka.utils.json.JsonValueTest > testAsJsonObject STARTED

kafka.utils.json.JsonValueTest > testAsJsonObject PASSED

kafka.utils.json.JsonValueTest > testDecodeDouble STARTED

kafka.utils.json.JsonValueTest > testDecodeDouble PASSED

kafka.utils.json.JsonValueTest > testDecodeOption STARTED

kafka.utils.json.JsonValueTest > testDecodeOption PASSED

kafka.utils.json.JsonValueTest > testDecodeString STARTED

kafka.utils.json.JsonValueTest > testDecodeString PASSED

kafka.utils.json.JsonValueTest > testJsonValueToString STARTED

kafka.utils.json.JsonValueTest > testJsonValueToString PASSED

kafka.utils.json.JsonValueTest > testAsJsonObjectOption STARTED

kafka.utils.json.JsonValueTest > testAsJsonObjectOption PASSED

kafka.utils.json.JsonValueTest > testAsJsonArrayOption STARTED

kafka.utils.json.JsonValueTest > testAsJsonArrayOption PASSED

kafka.utils.json.JsonValueTest > testAsJsonArray STARTED

kafka.utils.json.JsonValueTest > testAsJsonArray PASSED

kafka.utils.json.JsonValueTest > testJsonValueHashCode STARTED

kafka.utils.json.JsonValueTest > testJsonValueHashCode PASSED

kafka.utils.json.JsonValueTest > testDecodeInt STARTED

kafka.utils.json.JsonValueTest > testDecodeInt PASSED

kafka.utils.json.JsonValueTest > testDecodeMap STARTED

kafka.utils.json.JsonValueTest > testDecodeMap PASSED

kafka.utils.json.JsonValueTest > testDecodeSeq STARTED

kafka.utils.json.JsonValueTest > testDecodeSeq PASSED

kafka.utils.json.JsonValueTest > testJsonObjectGet STARTED

kafka.utils.json.JsonValueTest > testJsonObjectGet PASSED

kafka.utils.json.JsonValueTest > testJsonValueEquals STARTED

kafka.utils.json.JsonValueTest > testJsonValueEquals PASSED

kafka.utils.json.JsonValueTest > testJsonArrayIterator STARTED

kafka.utils.json.JsonValueTest > testJsonArrayIterator PASSED

kafka.utils.json.JsonValueTest > testJsonObjectApply STARTED

kafka.utils.json.JsonValueTest > testJsonObjectApply PASSED

kafka.utils.json.JsonValueTest > testDecodeBoolean STARTED

kafka.utils.json.JsonValueTest > testDecodeBoolean PASSED

kafka.utils.CoreUtilsTest > testGenerateUuidAsBase64 STARTED

kafka.utils.CoreUtilsTest > testGenerateUuidAsBase64 PASSED

kafka.utils.CoreUtilsTest > testAbs STARTED

kafka.utils.CoreUtilsTest > testAbs PASSED

kafka.utils.CoreUtilsTest > testReplaceSuffix STARTED

kafka.utils.CoreUtilsTest > testReplaceSuffix PASSED

kafka.utils.CoreUtilsTest > testCircularIterator STARTED

kafka.utils.CoreUtilsTest > testCircularIterator PASSED

kafka.utils.CoreUtilsTest > testReadBytes STARTED

kafka.utils.CoreUtilsTest > testReadBytes PASSED

kafka.utils.CoreUtilsTest > testCsvList STARTED

kafka.utils.CoreUtilsTest > testCsvList PASSED

kafka.utils.CoreUtilsTest > testReadInt STARTED

kafka.utils.CoreUtilsTest > testReadInt PASSED

kafka.utils.CoreUtilsTest > testAtomicGetOrUpdate STARTED

kafka.utils.CoreUtilsTest > testAtomicGetOrUpdate PASSED

kafka.utils.CoreUtilsTest > testUrlSafeBase64EncodeUUID STARTED

kafka.utils.CoreUtilsTest > testUrlSafeBase64EncodeUUID PASSED

kafka.utils.CoreUtilsTest > testCsvMap STARTED

kafka.utils.CoreUtilsTest > testCsvMap PASSED

kafka.utils.CoreUtilsTest > testInLock STARTED

kafka.utils.CoreUtilsTest > testInLock PASSED

kafka.utils.CoreUtilsTest > testTryAll STARTED

kafka.utils.CoreUtilsTest > testTryAll PASSED

kafka.utils.CoreUtilsTest > testSwallow STARTED

kafka.utils.CoreUtilsTest > testSwallow PASSED

kafka.utils.ShutdownableThreadTest > testShutdownWhenCalledAfterThreadStart STARTED

kafka.utils.ShutdownableThreadTest > testShutdownWhenCalledAfterThreadStart PASSED

kafka.utils.TopicFilterTest > testWhitelists STARTED

kafka.utils.TopicFilterTest > testWhitelists PASSED

kafka.utils.JsonTest > testParseToWithInvalidJson STARTED

kafka.utils.JsonTest > testParseToWithInvalidJson PASSED

kafka.utils.JsonTest > testParseTo STARTED

kafka.utils.JsonTest > testParseTo PASSED

kafka.utils.JsonTest > testJsonParse STARTED

kafka.utils.JsonTest > testJsonParse PASSED

kafka.utils.JsonTest > testLegacyEncodeAsString STARTED

kafka.utils.JsonTest > testLegacyEncodeAsString PASSED

kafka.utils.JsonTest > testEncodeAsBytes STARTED

kafka.utils.JsonTest > testEncodeAsBytes PASSED

kafka.utils.JsonTest > testEncodeAsString STARTED

kafka.utils.JsonTest > testEncodeAsString PASSED

kafka.utils.CommandLineUtilsTest > testParseEmptyArg STARTED

kafka.utils.CommandLineUtilsTest > testParseEmptyArg PASSED

kafka.utils.CommandLineUtilsTest > testMaybeMergeOptionsOverwriteExisting STARTED

kafka.utils.CommandLineUtilsTest > testMaybeMergeOptionsOverwriteExisting PASSED

kafka.utils.CommandLineUtilsTest > testParseSingleArg STARTED

kafka.utils.CommandLineUtilsTest > testParseSingleArg PASSED

kafka.utils.CommandLineUtilsTest > testParseArgs STARTED

kafka.utils.CommandLineUtilsTest > testParseArgs PASSED

kafka.utils.CommandLineUtilsTest > testParseArgsWithMultipleDelimiters STARTED

kafka.utils.CommandLineUtilsTest > testParseArgsWithMultipleDelimiters PASSED

kafka.utils.CommandLineUtilsTest > testMaybeMergeOptionsDefaultValueIfNotExist STARTED

kafka.utils.CommandLineUtilsTest > testMaybeMergeOptionsDefaultValueIfNotExist PASSED

kafka.utils.CommandLineUtilsTest > testParseEmptyArgWithNoDelimiter STARTED

kafka.utils.CommandLineUtilsTest > testParseEmptyArgWithNoDelimiter PASSED

kafka.utils.CommandLineUtilsTest > testMaybeMergeOptionsDefaultOverwriteExisting STARTED

kafka.utils.CommandLineUtilsTest > testMaybeMergeOptionsDefaultOverwriteExisting PASSED

kafka.utils.CommandLineUtilsTest > testParseEmptyArgAsValid STARTED

kafka.utils.CommandLineUtilsTest > testParseEmptyArgAsValid PASSED

kafka.utils.CommandLineUtilsTest > testMaybeMergeOptionsNotOverwriteExisting STARTED

kafka.utils.CommandLineUtilsTest > testMaybeMergeOptionsNotOverwriteExisting PASSED

kafka.utils.LoggingTest > testLog4jControllerIsRegistered STARTED

kafka.utils.LoggingTest > testLog4jControllerIsRegistered PASSED

kafka.utils.LoggingTest > testLogName STARTED

kafka.utils.LoggingTest > testLogName PASSED

kafka.utils.LoggingTest > testLogNameOverride STARTED

kafka.utils.LoggingTest > testLogNameOverride PASSED

1844 tests completed, 74 failed, 4 skipped

> Task :core:test FAILED

FAILURE: Build completed with 2 failures.

1: Task failed with an exception.
-----------
* What went wrong:
Execution failed for task ':connect:runtime:test'.
> There were failing tests. See the report at: file://<https://builds.apache.org/job/kafka-trunk-jdk11/ws/connect/runtime/build/reports/tests/test/index.html>

* Try:
Run with --stacktrace option to get the stack trace. Run with --info or --debug option to get more log output. Run with --scan to get full insights.
==============================================================================

2: Task failed with an exception.
-----------
* What went wrong:
Execution failed for task ':core:test'.
> There were failing tests. See the report at: file://<https://builds.apache.org/job/kafka-trunk-jdk11/ws/core/build/reports/tests/test/index.html>

* Try:
Run with --stacktrace option to get the stack trace. Run with --info or --debug option to get more log output. Run with --scan to get full insights.
==============================================================================

* Get more help at https://help.gradle.org

Deprecated Gradle features were used in this build, making it incompatible with Gradle 6.0.
Use '--warning-mode all' to show the individual deprecation warnings.
See https://docs.gradle.org/5.1/userguide/command_line_interface.html#sec:command_line_warnings

BUILD FAILED in 1h 51m 17s
166 actionable tasks: 165 executed, 1 up-to-date
Build step 'Execute shell' marked build as failure
Recording test results
Setting GRADLE_4_10_2_HOME=/home/jenkins/tools/gradle/4.10.2
Setting GRADLE_4_10_2_HOME=/home/jenkins/tools/gradle/4.10.2
Not sending mail to unregistered user ismael@juma.me.uk
Not sending mail to unregistered user wangguoz@gmail.com
Not sending mail to unregistered user vahid.hashemian@gmail.com
Not sending mail to unregistered user noreply@github.com

Build failed in Jenkins: kafka-trunk-jdk11 #227

Posted by Apache Jenkins Server <je...@builds.apache.org>.
See <https://builds.apache.org/job/kafka-trunk-jdk11/227/display/redirect?page=changes>

Changes:

[vahid.hashemian] Fix Javadoc of KafkaConsumer (#6155)

------------------------------------------
[...truncated 2.27 MB...]
org.apache.kafka.streams.StreamsConfigTest > shouldThrowExceptionIfCommitIntervalMsIsNegative STARTED

org.apache.kafka.streams.StreamsConfigTest > shouldThrowExceptionIfCommitIntervalMsIsNegative PASSED

org.apache.kafka.streams.StreamsConfigTest > testGetConsumerConfigs STARTED

org.apache.kafka.streams.StreamsConfigTest > testGetConsumerConfigs PASSED

org.apache.kafka.streams.StreamsConfigTest > shouldOverrideNonPrefixedCustomConfigsWithPrefixedConfigs STARTED

org.apache.kafka.streams.StreamsConfigTest > shouldOverrideNonPrefixedCustomConfigsWithPrefixedConfigs PASSED

org.apache.kafka.streams.StreamsConfigTest > shouldAcceptAtLeastOnce STARTED

org.apache.kafka.streams.StreamsConfigTest > shouldAcceptAtLeastOnce PASSED

org.apache.kafka.streams.StreamsConfigTest > shouldUseCorrectDefaultsWhenNoneSpecified STARTED

org.apache.kafka.streams.StreamsConfigTest > shouldUseCorrectDefaultsWhenNoneSpecified PASSED

org.apache.kafka.streams.StreamsConfigTest > shouldAllowSettingProducerEnableIdempotenceIfEosDisabled STARTED

org.apache.kafka.streams.StreamsConfigTest > shouldAllowSettingProducerEnableIdempotenceIfEosDisabled PASSED

org.apache.kafka.streams.StreamsConfigTest > defaultSerdeShouldBeConfigured STARTED

org.apache.kafka.streams.StreamsConfigTest > defaultSerdeShouldBeConfigured PASSED

org.apache.kafka.streams.StreamsConfigTest > shouldSetDifferentDefaultsIfEosEnabled STARTED

org.apache.kafka.streams.StreamsConfigTest > shouldSetDifferentDefaultsIfEosEnabled PASSED

org.apache.kafka.streams.StreamsConfigTest > shouldNotOverrideUserConfigRetriesIfExactlyOnceEnabled STARTED

org.apache.kafka.streams.StreamsConfigTest > shouldNotOverrideUserConfigRetriesIfExactlyOnceEnabled PASSED

org.apache.kafka.streams.StreamsConfigTest > shouldSupportPrefixedConsumerConfigs STARTED

org.apache.kafka.streams.StreamsConfigTest > shouldSupportPrefixedConsumerConfigs PASSED

org.apache.kafka.streams.StreamsConfigTest > shouldOverrideStreamsDefaultConsumerConfigs STARTED

org.apache.kafka.streams.StreamsConfigTest > shouldOverrideStreamsDefaultConsumerConfigs PASSED

org.apache.kafka.streams.StreamsConfigTest > testGetProducerConfigs STARTED

org.apache.kafka.streams.StreamsConfigTest > testGetProducerConfigs PASSED

org.apache.kafka.streams.StreamsConfigTest > shouldThrowStreamsExceptionIfValueSerdeConfigFails STARTED

org.apache.kafka.streams.StreamsConfigTest > shouldThrowStreamsExceptionIfValueSerdeConfigFails PASSED

org.apache.kafka.streams.StreamsConfigTest > shouldResetToDefaultIfConsumerAutoCommitIsOverridden STARTED

org.apache.kafka.streams.StreamsConfigTest > shouldResetToDefaultIfConsumerAutoCommitIsOverridden PASSED

org.apache.kafka.streams.StreamsConfigTest > shouldThrowExceptionIfNotAtLestOnceOrExactlyOnce STARTED

org.apache.kafka.streams.StreamsConfigTest > shouldThrowExceptionIfNotAtLestOnceOrExactlyOnce PASSED

org.apache.kafka.streams.StreamsConfigTest > shouldAllowSettingConsumerIsolationLevelIfEosDisabled STARTED

org.apache.kafka.streams.StreamsConfigTest > shouldAllowSettingConsumerIsolationLevelIfEosDisabled PASSED

org.apache.kafka.streams.StreamsConfigTest > shouldSpecifyOptimizationWhenNotExplicitlyAddedToConfigs STARTED

org.apache.kafka.streams.StreamsConfigTest > shouldSpecifyOptimizationWhenNotExplicitlyAddedToConfigs PASSED

org.apache.kafka.streams.StreamsConfigTest > testGetGlobalConsumerConfigs STARTED

org.apache.kafka.streams.StreamsConfigTest > testGetGlobalConsumerConfigs PASSED

org.apache.kafka.streams.StreamsConfigTest > shouldSupportPrefixedProducerConfigs STARTED

org.apache.kafka.streams.StreamsConfigTest > shouldSupportPrefixedProducerConfigs PASSED

org.apache.kafka.streams.StreamsConfigTest > shouldSupportPrefixedPropertiesThatAreNotPartOfRestoreConsumerConfig STARTED

org.apache.kafka.streams.StreamsConfigTest > shouldSupportPrefixedPropertiesThatAreNotPartOfRestoreConsumerConfig PASSED

org.apache.kafka.streams.StreamsConfigTest > testGetRestoreConsumerConfigsWithRestoreConsumerOverridenPrefix STARTED

org.apache.kafka.streams.StreamsConfigTest > testGetRestoreConsumerConfigsWithRestoreConsumerOverridenPrefix PASSED

org.apache.kafka.streams.StreamsConfigTest > shouldThrowConfigExceptionIfMaxInFlightRequestsPerConnectionIsInvalidStringIfEosEnabled STARTED

org.apache.kafka.streams.StreamsConfigTest > shouldThrowConfigExceptionIfMaxInFlightRequestsPerConnectionIsInvalidStringIfEosEnabled PASSED

org.apache.kafka.streams.StreamsConfigTest > shouldOverrideStreamsDefaultProducerConfigs STARTED

org.apache.kafka.streams.StreamsConfigTest > shouldOverrideStreamsDefaultProducerConfigs PASSED

org.apache.kafka.streams.StreamsConfigTest > shouldSupportPrefixedPropertiesThatAreNotPartOfProducerConfig STARTED

org.apache.kafka.streams.StreamsConfigTest > shouldSupportPrefixedPropertiesThatAreNotPartOfProducerConfig PASSED

org.apache.kafka.streams.StreamsConfigTest > shouldSupportPrefixedGlobalConsumerConfigs STARTED

org.apache.kafka.streams.StreamsConfigTest > shouldSupportPrefixedGlobalConsumerConfigs PASSED

org.apache.kafka.streams.StreamsConfigTest > shouldBeSupportNonPrefixedConsumerConfigs STARTED

org.apache.kafka.streams.StreamsConfigTest > shouldBeSupportNonPrefixedConsumerConfigs PASSED

org.apache.kafka.streams.StreamsConfigTest > consumerConfigShouldContainAdminClientConfigsForRetriesAndRetryBackOffMsWithAdminPrefix STARTED

org.apache.kafka.streams.StreamsConfigTest > consumerConfigShouldContainAdminClientConfigsForRetriesAndRetryBackOffMsWithAdminPrefix PASSED

org.apache.kafka.streams.StreamsConfigTest > shouldOverrideStreamsDefaultConsumerConifgsOnRestoreConsumer STARTED

org.apache.kafka.streams.StreamsConfigTest > shouldOverrideStreamsDefaultConsumerConifgsOnRestoreConsumer PASSED

org.apache.kafka.streams.StreamsConfigTest > shouldSupportPrefixedPropertiesThatAreNotPartOfGlobalConsumerConfig STARTED

org.apache.kafka.streams.StreamsConfigTest > shouldSupportPrefixedPropertiesThatAreNotPartOfGlobalConsumerConfig PASSED

org.apache.kafka.streams.StreamsConfigTest > shouldAcceptExactlyOnce STARTED

org.apache.kafka.streams.StreamsConfigTest > shouldAcceptExactlyOnce PASSED

org.apache.kafka.streams.StreamsConfigTest > testGetGlobalConsumerConfigsWithGlobalConsumerOverridenPrefix STARTED

org.apache.kafka.streams.StreamsConfigTest > testGetGlobalConsumerConfigsWithGlobalConsumerOverridenPrefix PASSED

org.apache.kafka.streams.StreamsConfigTest > shouldThrowExceptionIfMaxInFlightRequestsGreaterThanFiveIfEosEnabled STARTED

org.apache.kafka.streams.StreamsConfigTest > shouldThrowExceptionIfMaxInFlightRequestsGreaterThanFiveIfEosEnabled PASSED

org.apache.kafka.streams.StreamsConfigTest > shouldSetInternalLeaveGroupOnCloseConfigToFalseInConsumer STARTED

org.apache.kafka.streams.StreamsConfigTest > shouldSetInternalLeaveGroupOnCloseConfigToFalseInConsumer PASSED

org.apache.kafka.streams.StreamsConfigTest > shouldSupportPrefixedPropertiesThatAreNotPartOfConsumerConfig STARTED

org.apache.kafka.streams.StreamsConfigTest > shouldSupportPrefixedPropertiesThatAreNotPartOfConsumerConfig PASSED

org.apache.kafka.streams.StreamsConfigTest > shouldForwardCustomConfigsWithNoPrefixToAllClients STARTED

org.apache.kafka.streams.StreamsConfigTest > shouldForwardCustomConfigsWithNoPrefixToAllClients PASSED

org.apache.kafka.streams.StreamsConfigTest > shouldResetToDefaultIfRestoreConsumerAutoCommitIsOverridden STARTED

org.apache.kafka.streams.StreamsConfigTest > shouldResetToDefaultIfRestoreConsumerAutoCommitIsOverridden PASSED

org.apache.kafka.streams.StreamsConfigTest > shouldSpecifyCorrectValueSerdeClassOnError STARTED

org.apache.kafka.streams.StreamsConfigTest > shouldSpecifyCorrectValueSerdeClassOnError PASSED

org.apache.kafka.streams.StreamsConfigTest > shouldAllowToSpecifyMaxInFlightRequestsPerConnectionAsStringIfEosEnabled STARTED

org.apache.kafka.streams.StreamsConfigTest > shouldAllowToSpecifyMaxInFlightRequestsPerConnectionAsStringIfEosEnabled PASSED

org.apache.kafka.streams.StreamsConfigTest > shouldResetToDefaultIfGlobalConsumerAutoCommitIsOverridden STARTED

org.apache.kafka.streams.StreamsConfigTest > shouldResetToDefaultIfGlobalConsumerAutoCommitIsOverridden PASSED

org.apache.kafka.streams.StreamsConfigTest > shouldResetToDefaultIfConsumerIsolationLevelIsOverriddenIfEosEnabled STARTED

org.apache.kafka.streams.StreamsConfigTest > shouldResetToDefaultIfConsumerIsolationLevelIsOverriddenIfEosEnabled PASSED

org.apache.kafka.streams.StreamsConfigTest > shouldBeSupportNonPrefixedGlobalConsumerConfigs STARTED

org.apache.kafka.streams.StreamsConfigTest > shouldBeSupportNonPrefixedGlobalConsumerConfigs PASSED

org.apache.kafka.streams.StreamsConfigTest > shouldSupportNonPrefixedAdminConfigs STARTED

org.apache.kafka.streams.StreamsConfigTest > shouldSupportNonPrefixedAdminConfigs PASSED

org.apache.kafka.streams.StreamsConfigTest > shouldNotOverrideUserConfigCommitIntervalMsIfExactlyOnceEnabled STARTED

org.apache.kafka.streams.StreamsConfigTest > shouldNotOverrideUserConfigCommitIntervalMsIfExactlyOnceEnabled PASSED

org.apache.kafka.streams.StreamsConfigTest > shouldSupportMultipleBootstrapServers STARTED

org.apache.kafka.streams.StreamsConfigTest > shouldSupportMultipleBootstrapServers PASSED

org.apache.kafka.streams.StreamsConfigTest > shouldSpecifyNoOptimizationWhenNotExplicitlyAddedToConfigs STARTED

org.apache.kafka.streams.StreamsConfigTest > shouldSpecifyNoOptimizationWhenNotExplicitlyAddedToConfigs PASSED

org.apache.kafka.streams.StreamsConfigTest > shouldThrowConfigExceptionWhenOptimizationConfigNotValueInRange STARTED

org.apache.kafka.streams.StreamsConfigTest > shouldThrowConfigExceptionWhenOptimizationConfigNotValueInRange PASSED

org.apache.kafka.streams.StreamsConfigTest > shouldThrowStreamsExceptionIfKeySerdeConfigFails STARTED

org.apache.kafka.streams.StreamsConfigTest > shouldThrowStreamsExceptionIfKeySerdeConfigFails PASSED

org.apache.kafka.streams.StreamsConfigTest > shouldSupportNonPrefixedProducerConfigs STARTED

org.apache.kafka.streams.StreamsConfigTest > shouldSupportNonPrefixedProducerConfigs PASSED

org.apache.kafka.streams.StreamsConfigTest > testGetRestoreConsumerConfigs STARTED

org.apache.kafka.streams.StreamsConfigTest > testGetRestoreConsumerConfigs PASSED

org.apache.kafka.streams.StreamsConfigTest > shouldThrowExceptionIfBootstrapServersIsNotSet STARTED

org.apache.kafka.streams.StreamsConfigTest > shouldThrowExceptionIfBootstrapServersIsNotSet PASSED

org.apache.kafka.streams.StreamsConfigTest > testGetMainConsumerConfigsWithMainConsumerOverridenPrefix STARTED

org.apache.kafka.streams.StreamsConfigTest > testGetMainConsumerConfigsWithMainConsumerOverridenPrefix PASSED

org.apache.kafka.streams.StreamsConfigTest > shouldBeSupportNonPrefixedRestoreConsumerConfigs STARTED

org.apache.kafka.streams.StreamsConfigTest > shouldBeSupportNonPrefixedRestoreConsumerConfigs PASSED

org.apache.kafka.streams.StreamsConfigTest > shouldSupportPrefixedRestoreConsumerConfigs STARTED

org.apache.kafka.streams.StreamsConfigTest > shouldSupportPrefixedRestoreConsumerConfigs PASSED

org.apache.kafka.streams.StreamsConfigTest > shouldThrowExceptionIfApplicationIdIsNotSet STARTED

org.apache.kafka.streams.StreamsConfigTest > shouldThrowExceptionIfApplicationIdIsNotSet PASSED

org.apache.kafka.streams.StreamsConfigTest > consumerConfigMustContainStreamPartitionAssignorConfig STARTED

org.apache.kafka.streams.StreamsConfigTest > consumerConfigMustContainStreamPartitionAssignorConfig PASSED

org.apache.kafka.streams.StreamsConfigTest > shouldSpecifyCorrectKeySerdeClassOnError STARTED

org.apache.kafka.streams.StreamsConfigTest > shouldSpecifyCorrectKeySerdeClassOnError PASSED

FAILURE: Build failed with an exception.

* What went wrong:
Execution failed for task ':connect:runtime:test'.
> There were failing tests. See the report at: file://<https://builds.apache.org/job/kafka-trunk-jdk11/ws/connect/runtime/build/reports/tests/test/index.html>

* Try:
Run with --stacktrace option to get the stack trace. Run with --info or --debug option to get more log output. Run with --scan to get full insights.

* Get more help at https://help.gradle.org

Deprecated Gradle features were used in this build, making it incompatible with Gradle 6.0.
Use '--warning-mode all' to show the individual deprecation warnings.
See https://docs.gradle.org/5.1/userguide/command_line_interface.html#sec:command_line_warnings

BUILD FAILED in 2h 23m 56s
166 actionable tasks: 165 executed, 1 up-to-date
Build step 'Execute shell' marked build as failure
Recording test results
Setting GRADLE_4_10_2_HOME=/home/jenkins/tools/gradle/4.10.2
Setting GRADLE_4_10_2_HOME=/home/jenkins/tools/gradle/4.10.2
Not sending mail to unregistered user ismael@juma.me.uk
Not sending mail to unregistered user wangguoz@gmail.com
Not sending mail to unregistered user vahid.hashemian@gmail.com
Not sending mail to unregistered user noreply@github.com

Build failed in Jenkins: kafka-trunk-jdk11 #226

Posted by Apache Jenkins Server <je...@builds.apache.org>.
See <https://builds.apache.org/job/kafka-trunk-jdk11/226/display/redirect?page=changes>

Changes:

[github] KAFKA-6455: Extend CacheFlushListener to forward timestamp (#6147)

------------------------------------------
[...truncated 2.27 MB...]

org.apache.kafka.connect.transforms.CastTest > castWholeRecordDefaultValue STARTED

org.apache.kafka.connect.transforms.CastTest > castWholeRecordDefaultValue PASSED

org.apache.kafka.connect.transforms.CastTest > castWholeRecordValueWithSchemaInt8 STARTED

org.apache.kafka.connect.transforms.CastTest > castWholeRecordValueWithSchemaInt8 PASSED

org.apache.kafka.connect.transforms.CastTest > castWholeRecordKeyWithSchema STARTED

org.apache.kafka.connect.transforms.CastTest > castWholeRecordKeyWithSchema PASSED

org.apache.kafka.connect.transforms.CastTest > castWholeRecordValueSchemalessInt8 STARTED

org.apache.kafka.connect.transforms.CastTest > castWholeRecordValueSchemalessInt8 PASSED

org.apache.kafka.connect.transforms.CastTest > castWholeRecordValueSchemalessBooleanFalse STARTED

org.apache.kafka.connect.transforms.CastTest > castWholeRecordValueSchemalessBooleanFalse PASSED

org.apache.kafka.connect.transforms.CastTest > testConfigInvalidSchemaType STARTED

org.apache.kafka.connect.transforms.CastTest > testConfigInvalidSchemaType PASSED

org.apache.kafka.connect.transforms.CastTest > castWholeRecordValueSchemalessString STARTED

org.apache.kafka.connect.transforms.CastTest > castWholeRecordValueSchemalessString PASSED

org.apache.kafka.connect.transforms.CastTest > castFieldsWithSchema STARTED

org.apache.kafka.connect.transforms.CastTest > castFieldsWithSchema PASSED

org.apache.kafka.connect.transforms.TimestampConverterTest > testSchemalessFieldConversion STARTED

org.apache.kafka.connect.transforms.TimestampConverterTest > testSchemalessFieldConversion PASSED

org.apache.kafka.connect.transforms.TimestampConverterTest > testConfigInvalidTargetType STARTED

org.apache.kafka.connect.transforms.TimestampConverterTest > testConfigInvalidTargetType PASSED

org.apache.kafka.connect.transforms.TimestampConverterTest > testSchemalessStringToTimestamp STARTED

org.apache.kafka.connect.transforms.TimestampConverterTest > testSchemalessStringToTimestamp PASSED

org.apache.kafka.connect.transforms.TimestampConverterTest > testKey STARTED

org.apache.kafka.connect.transforms.TimestampConverterTest > testKey PASSED

org.apache.kafka.connect.transforms.TimestampConverterTest > testSchemalessDateToTimestamp STARTED

org.apache.kafka.connect.transforms.TimestampConverterTest > testSchemalessDateToTimestamp PASSED

org.apache.kafka.connect.transforms.TimestampConverterTest > testSchemalessTimestampToString STARTED

org.apache.kafka.connect.transforms.TimestampConverterTest > testSchemalessTimestampToString PASSED

org.apache.kafka.connect.transforms.TimestampConverterTest > testSchemalessTimeToTimestamp STARTED

org.apache.kafka.connect.transforms.TimestampConverterTest > testSchemalessTimeToTimestamp PASSED

org.apache.kafka.connect.transforms.TimestampConverterTest > testWithSchemaTimestampToDate STARTED

org.apache.kafka.connect.transforms.TimestampConverterTest > testWithSchemaTimestampToDate PASSED

org.apache.kafka.connect.transforms.TimestampConverterTest > testWithSchemaTimestampToTime STARTED

org.apache.kafka.connect.transforms.TimestampConverterTest > testWithSchemaTimestampToTime PASSED

org.apache.kafka.connect.transforms.TimestampConverterTest > testWithSchemaTimestampToUnix STARTED

org.apache.kafka.connect.transforms.TimestampConverterTest > testWithSchemaTimestampToUnix PASSED

org.apache.kafka.connect.transforms.TimestampConverterTest > testWithSchemaUnixToTimestamp STARTED

org.apache.kafka.connect.transforms.TimestampConverterTest > testWithSchemaUnixToTimestamp PASSED

org.apache.kafka.connect.transforms.TimestampConverterTest > testSchemalessIdentity STARTED

org.apache.kafka.connect.transforms.TimestampConverterTest > testSchemalessIdentity PASSED

org.apache.kafka.connect.transforms.TimestampConverterTest > testWithSchemaFieldConversion STARTED

org.apache.kafka.connect.transforms.TimestampConverterTest > testWithSchemaFieldConversion PASSED

org.apache.kafka.connect.transforms.TimestampConverterTest > testWithSchemaDateToTimestamp STARTED

org.apache.kafka.connect.transforms.TimestampConverterTest > testWithSchemaDateToTimestamp PASSED

org.apache.kafka.connect.transforms.TimestampConverterTest > testWithSchemaIdentity STARTED

org.apache.kafka.connect.transforms.TimestampConverterTest > testWithSchemaIdentity PASSED

org.apache.kafka.connect.transforms.TimestampConverterTest > testSchemalessTimestampToDate STARTED

org.apache.kafka.connect.transforms.TimestampConverterTest > testSchemalessTimestampToDate PASSED

org.apache.kafka.connect.transforms.TimestampConverterTest > testSchemalessTimestampToTime STARTED

org.apache.kafka.connect.transforms.TimestampConverterTest > testSchemalessTimestampToTime PASSED

org.apache.kafka.connect.transforms.TimestampConverterTest > testSchemalessTimestampToUnix STARTED

org.apache.kafka.connect.transforms.TimestampConverterTest > testSchemalessTimestampToUnix PASSED

org.apache.kafka.connect.transforms.TimestampConverterTest > testConfigMissingFormat STARTED

org.apache.kafka.connect.transforms.TimestampConverterTest > testConfigMissingFormat PASSED

org.apache.kafka.connect.transforms.TimestampConverterTest > testConfigNoTargetType STARTED

org.apache.kafka.connect.transforms.TimestampConverterTest > testConfigNoTargetType PASSED

org.apache.kafka.connect.transforms.TimestampConverterTest > testWithSchemaStringToTimestamp STARTED

org.apache.kafka.connect.transforms.TimestampConverterTest > testWithSchemaStringToTimestamp PASSED

org.apache.kafka.connect.transforms.TimestampConverterTest > testWithSchemaTimeToTimestamp STARTED

org.apache.kafka.connect.transforms.TimestampConverterTest > testWithSchemaTimeToTimestamp PASSED

org.apache.kafka.connect.transforms.TimestampConverterTest > testSchemalessUnixToTimestamp STARTED

org.apache.kafka.connect.transforms.TimestampConverterTest > testSchemalessUnixToTimestamp PASSED

org.apache.kafka.connect.transforms.TimestampConverterTest > testWithSchemaTimestampToString STARTED

org.apache.kafka.connect.transforms.TimestampConverterTest > testWithSchemaTimestampToString PASSED

org.apache.kafka.connect.transforms.TimestampConverterTest > testConfigInvalidFormat STARTED

org.apache.kafka.connect.transforms.TimestampConverterTest > testConfigInvalidFormat PASSED

org.apache.kafka.connect.transforms.HoistFieldTest > withSchema STARTED

org.apache.kafka.connect.transforms.HoistFieldTest > withSchema PASSED

org.apache.kafka.connect.transforms.HoistFieldTest > schemaless STARTED

org.apache.kafka.connect.transforms.HoistFieldTest > schemaless PASSED

org.apache.kafka.connect.transforms.RegexRouterTest > doesntMatch STARTED

org.apache.kafka.connect.transforms.RegexRouterTest > doesntMatch PASSED

org.apache.kafka.connect.transforms.RegexRouterTest > identity STARTED

org.apache.kafka.connect.transforms.RegexRouterTest > identity PASSED

org.apache.kafka.connect.transforms.RegexRouterTest > addPrefix STARTED

org.apache.kafka.connect.transforms.RegexRouterTest > addPrefix PASSED

org.apache.kafka.connect.transforms.RegexRouterTest > addSuffix STARTED

org.apache.kafka.connect.transforms.RegexRouterTest > addSuffix PASSED

org.apache.kafka.connect.transforms.RegexRouterTest > slice STARTED

org.apache.kafka.connect.transforms.RegexRouterTest > slice PASSED

org.apache.kafka.connect.transforms.RegexRouterTest > staticReplacement STARTED

org.apache.kafka.connect.transforms.RegexRouterTest > staticReplacement PASSED

org.apache.kafka.connect.transforms.util.NonEmptyListValidatorTest > testNullList STARTED

org.apache.kafka.connect.transforms.util.NonEmptyListValidatorTest > testNullList PASSED

org.apache.kafka.connect.transforms.util.NonEmptyListValidatorTest > testEmptyList STARTED

org.apache.kafka.connect.transforms.util.NonEmptyListValidatorTest > testEmptyList PASSED

org.apache.kafka.connect.transforms.util.NonEmptyListValidatorTest > testValidList STARTED

org.apache.kafka.connect.transforms.util.NonEmptyListValidatorTest > testValidList PASSED

org.apache.kafka.connect.transforms.ExtractFieldTest > withSchema STARTED

org.apache.kafka.connect.transforms.ExtractFieldTest > withSchema PASSED

org.apache.kafka.connect.transforms.ExtractFieldTest > testNullWithSchema STARTED

org.apache.kafka.connect.transforms.ExtractFieldTest > testNullWithSchema PASSED

org.apache.kafka.connect.transforms.ExtractFieldTest > schemaless STARTED

org.apache.kafka.connect.transforms.ExtractFieldTest > schemaless PASSED

org.apache.kafka.connect.transforms.ExtractFieldTest > testNullSchemaless STARTED

org.apache.kafka.connect.transforms.ExtractFieldTest > testNullSchemaless PASSED

org.apache.kafka.connect.transforms.MaskFieldTest > withSchema STARTED

org.apache.kafka.connect.transforms.MaskFieldTest > withSchema PASSED

org.apache.kafka.connect.transforms.MaskFieldTest > schemaless STARTED

org.apache.kafka.connect.transforms.MaskFieldTest > schemaless PASSED

org.apache.kafka.connect.transforms.InsertFieldTest > schemalessInsertConfiguredFields STARTED

org.apache.kafka.connect.transforms.InsertFieldTest > schemalessInsertConfiguredFields PASSED

org.apache.kafka.connect.transforms.InsertFieldTest > topLevelStructRequired STARTED

org.apache.kafka.connect.transforms.InsertFieldTest > topLevelStructRequired PASSED

org.apache.kafka.connect.transforms.InsertFieldTest > copySchemaAndInsertConfiguredFields STARTED

org.apache.kafka.connect.transforms.InsertFieldTest > copySchemaAndInsertConfiguredFields PASSED

org.apache.kafka.connect.transforms.ValueToKeyTest > withSchema STARTED

org.apache.kafka.connect.transforms.ValueToKeyTest > withSchema PASSED

org.apache.kafka.connect.transforms.ValueToKeyTest > schemaless STARTED

org.apache.kafka.connect.transforms.ValueToKeyTest > schemaless PASSED

org.apache.kafka.connect.transforms.TimestampRouterTest > defaultConfiguration STARTED

org.apache.kafka.connect.transforms.TimestampRouterTest > defaultConfiguration PASSED

FAILURE: Build failed with an exception.

* What went wrong:
Execution failed for task ':connect:runtime:test'.
> There were failing tests. See the report at: file://<https://builds.apache.org/job/kafka-trunk-jdk11/ws/connect/runtime/build/reports/tests/test/index.html>

* Try:
Run with --stacktrace option to get the stack trace. Run with --info or --debug option to get more log output. Run with --scan to get full insights.

* Get more help at https://help.gradle.org

Deprecated Gradle features were used in this build, making it incompatible with Gradle 6.0.
Use '--warning-mode all' to show the individual deprecation warnings.
See https://docs.gradle.org/5.1/userguide/command_line_interface.html#sec:command_line_warnings

BUILD FAILED in 2h 10m 37s
166 actionable tasks: 165 executed, 1 up-to-date
Build step 'Execute shell' marked build as failure
Recording test results
Setting GRADLE_4_10_2_HOME=/home/jenkins/tools/gradle/4.10.2
Setting GRADLE_4_10_2_HOME=/home/jenkins/tools/gradle/4.10.2
Not sending mail to unregistered user noreply@github.com
Not sending mail to unregistered user ismael@juma.me.uk
Not sending mail to unregistered user wangguoz@gmail.com