You are viewing a plain text version of this content. The canonical link for it is here.
Posted to builds@beam.apache.org by Apache Jenkins Server <je...@builds.apache.org> on 2021/10/07 01:17:52 UTC
Build failed in Jenkins: beam_PreCommit_Java_Cron #4589
See <https://ci-beam.apache.org/job/beam_PreCommit_Java_Cron/4589/display/redirect?page=changes>
Changes:
[stefan.istrate] Fix "too many pings" errors.
[stefan.istrate] Increase keepalive timeout to 5 minutes.
[Robert Bradshaw] Dead letter option.
[Robert Bradshaw] Guard setup.py logic with __main__ condition.
[stefan.istrate] Fix yapf complaints.
[aydar.zaynutdinov] [BEAM-12969] [Playground]
[Robert Bradshaw] Add the ability to use subprocesses with the dead letter queue.
[Robert Bradshaw] Support multi-output DoFns.
[noreply] Merge pull request #15510 from [BEAM-12883] Add coder for
[Robert Bradshaw] multi-output fix
[Robert Bradshaw] Add thresholding to dead letter pattern.
[Robert Bradshaw] treshold test fixes
[Robert Bradshaw] Better naming, documentation.
[noreply] [BEAM-12482] Ensure that we ignore schema update options when loading
[Kyle Weaver] Moving to 2.35.0-SNAPSHOT on master branch.
[Kyle Weaver] Add 2.35.0 section to changelog.
[noreply] Fix email links in the contact page
------------------------------------------
[...truncated 745.08 KB...]
location: class Watch
<https://ci-beam.apache.org/job/beam_PreCommit_Java_Cron/ws/src/sdks/java/core/src/main/java/org/apache/beam/sdk/transforms/Watch.java>:174: error: cannot find symbol
extends PTransform<PCollection<InputT>, PCollection<KV<InputT, OutputT>>> {
^
symbol: class PCollection
location: class Watch
<https://ci-beam.apache.org/job/beam_PreCommit_Java_Cron/ws/src/sdks/java/core/src/main/java/org/apache/beam/sdk/transforms/Watch.java>:174: error: cannot find symbol
extends PTransform<PCollection<InputT>, PCollection<KV<InputT, OutputT>>> {
^
symbol: class KV
location: class Watch
<https://ci-beam.apache.org/job/beam_PreCommit_Java_Cron/ws/src/sdks/java/core/src/main/java/org/apache/beam/sdk/schemas/transforms/CoGroup.java>:637: error: cannot find symbol
static class ConvertCoGbkResult extends DoFn<KV<Row, CoGbkResult>, Row> {
^
symbol: class DoFn
location: class CoGroup
<https://ci-beam.apache.org/job/beam_PreCommit_Java_Cron/ws/src/sdks/java/core/src/main/java/org/apache/beam/sdk/schemas/transforms/CoGroup.java>:637: error: cannot find symbol
static class ConvertCoGbkResult extends DoFn<KV<Row, CoGbkResult>, Row> {
^
symbol: class KV
location: class CoGroup
<https://ci-beam.apache.org/job/beam_PreCommit_Java_Cron/ws/src/sdks/java/core/src/main/java/org/apache/beam/sdk/schemas/transforms/CoGroup.java>:637: error: cannot find symbol
static class ConvertCoGbkResult extends DoFn<KV<Row, CoGbkResult>, Row> {
^
symbol: class Row
location: class CoGroup
<https://ci-beam.apache.org/job/beam_PreCommit_Java_Cron/ws/src/sdks/java/core/src/main/java/org/apache/beam/sdk/schemas/transforms/CoGroup.java>:637: error: cannot find symbol
static class ConvertCoGbkResult extends DoFn<KV<Row, CoGbkResult>, Row> {
^
symbol: class CoGbkResult
location: class CoGroup
<https://ci-beam.apache.org/job/beam_PreCommit_Java_Cron/ws/src/sdks/java/core/src/main/java/org/apache/beam/sdk/schemas/transforms/CoGroup.java>:637: error: cannot find symbol
static class ConvertCoGbkResult extends DoFn<KV<Row, CoGbkResult>, Row> {
^
symbol: class Row
location: class CoGroup
<https://ci-beam.apache.org/job/beam_PreCommit_Java_Cron/ws/src/sdks/java/core/src/main/java/org/apache/beam/sdk/schemas/transforms/CoGroup.java>:662: error: cannot find symbol
@Element KV<Row, CoGbkResult> element, ProcessContext c, OutputReceiver<Row> o) {
^
symbol: class ProcessContext
location: class ConvertCoGbkResult
<https://ci-beam.apache.org/job/beam_PreCommit_Java_Cron/ws/src/sdks/java/core/src/main/java/org/apache/beam/sdk/schemas/transforms/CoGroup.java>:662: error: cannot find symbol
@Element KV<Row, CoGbkResult> element, ProcessContext c, OutputReceiver<Row> o) {
^
symbol: class Element
location: class ConvertCoGbkResult
<https://ci-beam.apache.org/job/beam_PreCommit_Java_Cron/ws/src/sdks/java/core/src/main/java/org/apache/beam/sdk/schemas/transforms/CoGroup.java>:660: error: cannot find symbol
@ProcessElement
^
symbol: class ProcessElement
location: class ConvertCoGbkResult
<https://ci-beam.apache.org/job/beam_PreCommit_Java_Cron/ws/src/sdks/java/core/src/main/java/org/apache/beam/sdk/transforms/CombineFns.java>:123: warning - Tag @link: can't find with(SimpleFunction, CombineFn, TupleTag) in org.apache.beam.sdk.transforms.CombineFns.ComposeCombineFnBuilder
<https://ci-beam.apache.org/job/beam_PreCommit_Java_Cron/ws/src/sdks/java/core/src/main/java/org/apache/beam/sdk/transforms/CombineFns.java>:149: warning - Tag @link: can't find with(SimpleFunction, CombineFnWithContext, TupleTag) in org.apache.beam.sdk.transforms.CombineFns.ComposeCombineFnBuilder
<https://ci-beam.apache.org/job/beam_PreCommit_Java_Cron/ws/src/sdks/java/core/src/main/java/org/apache/beam/sdk/io/AvroIO.java>:334: warning - Tag @link: can't find continuously(Duration, TerminationCondition) in org.apache.beam.sdk.io.FileIO.Match
<https://ci-beam.apache.org/job/beam_PreCommit_Java_Cron/ws/src/sdks/java/core/src/main/java/org/apache/beam/sdk/io/AvroIO.java>:1034: warning - Tag @link: can't find watchForNewFiles in org.apache.beam.sdk.io.Read
<https://ci-beam.apache.org/job/beam_PreCommit_Java_Cron/ws/src/sdks/java/core/src/main/java/org/apache/beam/sdk/io/AvroIO.java>:1029: warning - Tag @link: can't find withEmptyMatchTreatment in org.apache.beam.sdk.io.Read
<https://ci-beam.apache.org/job/beam_PreCommit_Java_Cron/ws/src/sdks/java/core/src/main/java/org/apache/beam/sdk/io/AvroIO.java>:1046: warning - Tag @link: can't find withHintMatchesManyFiles() in org.apache.beam.sdk.io.Read
<https://ci-beam.apache.org/job/beam_PreCommit_Java_Cron/ws/src/sdks/java/core/src/main/java/org/apache/beam/sdk/io/AvroIO.java>:1240: warning - Tag @link: can't find watchForNewFiles in org.apache.beam.sdk.io.Read
<https://ci-beam.apache.org/job/beam_PreCommit_Java_Cron/ws/src/sdks/java/core/src/main/java/org/apache/beam/sdk/io/AvroIO.java>:1235: warning - Tag @link: can't find withEmptyMatchTreatment in org.apache.beam.sdk.io.Read
<https://ci-beam.apache.org/job/beam_PreCommit_Java_Cron/ws/src/sdks/java/core/src/main/java/org/apache/beam/sdk/io/AvroIO.java>:903: warning - Tag @link: can't find watchForNewFiles in org.apache.beam.sdk.io.Read
<https://ci-beam.apache.org/job/beam_PreCommit_Java_Cron/ws/src/sdks/java/core/src/main/java/org/apache/beam/sdk/io/AvroIO.java>:898: warning - Tag @link: can't find withEmptyMatchTreatment in org.apache.beam.sdk.io.Read
<https://ci-beam.apache.org/job/beam_PreCommit_Java_Cron/ws/src/sdks/java/core/src/main/java/org/apache/beam/sdk/io/AvroIO.java>:1400: warning - Tag @link: can't find to(FilenamePolicy) in org.apache.beam.sdk.io.AvroIO.TypedWrite
<https://ci-beam.apache.org/job/beam_PreCommit_Java_Cron/ws/src/sdks/java/core/src/main/java/org/apache/beam/sdk/io/AvroIO.java>:1400: warning - Tag @link: can't find to(FilenamePolicy) in org.apache.beam.sdk.io.AvroIO.TypedWrite
<https://ci-beam.apache.org/job/beam_PreCommit_Java_Cron/ws/src/sdks/java/core/src/main/java/org/apache/beam/sdk/io/AvroIO.java>:1377: warning - Tag @link: can't find to(FilenamePolicy) in org.apache.beam.sdk.io.AvroIO.TypedWrite
<https://ci-beam.apache.org/job/beam_PreCommit_Java_Cron/ws/src/sdks/java/core/src/main/java/org/apache/beam/sdk/io/AvroIO.java>:1708: warning - Tag @link: can't find to(FilenamePolicy) in org.apache.beam.sdk.io.AvroIO.TypedWrite
<https://ci-beam.apache.org/job/beam_PreCommit_Java_Cron/ws/src/sdks/java/core/src/main/java/org/apache/beam/sdk/io/DynamicFileDestinations.java>:136: warning - Tag @link: can't find constant(FilenamePolicy, SerializableFunction) in org.apache.beam.sdk.io.DynamicFileDestinations
<https://ci-beam.apache.org/job/beam_PreCommit_Java_Cron/ws/src/sdks/java/core/src/main/java/org/apache/beam/sdk/io/FileBasedSource.java>:207: warning - Tag @link: can't find FileBasedSource(Metadata, long, long, long) in org.apache.beam.sdk.io.FileBasedSource
<https://ci-beam.apache.org/job/beam_PreCommit_Java_Cron/ws/src/sdks/java/core/src/main/java/org/apache/beam/sdk/io/FileIO.java>:314: warning - Tag @link: can't find withNaming(Write.FileNaming) in org.apache.beam.sdk.io.FileIO.Write
<https://ci-beam.apache.org/job/beam_PreCommit_Java_Cron/ws/src/sdks/java/core/src/main/java/org/apache/beam/sdk/io/FileIO.java>:314: warning - Tag @link: can't find via(Contextful, Sink) in org.apache.beam.sdk.io.FileIO.Write
<https://ci-beam.apache.org/job/beam_PreCommit_Java_Cron/ws/src/sdks/java/core/src/main/java/org/apache/beam/sdk/io/FileIO.java>:334: warning - Tag @link: can't find continuously(Duration,
TerminationCondition) in org.apache.beam.sdk.io.FileIO.MatchAll
<https://ci-beam.apache.org/job/beam_PreCommit_Java_Cron/ws/src/sdks/java/core/src/main/java/org/apache/beam/sdk/io/TextIO.java>:185: warning - Tag @link: can't find continuously(Duration, TerminationCondition) in org.apache.beam.sdk.io.FileIO.Match
<https://ci-beam.apache.org/job/beam_PreCommit_Java_Cron/ws/src/sdks/java/core/src/main/java/org/apache/beam/sdk/io/TextIO.java>:185: warning - Tag @link: can't find to(FilenamePolicy) in org.apache.beam.sdk.io.TextIO.Write
<https://ci-beam.apache.org/job/beam_PreCommit_Java_Cron/ws/src/sdks/java/core/src/main/java/org/apache/beam/sdk/io/TextIO.java>:185: warning - Tag @link: can't find to(DynamicDestinations) in org.apache.beam.sdk.io.TextIO.Write
<https://ci-beam.apache.org/job/beam_PreCommit_Java_Cron/ws/src/sdks/java/core/src/main/java/org/apache/beam/sdk/io/TextIO.java>:260: warning - Tag @link: can't find to(DynamicDestinations) in org.apache.beam.sdk.io.TextIO.Write
<https://ci-beam.apache.org/job/beam_PreCommit_Java_Cron/ws/src/sdks/java/core/src/main/java/org/apache/beam/sdk/io/TextIO.java>:500: warning - Tag @link: can't find watchForNewFiles(Duration, TerminationCondition) in org.apache.beam.sdk.io.Read
<https://ci-beam.apache.org/job/beam_PreCommit_Java_Cron/ws/src/sdks/java/core/src/main/java/org/apache/beam/sdk/io/TextIO.java>:495: warning - Tag @link: can't find withEmptyMatchTreatment in org.apache.beam.sdk.io.Read
<https://ci-beam.apache.org/job/beam_PreCommit_Java_Cron/ws/src/sdks/java/core/src/main/java/org/apache/beam/sdk/io/TextIO.java>:561: warning - Tag @link: can't find withDelimiter in org.apache.beam.sdk.io.Read
<https://ci-beam.apache.org/job/beam_PreCommit_Java_Cron/ws/src/sdks/java/core/src/main/java/org/apache/beam/sdk/io/TextIO.java>:721: warning - Tag @link: can't find to(FilenamePolicy) in org.apache.beam.sdk.io.TextIO.TypedWrite
<https://ci-beam.apache.org/job/beam_PreCommit_Java_Cron/ws/src/sdks/java/core/src/main/java/org/apache/beam/sdk/io/TextIO.java>:795: warning - Tag @link: can't find to(DynamicDestinations) in org.apache.beam.sdk.io.TextIO.TypedWrite
<https://ci-beam.apache.org/job/beam_PreCommit_Java_Cron/ws/src/sdks/java/core/src/main/java/org/apache/beam/sdk/io/TextIO.java>:821: warning - Tag @link: can't find to(FilenamePolicy) in org.apache.beam.sdk.io.TextIO.TypedWrite
<https://ci-beam.apache.org/job/beam_PreCommit_Java_Cron/ws/src/sdks/java/core/src/main/java/org/apache/beam/sdk/io/TextIO.java>:821: warning - Tag @link: can't find to(DynamicDestinations) in org.apache.beam.sdk.io.TextIO.TypedWrite
<https://ci-beam.apache.org/job/beam_PreCommit_Java_Cron/ws/src/sdks/java/core/src/main/java/org/apache/beam/sdk/io/TextIO.java>:833: warning - Tag @link: can't find to(FilenamePolicy) in org.apache.beam.sdk.io.TextIO.TypedWrite
<https://ci-beam.apache.org/job/beam_PreCommit_Java_Cron/ws/src/sdks/java/core/src/main/java/org/apache/beam/sdk/io/TextIO.java>:833: warning - Tag @link: can't find to(DynamicDestinations) in org.apache.beam.sdk.io.TextIO.TypedWrite
<https://ci-beam.apache.org/job/beam_PreCommit_Java_Cron/ws/src/sdks/java/core/src/main/java/org/apache/beam/sdk/io/TextIO.java>:1094: warning - Tag @link: can't find to(DynamicDestinations) in org.apache.beam.sdk.io.TextIO.TypedWrite
<https://ci-beam.apache.org/job/beam_PreCommit_Java_Cron/ws/src/sdks/java/core/src/main/java/org/apache/beam/sdk/io/TextIO.java>:1081: warning - Tag @link: can't find to(FilenamePolicy) in org.apache.beam.sdk.io.TextIO.TypedWrite
<https://ci-beam.apache.org/job/beam_PreCommit_Java_Cron/ws/src/sdks/java/core/src/main/java/org/apache/beam/sdk/io/TextIO.java>:1107: warning - Tag @link: can't find to(SerializableFunction, Params) in org.apache.beam.sdk.io.TextIO.TypedWrite
<https://ci-beam.apache.org/job/beam_PreCommit_Java_Cron/ws/src/sdks/java/core/src/main/java/org/apache/beam/sdk/io/TextIO.java>:1195: warning - Tag @link: can't find to(DynamicDestinations) in org.apache.beam.sdk.io.TextIO.Write
<https://ci-beam.apache.org/job/beam_PreCommit_Java_Cron/ws/src/sdks/java/core/src/main/java/org/apache/beam/sdk/io/TextIO.java>:1195: warning - Tag @link: can't find to(SerializableFunction, Params) in org.apache.beam.sdk.io.TextIO.Write
<https://ci-beam.apache.org/job/beam_PreCommit_Java_Cron/ws/src/sdks/java/core/src/main/java/org/apache/beam/sdk/io/TextIO.java>:1163: warning - Tag @link: can't find withWritableByteChannelFactory(WritableByteChannelFactory) in org.apache.beam.sdk.io.TextIO.TypedWrite
> Task :runners:samza:test
> Task :runners:spark:3:check
> Task :runners:spark:3:build
> Task :runners:spark:3:buildDependents
> Task :sdks:java:core:javadoc
<https://ci-beam.apache.org/job/beam_PreCommit_Java_Cron/ws/src/sdks/java/core/src/main/java/org/apache/beam/sdk/values/PCollection.java>:310: warning - Tag @link:illegal character: "60" in "PCollection<Row>"
<https://ci-beam.apache.org/job/beam_PreCommit_Java_Cron/ws/src/sdks/java/core/src/main/java/org/apache/beam/sdk/values/PCollection.java>:310: warning - Tag @link:illegal character: "62" in "PCollection<Row>"
<https://ci-beam.apache.org/job/beam_PreCommit_Java_Cron/ws/src/sdks/java/core/src/main/java/org/apache/beam/sdk/schemas/SchemaRegistry.java>:291: warning - Tag @link:illegal character: "42" in "* NoSuchSchemaException"
<https://ci-beam.apache.org/job/beam_PreCommit_Java_Cron/ws/src/sdks/java/core/src/main/java/org/apache/beam/sdk/schemas/SchemaRegistry.java>:299: warning - Tag @link:illegal character: "42" in "* NoSuchSchemaException"
<https://ci-beam.apache.org/job/beam_PreCommit_Java_Cron/ws/src/sdks/java/core/src/main/java/org/apache/beam/sdk/options/SdkHarnessOptions.java>:127: warning - Tag @link: can't find addOverrideForName(String, LogLevel) in org.apache.beam.sdk.options.SdkHarnessOptions.SdkHarnessLogLevelOverrides
<https://ci-beam.apache.org/job/beam_PreCommit_Java_Cron/ws/src/sdks/java/core/src/main/java/org/apache/beam/sdk/options/SdkHarnessOptions.java>:139: warning - Tag @link: can't find addOverrideForName(String, LogLevel) in org.apache.beam.sdk.options.SdkHarnessOptions.SdkHarnessLogLevelOverrides
<https://ci-beam.apache.org/job/beam_PreCommit_Java_Cron/ws/src/sdks/java/core/src/main/java/org/apache/beam/sdk/state/StateSpecs.java>:89: warning - Tag @see: can't find combining(Coder, CombineFn) in org.apache.beam.sdk.state.StateSpecs
<https://ci-beam.apache.org/job/beam_PreCommit_Java_Cron/ws/src/sdks/java/core/src/main/java/org/apache/beam/sdk/state/StateSpecs.java>:107: warning - Tag @see: can't find combining(Coder, CombineFnWithContext) in org.apache.beam.sdk.state.StateSpecs
<https://ci-beam.apache.org/job/beam_PreCommit_Java_Cron/ws/src/sdks/java/core/src/main/java/org/apache/beam/sdk/state/StateSpecs.java>:118: warning - Tag @link: can't find combining(CombineFn) in org.apache.beam.sdk.state.StateSpecs
<https://ci-beam.apache.org/job/beam_PreCommit_Java_Cron/ws/src/sdks/java/core/src/main/java/org/apache/beam/sdk/state/StateSpecs.java>:137: warning - Tag @link: can't find combining(CombineFnWithContext) in org.apache.beam.sdk.state.StateSpecs
59 warnings
> Task :runners:samza:job-server:shadowJar
> Task :sdks:java:javadoc:allJavadoc
> Task :sdks:java:container:pullLicenses
done.
DEPRECATION: Python 3.5 reached the end of its life on September 13th, 2020. Please upgrade your Python as Python 3.5 is no longer maintained. pip 21.0 will drop support for Python 3.5 in January 2021. pip 21.0 will remove support for this functionality.
Collecting beautifulsoup4<5.0,>=4.9.0
Using cached beautifulsoup4-4.10.0-py3-none-any.whl (97 kB)
Collecting future<1.0.0,>=0.16.0
Using cached future-0.18.2-py3-none-any.whl
Collecting pyyaml<6.0.0,>=3.12
Using cached PyYAML-5.3.1-cp35-cp35m-linux_x86_64.whl
Collecting tenacity<6.0,>=5.0.2
Using cached tenacity-5.1.5-py2.py3-none-any.whl (34 kB)
Collecting soupsieve>1.2
Using cached soupsieve-2.1-py3-none-any.whl (32 kB)
Collecting six>=1.9.0
Using cached six-1.16.0-py2.py3-none-any.whl (11 kB)
Installing collected packages: soupsieve, six, tenacity, pyyaml, future, beautifulsoup4
Successfully installed beautifulsoup4-4.10.0 future-0.18.2 pyyaml-5.3.1 six-1.16.0 soupsieve-2.1 tenacity-5.1.5
Executing <https://ci-beam.apache.org/job/beam_PreCommit_Java_Cron/ws/src/sdks/java/container/build/virtualenv/bin/python> <https://ci-beam.apache.org/job/beam_PreCommit_Java_Cron/ws/src/sdks/java/container/license_scripts/pull_licenses_java.py> --license_index=<https://ci-beam.apache.org/job/beam_PreCommit_Java_Cron/ws/src/sdks/java/container/build/reports/dependency-license/index.json> --output_dir=<https://ci-beam.apache.org/job/beam_PreCommit_Java_Cron/ws/src/sdks/java/container/build/target/java_third_party_licenses> --dep_url_yaml=<https://ci-beam.apache.org/job/beam_PreCommit_Java_Cron/ws/src/sdks/java/container/license_scripts/dep_urls_java.yaml>
INFO:root:Pulling license for 209 dependencies using 16 threads.
INFO:root:pull_licenses_java.py succeed. It took 2.102222 seconds with 16 threads.
Copying licenses from <https://ci-beam.apache.org/job/beam_PreCommit_Java_Cron/ws/src/sdks/java/container/build/target/java_third_party_licenses> to <https://ci-beam.apache.org/job/beam_PreCommit_Java_Cron/ws/src/sdks/java/container/build/target/third_party_licenses.>
> Task :sdks:java:core:spotbugsTest SKIPPED
> Task :sdks:java:container:pullLicenses
Finished license_scripts.sh
> Task :sdks:java:container:goBuild
> Task :sdks:java:container:java8:copyJavaThirdPartyLicenses
> Task :sdks:java:container:java8:copySdkHarnessLauncher
> Task :sdks:java:container:java8:dockerPrepare
> Task :sdks:java:extensions:sql:jdbc:shadowJarTest
> Task :runners:samza:check
> Task :runners:samza:build
> Task :sdks:java:container:java8:docker
---> Running in 835149a14b2d
Removing intermediate container 835149a14b2d
---> baeb59169509
Step 4/18 : ARG pull_licenses
---> Running in b32ce981d18b
Removing intermediate container b32ce981d18b
---> 6944d6649e15
Step 5/18 : ADD target/slf4j-api.jar /opt/apache/beam/jars/
---> 78b24c6c8b68
Step 6/18 : ADD target/slf4j-jdk14.jar /opt/apache/beam/jars/
---> df5b176fc73a
Step 7/18 : ADD target/beam-sdks-java-harness.jar /opt/apache/beam/jars/
---> cb6a7c1876aa
Step 8/18 : ADD target/beam-sdks-java-io-kafka.jar /opt/apache/beam/jars/
---> 40e70cd705a1
Step 9/18 : ADD target/kafka-clients.jar /opt/apache/beam/jars/
---> aa808b07ae6c
Step 10/18 : ADD target/linux_amd64/boot /opt/apache/beam/
---> 1429d9dcc1d8
Step 11/18 : COPY target/LICENSE /opt/apache/beam/
---> ff41be30f53e
Step 12/18 : COPY target/NOTICE /opt/apache/beam/
> Task :sdks:java:core:spotbugsMain
> Task :sdks:java:core:test
> Task :sdks:java:container:java8:docker
---> d57f22d2715e
Step 13/18 : ADD target/third_party_licenses /opt/apache/beam/third_party_licenses/
---> 5418529c10a5
Step 14/18 : COPY target/LICENSE target/go-licenses/* /opt/apache/beam/third_party_licenses/golang/
---> 65138c519a4b
Step 15/18 : RUN rm /opt/apache/beam/third_party_licenses/golang/LICENSE
---> Running in 6b91c8912698
Removing intermediate container 6b91c8912698
---> 0d970ffcdfed
Step 16/18 : RUN if [ "${pull_licenses}" = "false" ] ; then rm -rf /opt/apache/beam/third_party_licenses ; fi
---> Running in 96fe79544d21
Removing intermediate container 96fe79544d21
---> 7ddd2ed78139
Step 17/18 : COPY target/profiler/* /opt/google_cloud_profiler/
---> b2b468001f06
Step 18/18 : ENTRYPOINT ["/opt/apache/beam/boot"]
---> Running in 6e6a933688ea
Removing intermediate container 6e6a933688ea
---> 104ab8a8fb21
Successfully built 104ab8a8fb21
Successfully tagged apache/beam_java8_sdk:2.35.0.dev
> Task :sdks:java:extensions:sql:jdbc:preCommit
> Task :runners:samza:job-server:build
> Task :runners:samza:job-server:buildDependents
> Task :runners:samza:buildDependents
> Task :runners:java-job-service:buildDependents
> Task :sdks:java:core:validateShadedJarDoesntLeakNonProjectClasses
> Task :sdks:java:core:check
> Task :sdks:java:core:build
> Task :sdks:java:core:buildNeeded
> Task :sdks:java:io:elasticsearch-tests:elasticsearch-tests-7:check
> Task :sdks:java:io:elasticsearch-tests:elasticsearch-tests-7:build
> Task :sdks:java:io:elasticsearch-tests:elasticsearch-tests-7:buildDependents
> Task :sdks:java:io:elasticsearch-tests:elasticsearch-tests-6:check
> Task :sdks:java:io:elasticsearch-tests:elasticsearch-tests-6:build
> Task :sdks:java:io:elasticsearch-tests:elasticsearch-tests-6:buildDependents
> Task :sdks:java:io:elasticsearch-tests:elasticsearch-tests-5:check
> Task :sdks:java:io:elasticsearch-tests:elasticsearch-tests-5:build
> Task :sdks:java:io:elasticsearch-tests:elasticsearch-tests-5:buildDependents
> Task :sdks:java:io:elasticsearch-tests:elasticsearch-tests-common:buildDependents
> Task :sdks:java:io:elasticsearch:buildDependents
> Task :sdks:java:testing:nexmark:check
> Task :sdks:java:testing:nexmark:build
> Task :sdks:java:testing:nexmark:buildDependents
> Task :sdks:java:extensions:sql:zetasql:buildDependents
> Task :sdks:java:extensions:sql:buildDependents
> Task :sdks:java:extensions:join-library:buildDependents
> Task :sdks:java:io:mongodb:buildDependents
> Task :sdks:java:io:thrift:buildDependents
FAILURE: Build failed with an exception.
* What went wrong:
Execution failed for task ':runners:google-cloud-dataflow-java:worker:test'.
> There were failing tests. See the report at: file://<https://ci-beam.apache.org/job/beam_PreCommit_Java_Cron/ws/src/runners/google-cloud-dataflow-java/worker/build/reports/tests/test/index.html>
* Try:
Run with --stacktrace option to get the stack trace. Run with --info or --debug option to get more log output. Run with --scan to get full insights.
* Get more help at https://help.gradle.org
Deprecated Gradle features were used in this build, making it incompatible with Gradle 7.0.
Use '--warning-mode all' to show the individual deprecation warnings.
See https://docs.gradle.org/6.9.1/userguide/command_line_interface.html#sec:command_line_warnings
BUILD FAILED in 55m 5s
1140 actionable tasks: 1064 executed, 74 from cache, 2 up-to-date
Publishing build scan...
https://gradle.com/s/e7452ic2sv3ie
Build step 'Invoke Gradle script' changed build result to FAILURE
Build step 'Invoke Gradle script' marked build as failure
---------------------------------------------------------------------
To unsubscribe, e-mail: builds-unsubscribe@beam.apache.org
For additional commands, e-mail: builds-help@beam.apache.org
Jenkins build is back to normal : beam_PreCommit_Java_Cron #4590
Posted by Apache Jenkins Server <je...@builds.apache.org>.
See <https://ci-beam.apache.org/job/beam_PreCommit_Java_Cron/4590/display/redirect?page=changes>
---------------------------------------------------------------------
To unsubscribe, e-mail: builds-unsubscribe@beam.apache.org
For additional commands, e-mail: builds-help@beam.apache.org