You are viewing a plain text version of this content. The canonical link for it is here.
Posted to mapreduce-dev@hadoop.apache.org by Apache Jenkins Server <je...@builds.apache.org> on 2011/12/13 11:30:24 UTC
Hadoop-Mapreduce-trunk-Commit - Build # 1435 - Still Failing
See https://builds.apache.org/job/Hadoop-Mapreduce-trunk-Commit/1435/
###################################################################################
########################## LAST 60 LINES OF THE CONSOLE ###########################
[...truncated 14348 lines...]
[exec] make[1]: Nothing to be done for `install-data-am'.
[exec] make[1]: Leaving directory `/home/jenkins/jenkins-slave/workspace/Hadoop-Mapreduce-trunk-Commit/trunk/hadoop-mapreduce-project/build/c++-build/Linux-i386-32/examples/pipes'
compile-c++-examples:
compile-examples:
ivy-resolve-test:
[ivy:resolve] downloading /home/jenkins/.m2/repository/org/apache/hadoop/hadoop-hdfs/0.24.0-SNAPSHOT/hadoop-hdfs-0.24.0-SNAPSHOT-tests.jar ...
[ivy:resolve] ................... (1131kB)
[ivy:resolve] [SUCCESSFUL ] org.apache.hadoop#hadoop-hdfs;0.24.0-SNAPSHOT!hadoop-hdfs.jar(tests) (3ms)
[ivy:resolve] downloading /home/jenkins/.m2/repository/junit/junit/4.8.1/junit-4.8.1.jar ...
[ivy:resolve] ..... (231kB)
[ivy:resolve] .. (0kB)
[ivy:resolve] [SUCCESSFUL ] junit#junit;4.8.1!junit.jar (4ms)
[ivy:resolve] downloading http://repo1.maven.org/maven2/org/mockito/mockito-all/1.8.2/mockito-all-1.8.2.jar ...
[ivy:resolve] ................................................................................................................................................................................................................................................................................................................................................................................................................................................................................................................................................................................................................................................................................................................................................................................................................................................................................................................................................................................................................................................................................................................................................................................................................................................................................................................................................................................................................................................................................................................................................................................................................................................................................................................................................................................................................................................................................................................................................................................................................................................................................................................................................................................................................................................................................................................................................................................................................................................................................................................ (1315kB)
[ivy:resolve] .. (0kB)
[ivy:resolve] [SUCCESSFUL ] org.mockito#mockito-all;1.8.2!mockito-all.jar (2132ms)
[ivy:resolve] downloading http://repo1.maven.org/maven2/org/mortbay/jetty/jetty-servlet-tester/6.1.14/jetty-servlet-tester-6.1.14.jar ...
[ivy:resolve] ................ (8kB)
[ivy:resolve] .. (0kB)
[ivy:resolve] [SUCCESSFUL ] org.mortbay.jetty#jetty-servlet-tester;6.1.14!jetty-servlet-tester.jar (986ms)
[ivy:resolve] downloading /home/jenkins/.m2/repository/log4j/log4j/1.2.15/log4j-1.2.15.jar ...
[ivy:resolve] ....... (382kB)
[ivy:resolve] .. (0kB)
[ivy:resolve] [SUCCESSFUL ] log4j#log4j;1.2.15!log4j.jar (6ms)
[ivy:resolve] downloading /home/jenkins/.m2/repository/org/slf4j/slf4j-api/1.5.11/slf4j-api-1.5.11.jar ...
[ivy:resolve] .. (23kB)
[ivy:resolve] .. (0kB)
[ivy:resolve] [SUCCESSFUL ] org.slf4j#slf4j-api;1.5.11!slf4j-api.jar (1ms)
[ivy:resolve] downloading /home/jenkins/.m2/repository/org/slf4j/slf4j-log4j12/1.5.11/slf4j-log4j12-1.5.11.jar ...
[ivy:resolve] .. (9kB)
[ivy:resolve] .. (0kB)
[ivy:resolve] [SUCCESSFUL ] org.slf4j#slf4j-log4j12;1.5.11!slf4j-log4j12.jar (1ms)
ivy-retrieve-test:
compile-mapred-test:
[mkdir] Created dir: /home/jenkins/jenkins-slave/workspace/Hadoop-Mapreduce-trunk-Commit/trunk/hadoop-mapreduce-project/build/test/mapred/classes
[mkdir] Created dir: /home/jenkins/jenkins-slave/workspace/Hadoop-Mapreduce-trunk-Commit/trunk/hadoop-mapreduce-project/build/test/mapred/testjar
[mkdir] Created dir: /home/jenkins/jenkins-slave/workspace/Hadoop-Mapreduce-trunk-Commit/trunk/hadoop-mapreduce-project/build/test/mapred/testshell
[javac] Compiling 306 source files to /home/jenkins/jenkins-slave/workspace/Hadoop-Mapreduce-trunk-Commit/trunk/hadoop-mapreduce-project/build/test/mapred/classes
[javac] /home/jenkins/jenkins-slave/workspace/Hadoop-Mapreduce-trunk-Commit/trunk/hadoop-mapreduce-project/src/test/mapred/org/apache/hadoop/mapred/TestJobQueueClient.java:80: printJobQueueInfo(org.apache.hadoop.mapred.JobQueueInfo,java.io.Writer,java.lang.String) in org.apache.hadoop.mapred.JobQueueClient cannot be applied to (org.apache.hadoop.mapred.JobQueueInfo,java.io.StringWriter)
[javac] client.printJobQueueInfo(root, writer);
[javac] ^
[javac] Note: Some input files use or override a deprecated API.
[javac] Note: Recompile with -Xlint:deprecation for details.
[javac] 1 error
BUILD FAILED
/home/jenkins/jenkins-slave/workspace/Hadoop-Mapreduce-trunk-Commit/trunk/hadoop-mapreduce-project/build.xml:526: The following error occurred while executing this line:
/home/jenkins/jenkins-slave/workspace/Hadoop-Mapreduce-trunk-Commit/trunk/hadoop-mapreduce-project/build.xml:603: Compile failed; see the compiler error output for details.
Total time: 1 minute 29 seconds
Build step 'Execute shell' marked build as failure
Recording test results
Email was triggered for: Failure
Sending email for trigger: Failure
###################################################################################
############################## FAILED TESTS (if any) ##############################
All tests passed
Hadoop-Mapreduce-trunk-Commit - Build # 1453 - Still Failing
Posted by Apache Jenkins Server <je...@builds.apache.org>.
See https://builds.apache.org/job/Hadoop-Mapreduce-trunk-Commit/1453/
###################################################################################
########################## LAST 60 LINES OF THE CONSOLE ###########################
[...truncated 14598 lines...]
[exec] make[1]: Leaving directory `/home/jenkins/jenkins-slave/workspace/Hadoop-Mapreduce-trunk-Commit/trunk/hadoop-mapreduce-project/build/c++-build/Linux-i386-32/examples/pipes'
compile-c++-examples:
compile-examples:
ivy-resolve-test:
[ivy:resolve] downloading /home/jenkins/.m2/repository/org/apache/hadoop/hadoop-hdfs/0.24.0-SNAPSHOT/hadoop-hdfs-0.24.0-SNAPSHOT-tests.jar ...
[ivy:resolve] ................... (1134kB)
[ivy:resolve] [SUCCESSFUL ] org.apache.hadoop#hadoop-hdfs;0.24.0-SNAPSHOT!hadoop-hdfs.jar(tests) (4ms)
[ivy:resolve] downloading /home/jenkins/.m2/repository/junit/junit/4.8.1/junit-4.8.1.jar ...
[ivy:resolve] ..... (231kB)
[ivy:resolve] .. (0kB)
[ivy:resolve] [SUCCESSFUL ] junit#junit;4.8.1!junit.jar (4ms)
[ivy:resolve] downloading http://repo1.maven.org/maven2/org/mockito/mockito-all/1.8.2/mockito-all-1.8.2.jar ...
[ivy:resolve] ................................................................................................................................................................................................................................................................................................................................................................................................................................................................................................................................................................................................................................................................................................................................................................................................................................................................................................................................................................................................................................................................................................................................................................................................................................................................................................................................................................................................................................................................................................................................................................................................................................................................................................................................................................................................................................................................................................................................................................................................................................................................................................................................................................................................................................................................................................................................................................................................................................................................................................................... (1315kB)
[ivy:resolve] .. (0kB)
[ivy:resolve] [SUCCESSFUL ] org.mockito#mockito-all;1.8.2!mockito-all.jar (1615ms)
[ivy:resolve] downloading http://repo1.maven.org/maven2/org/mortbay/jetty/jetty-servlet-tester/6.1.14/jetty-servlet-tester-6.1.14.jar ...
[ivy:resolve] ................ (8kB)
[ivy:resolve] .. (0kB)
[ivy:resolve] [SUCCESSFUL ] org.mortbay.jetty#jetty-servlet-tester;6.1.14!jetty-servlet-tester.jar (985ms)
[ivy:resolve] downloading /home/jenkins/.m2/repository/log4j/log4j/1.2.15/log4j-1.2.15.jar ...
[ivy:resolve] ....... (382kB)
[ivy:resolve] .. (0kB)
[ivy:resolve] [SUCCESSFUL ] log4j#log4j;1.2.15!log4j.jar (6ms)
[ivy:resolve] downloading /home/jenkins/.m2/repository/org/slf4j/slf4j-api/1.5.11/slf4j-api-1.5.11.jar ...
[ivy:resolve] .. (23kB)
[ivy:resolve] .. (0kB)
[ivy:resolve] [SUCCESSFUL ] org.slf4j#slf4j-api;1.5.11!slf4j-api.jar (2ms)
[ivy:resolve] downloading /home/jenkins/.m2/repository/org/slf4j/slf4j-log4j12/1.5.11/slf4j-log4j12-1.5.11.jar ...
[ivy:resolve] .. (9kB)
[ivy:resolve] .. (0kB)
[ivy:resolve] [SUCCESSFUL ] org.slf4j#slf4j-log4j12;1.5.11!slf4j-log4j12.jar (1ms)
ivy-retrieve-test:
compile-mapred-test:
[mkdir] Created dir: /home/jenkins/jenkins-slave/workspace/Hadoop-Mapreduce-trunk-Commit/trunk/hadoop-mapreduce-project/build/test/mapred/classes
[mkdir] Created dir: /home/jenkins/jenkins-slave/workspace/Hadoop-Mapreduce-trunk-Commit/trunk/hadoop-mapreduce-project/build/test/mapred/testjar
[mkdir] Created dir: /home/jenkins/jenkins-slave/workspace/Hadoop-Mapreduce-trunk-Commit/trunk/hadoop-mapreduce-project/build/test/mapred/testshell
[javac] Compiling 304 source files to /home/jenkins/jenkins-slave/workspace/Hadoop-Mapreduce-trunk-Commit/trunk/hadoop-mapreduce-project/build/test/mapred/classes
[javac] /home/jenkins/jenkins-slave/workspace/Hadoop-Mapreduce-trunk-Commit/trunk/hadoop-mapreduce-project/src/test/mapred/org/apache/hadoop/mapred/TestJobQueueClient.java:80: printJobQueueInfo(org.apache.hadoop.mapred.JobQueueInfo,java.io.Writer,java.lang.String) in org.apache.hadoop.mapred.JobQueueClient cannot be applied to (org.apache.hadoop.mapred.JobQueueInfo,java.io.StringWriter)
[javac] client.printJobQueueInfo(root, writer);
[javac] ^
[javac] Note: Some input files use or override a deprecated API.
[javac] Note: Recompile with -Xlint:deprecation for details.
[javac] 1 error
BUILD FAILED
/home/jenkins/jenkins-slave/workspace/Hadoop-Mapreduce-trunk-Commit/trunk/hadoop-mapreduce-project/build.xml:526: The following error occurred while executing this line:
/home/jenkins/jenkins-slave/workspace/Hadoop-Mapreduce-trunk-Commit/trunk/hadoop-mapreduce-project/build.xml:603: Compile failed; see the compiler error output for details.
Total time: 1 minute 28 seconds
Build step 'Execute shell' marked build as failure
Recording test results
Updating MAPREDUCE-3557
Email was triggered for: Failure
Sending email for trigger: Failure
###################################################################################
############################## FAILED TESTS (if any) ##############################
All tests passed
Hadoop-Mapreduce-trunk-Commit - Build # 1452 - Still Failing
Posted by Apache Jenkins Server <je...@builds.apache.org>.
See https://builds.apache.org/job/Hadoop-Mapreduce-trunk-Commit/1452/
###################################################################################
########################## LAST 60 LINES OF THE CONSOLE ###########################
[...truncated 14669 lines...]
[javac] /home/jenkins/jenkins-slave/workspace/Hadoop-Mapreduce-trunk-Commit/trunk/hadoop-mapreduce-project/src/test/mapred/org/apache/hadoop/mapreduce/security/TestTokenCache.java:438: cannot find symbol
[javac] symbol : class HadoopArchives
[javac] location: class org.apache.hadoop.mapreduce.security.TestTokenCache
[javac] HadoopArchives har = new HadoopArchives(jConf);
[javac] ^
[javac] /home/jenkins/jenkins-slave/workspace/Hadoop-Mapreduce-trunk-Commit/trunk/hadoop-mapreduce-project/src/test/mapred/org/apache/hadoop/tools/TestHarFileSystem.java:177: cannot find symbol
[javac] symbol : class HadoopArchives
[javac] location: class org.apache.hadoop.tools.TestHarFileSystem
[javac] HadoopArchives har = new HadoopArchives(conf);
[javac] ^
[javac] /home/jenkins/jenkins-slave/workspace/Hadoop-Mapreduce-trunk-Commit/trunk/hadoop-mapreduce-project/src/test/mapred/org/apache/hadoop/tools/TestHarFileSystem.java:177: cannot find symbol
[javac] symbol : class HadoopArchives
[javac] location: class org.apache.hadoop.tools.TestHarFileSystem
[javac] HadoopArchives har = new HadoopArchives(conf);
[javac] ^
[javac] /home/jenkins/jenkins-slave/workspace/Hadoop-Mapreduce-trunk-Commit/trunk/hadoop-mapreduce-project/src/test/mapred/org/apache/hadoop/tools/TestHarFileSystem.java:257: cannot find symbol
[javac] symbol : class HadoopArchives
[javac] location: class org.apache.hadoop.tools.TestHarFileSystem
[javac] HadoopArchives har = new HadoopArchives(conf);
[javac] ^
[javac] /home/jenkins/jenkins-slave/workspace/Hadoop-Mapreduce-trunk-Commit/trunk/hadoop-mapreduce-project/src/test/mapred/org/apache/hadoop/tools/TestHarFileSystem.java:257: cannot find symbol
[javac] symbol : class HadoopArchives
[javac] location: class org.apache.hadoop.tools.TestHarFileSystem
[javac] HadoopArchives har = new HadoopArchives(conf);
[javac] ^
[javac] /home/jenkins/jenkins-slave/workspace/Hadoop-Mapreduce-trunk-Commit/trunk/hadoop-mapreduce-project/src/test/mapred/org/apache/hadoop/tools/TestHarFileSystem.java:375: cannot find symbol
[javac] symbol : class HadoopArchives
[javac] location: class org.apache.hadoop.tools.TestHarFileSystem
[javac] HadoopArchives har = new HadoopArchives(conf);
[javac] ^
[javac] /home/jenkins/jenkins-slave/workspace/Hadoop-Mapreduce-trunk-Commit/trunk/hadoop-mapreduce-project/src/test/mapred/org/apache/hadoop/tools/TestHarFileSystem.java:375: cannot find symbol
[javac] symbol : class HadoopArchives
[javac] location: class org.apache.hadoop.tools.TestHarFileSystem
[javac] HadoopArchives har = new HadoopArchives(conf);
[javac] ^
[javac] /home/jenkins/jenkins-slave/workspace/Hadoop-Mapreduce-trunk-Commit/trunk/hadoop-mapreduce-project/src/test/mapred/org/apache/hadoop/tools/TestHarFileSystem.java:409: cannot find symbol
[javac] symbol : class HadoopArchives
[javac] location: class org.apache.hadoop.tools.TestHarFileSystem
[javac] HadoopArchives har = new HadoopArchives(conf);
[javac] ^
[javac] /home/jenkins/jenkins-slave/workspace/Hadoop-Mapreduce-trunk-Commit/trunk/hadoop-mapreduce-project/src/test/mapred/org/apache/hadoop/tools/TestHarFileSystem.java:409: cannot find symbol
[javac] symbol : class HadoopArchives
[javac] location: class org.apache.hadoop.tools.TestHarFileSystem
[javac] HadoopArchives har = new HadoopArchives(conf);
[javac] ^
[javac] Note: Some input files use or override a deprecated API.
[javac] Note: Recompile with -Xlint:deprecation for details.
[javac] 16 errors
BUILD FAILED
/home/jenkins/jenkins-slave/workspace/Hadoop-Mapreduce-trunk-Commit/trunk/hadoop-mapreduce-project/build.xml:526: The following error occurred while executing this line:
/home/jenkins/jenkins-slave/workspace/Hadoop-Mapreduce-trunk-Commit/trunk/hadoop-mapreduce-project/build.xml:603: Compile failed; see the compiler error output for details.
Total time: 1 minute 27 seconds
Build step 'Execute shell' marked build as failure
Recording test results
Updating HDFS-2669
Email was triggered for: Failure
Sending email for trigger: Failure
###################################################################################
############################## FAILED TESTS (if any) ##############################
All tests passed
Hadoop-Mapreduce-trunk-Commit - Build # 1451 - Still Failing
Posted by Apache Jenkins Server <je...@builds.apache.org>.
See https://builds.apache.org/job/Hadoop-Mapreduce-trunk-Commit/1451/
###################################################################################
########################## LAST 60 LINES OF THE CONSOLE ###########################
[...truncated 14672 lines...]
[javac] /home/jenkins/jenkins-slave/workspace/Hadoop-Mapreduce-trunk-Commit/trunk/hadoop-mapreduce-project/src/test/mapred/org/apache/hadoop/mapreduce/security/TestTokenCache.java:438: cannot find symbol
[javac] symbol : class HadoopArchives
[javac] location: class org.apache.hadoop.mapreduce.security.TestTokenCache
[javac] HadoopArchives har = new HadoopArchives(jConf);
[javac] ^
[javac] /home/jenkins/jenkins-slave/workspace/Hadoop-Mapreduce-trunk-Commit/trunk/hadoop-mapreduce-project/src/test/mapred/org/apache/hadoop/tools/TestHarFileSystem.java:177: cannot find symbol
[javac] symbol : class HadoopArchives
[javac] location: class org.apache.hadoop.tools.TestHarFileSystem
[javac] HadoopArchives har = new HadoopArchives(conf);
[javac] ^
[javac] /home/jenkins/jenkins-slave/workspace/Hadoop-Mapreduce-trunk-Commit/trunk/hadoop-mapreduce-project/src/test/mapred/org/apache/hadoop/tools/TestHarFileSystem.java:177: cannot find symbol
[javac] symbol : class HadoopArchives
[javac] location: class org.apache.hadoop.tools.TestHarFileSystem
[javac] HadoopArchives har = new HadoopArchives(conf);
[javac] ^
[javac] /home/jenkins/jenkins-slave/workspace/Hadoop-Mapreduce-trunk-Commit/trunk/hadoop-mapreduce-project/src/test/mapred/org/apache/hadoop/tools/TestHarFileSystem.java:257: cannot find symbol
[javac] symbol : class HadoopArchives
[javac] location: class org.apache.hadoop.tools.TestHarFileSystem
[javac] HadoopArchives har = new HadoopArchives(conf);
[javac] ^
[javac] /home/jenkins/jenkins-slave/workspace/Hadoop-Mapreduce-trunk-Commit/trunk/hadoop-mapreduce-project/src/test/mapred/org/apache/hadoop/tools/TestHarFileSystem.java:257: cannot find symbol
[javac] symbol : class HadoopArchives
[javac] location: class org.apache.hadoop.tools.TestHarFileSystem
[javac] HadoopArchives har = new HadoopArchives(conf);
[javac] ^
[javac] /home/jenkins/jenkins-slave/workspace/Hadoop-Mapreduce-trunk-Commit/trunk/hadoop-mapreduce-project/src/test/mapred/org/apache/hadoop/tools/TestHarFileSystem.java:375: cannot find symbol
[javac] symbol : class HadoopArchives
[javac] location: class org.apache.hadoop.tools.TestHarFileSystem
[javac] HadoopArchives har = new HadoopArchives(conf);
[javac] ^
[javac] /home/jenkins/jenkins-slave/workspace/Hadoop-Mapreduce-trunk-Commit/trunk/hadoop-mapreduce-project/src/test/mapred/org/apache/hadoop/tools/TestHarFileSystem.java:375: cannot find symbol
[javac] symbol : class HadoopArchives
[javac] location: class org.apache.hadoop.tools.TestHarFileSystem
[javac] HadoopArchives har = new HadoopArchives(conf);
[javac] ^
[javac] /home/jenkins/jenkins-slave/workspace/Hadoop-Mapreduce-trunk-Commit/trunk/hadoop-mapreduce-project/src/test/mapred/org/apache/hadoop/tools/TestHarFileSystem.java:409: cannot find symbol
[javac] symbol : class HadoopArchives
[javac] location: class org.apache.hadoop.tools.TestHarFileSystem
[javac] HadoopArchives har = new HadoopArchives(conf);
[javac] ^
[javac] /home/jenkins/jenkins-slave/workspace/Hadoop-Mapreduce-trunk-Commit/trunk/hadoop-mapreduce-project/src/test/mapred/org/apache/hadoop/tools/TestHarFileSystem.java:409: cannot find symbol
[javac] symbol : class HadoopArchives
[javac] location: class org.apache.hadoop.tools.TestHarFileSystem
[javac] HadoopArchives har = new HadoopArchives(conf);
[javac] ^
[javac] Note: Some input files use or override a deprecated API.
[javac] Note: Recompile with -Xlint:deprecation for details.
[javac] 16 errors
BUILD FAILED
/home/jenkins/jenkins-slave/workspace/Hadoop-Mapreduce-trunk-Commit/trunk/hadoop-mapreduce-project/build.xml:526: The following error occurred while executing this line:
/home/jenkins/jenkins-slave/workspace/Hadoop-Mapreduce-trunk-Commit/trunk/hadoop-mapreduce-project/build.xml:603: Compile failed; see the compiler error output for details.
Total time: 1 minute 27 seconds
Build step 'Execute shell' marked build as failure
Recording test results
Updating HADOOP-7920
Email was triggered for: Failure
Sending email for trigger: Failure
###################################################################################
############################## FAILED TESTS (if any) ##############################
All tests passed
Hadoop-Mapreduce-trunk-Commit - Build # 1450 - Still Failing
Posted by Apache Jenkins Server <je...@builds.apache.org>.
See https://builds.apache.org/job/Hadoop-Mapreduce-trunk-Commit/1450/
###################################################################################
########################## LAST 60 LINES OF THE CONSOLE ###########################
[...truncated 14685 lines...]
[javac] symbol : class HadoopArchives
[javac] location: class org.apache.hadoop.mapreduce.security.TestTokenCache
[javac] HadoopArchives har = new HadoopArchives(jConf);
[javac] ^
[javac] /home/jenkins/jenkins-slave/workspace/Hadoop-Mapreduce-trunk-Commit/trunk/hadoop-mapreduce-project/src/test/mapred/org/apache/hadoop/tools/TestHarFileSystem.java:177: cannot find symbol
[javac] symbol : class HadoopArchives
[javac] location: class org.apache.hadoop.tools.TestHarFileSystem
[javac] HadoopArchives har = new HadoopArchives(conf);
[javac] ^
[javac] /home/jenkins/jenkins-slave/workspace/Hadoop-Mapreduce-trunk-Commit/trunk/hadoop-mapreduce-project/src/test/mapred/org/apache/hadoop/tools/TestHarFileSystem.java:177: cannot find symbol
[javac] symbol : class HadoopArchives
[javac] location: class org.apache.hadoop.tools.TestHarFileSystem
[javac] HadoopArchives har = new HadoopArchives(conf);
[javac] ^
[javac] /home/jenkins/jenkins-slave/workspace/Hadoop-Mapreduce-trunk-Commit/trunk/hadoop-mapreduce-project/src/test/mapred/org/apache/hadoop/tools/TestHarFileSystem.java:257: cannot find symbol
[javac] symbol : class HadoopArchives
[javac] location: class org.apache.hadoop.tools.TestHarFileSystem
[javac] HadoopArchives har = new HadoopArchives(conf);
[javac] ^
[javac] /home/jenkins/jenkins-slave/workspace/Hadoop-Mapreduce-trunk-Commit/trunk/hadoop-mapreduce-project/src/test/mapred/org/apache/hadoop/tools/TestHarFileSystem.java:257: cannot find symbol
[javac] symbol : class HadoopArchives
[javac] location: class org.apache.hadoop.tools.TestHarFileSystem
[javac] HadoopArchives har = new HadoopArchives(conf);
[javac] ^
[javac] /home/jenkins/jenkins-slave/workspace/Hadoop-Mapreduce-trunk-Commit/trunk/hadoop-mapreduce-project/src/test/mapred/org/apache/hadoop/tools/TestHarFileSystem.java:375: cannot find symbol
[javac] symbol : class HadoopArchives
[javac] location: class org.apache.hadoop.tools.TestHarFileSystem
[javac] HadoopArchives har = new HadoopArchives(conf);
[javac] ^
[javac] /home/jenkins/jenkins-slave/workspace/Hadoop-Mapreduce-trunk-Commit/trunk/hadoop-mapreduce-project/src/test/mapred/org/apache/hadoop/tools/TestHarFileSystem.java:375: cannot find symbol
[javac] symbol : class HadoopArchives
[javac] location: class org.apache.hadoop.tools.TestHarFileSystem
[javac] HadoopArchives har = new HadoopArchives(conf);
[javac] ^
[javac] /home/jenkins/jenkins-slave/workspace/Hadoop-Mapreduce-trunk-Commit/trunk/hadoop-mapreduce-project/src/test/mapred/org/apache/hadoop/tools/TestHarFileSystem.java:409: cannot find symbol
[javac] symbol : class HadoopArchives
[javac] location: class org.apache.hadoop.tools.TestHarFileSystem
[javac] HadoopArchives har = new HadoopArchives(conf);
[javac] ^
[javac] /home/jenkins/jenkins-slave/workspace/Hadoop-Mapreduce-trunk-Commit/trunk/hadoop-mapreduce-project/src/test/mapred/org/apache/hadoop/tools/TestHarFileSystem.java:409: cannot find symbol
[javac] symbol : class HadoopArchives
[javac] location: class org.apache.hadoop.tools.TestHarFileSystem
[javac] HadoopArchives har = new HadoopArchives(conf);
[javac] ^
[javac] Note: Some input files use or override a deprecated API.
[javac] Note: Recompile with -Xlint:deprecation for details.
[javac] 16 errors
BUILD FAILED
/home/jenkins/jenkins-slave/workspace/Hadoop-Mapreduce-trunk-Commit/trunk/hadoop-mapreduce-project/build.xml:526: The following error occurred while executing this line:
/home/jenkins/jenkins-slave/workspace/Hadoop-Mapreduce-trunk-Commit/trunk/hadoop-mapreduce-project/build.xml:603: Compile failed; see the compiler error output for details.
Total time: 1 minute 27 seconds
Build step 'Execute shell' marked build as failure
Recording test results
Updating HDFS-2676
Updating HDFS-2675
Email was triggered for: Failure
Sending email for trigger: Failure
###################################################################################
############################## FAILED TESTS (if any) ##############################
All tests passed
Hadoop-Mapreduce-trunk-Commit - Build # 1449 - Still Failing
Posted by Apache Jenkins Server <je...@builds.apache.org>.
See https://builds.apache.org/job/Hadoop-Mapreduce-trunk-Commit/1449/
###################################################################################
########################## LAST 60 LINES OF THE CONSOLE ###########################
[...truncated 14684 lines...]
[javac] /home/jenkins/jenkins-slave/workspace/Hadoop-Mapreduce-trunk-Commit/trunk/hadoop-mapreduce-project/src/test/mapred/org/apache/hadoop/mapreduce/security/TestTokenCache.java:438: cannot find symbol
[javac] symbol : class HadoopArchives
[javac] location: class org.apache.hadoop.mapreduce.security.TestTokenCache
[javac] HadoopArchives har = new HadoopArchives(jConf);
[javac] ^
[javac] /home/jenkins/jenkins-slave/workspace/Hadoop-Mapreduce-trunk-Commit/trunk/hadoop-mapreduce-project/src/test/mapred/org/apache/hadoop/tools/TestHarFileSystem.java:177: cannot find symbol
[javac] symbol : class HadoopArchives
[javac] location: class org.apache.hadoop.tools.TestHarFileSystem
[javac] HadoopArchives har = new HadoopArchives(conf);
[javac] ^
[javac] /home/jenkins/jenkins-slave/workspace/Hadoop-Mapreduce-trunk-Commit/trunk/hadoop-mapreduce-project/src/test/mapred/org/apache/hadoop/tools/TestHarFileSystem.java:177: cannot find symbol
[javac] symbol : class HadoopArchives
[javac] location: class org.apache.hadoop.tools.TestHarFileSystem
[javac] HadoopArchives har = new HadoopArchives(conf);
[javac] ^
[javac] /home/jenkins/jenkins-slave/workspace/Hadoop-Mapreduce-trunk-Commit/trunk/hadoop-mapreduce-project/src/test/mapred/org/apache/hadoop/tools/TestHarFileSystem.java:257: cannot find symbol
[javac] symbol : class HadoopArchives
[javac] location: class org.apache.hadoop.tools.TestHarFileSystem
[javac] HadoopArchives har = new HadoopArchives(conf);
[javac] ^
[javac] /home/jenkins/jenkins-slave/workspace/Hadoop-Mapreduce-trunk-Commit/trunk/hadoop-mapreduce-project/src/test/mapred/org/apache/hadoop/tools/TestHarFileSystem.java:257: cannot find symbol
[javac] symbol : class HadoopArchives
[javac] location: class org.apache.hadoop.tools.TestHarFileSystem
[javac] HadoopArchives har = new HadoopArchives(conf);
[javac] ^
[javac] /home/jenkins/jenkins-slave/workspace/Hadoop-Mapreduce-trunk-Commit/trunk/hadoop-mapreduce-project/src/test/mapred/org/apache/hadoop/tools/TestHarFileSystem.java:375: cannot find symbol
[javac] symbol : class HadoopArchives
[javac] location: class org.apache.hadoop.tools.TestHarFileSystem
[javac] HadoopArchives har = new HadoopArchives(conf);
[javac] ^
[javac] /home/jenkins/jenkins-slave/workspace/Hadoop-Mapreduce-trunk-Commit/trunk/hadoop-mapreduce-project/src/test/mapred/org/apache/hadoop/tools/TestHarFileSystem.java:375: cannot find symbol
[javac] symbol : class HadoopArchives
[javac] location: class org.apache.hadoop.tools.TestHarFileSystem
[javac] HadoopArchives har = new HadoopArchives(conf);
[javac] ^
[javac] /home/jenkins/jenkins-slave/workspace/Hadoop-Mapreduce-trunk-Commit/trunk/hadoop-mapreduce-project/src/test/mapred/org/apache/hadoop/tools/TestHarFileSystem.java:409: cannot find symbol
[javac] symbol : class HadoopArchives
[javac] location: class org.apache.hadoop.tools.TestHarFileSystem
[javac] HadoopArchives har = new HadoopArchives(conf);
[javac] ^
[javac] /home/jenkins/jenkins-slave/workspace/Hadoop-Mapreduce-trunk-Commit/trunk/hadoop-mapreduce-project/src/test/mapred/org/apache/hadoop/tools/TestHarFileSystem.java:409: cannot find symbol
[javac] symbol : class HadoopArchives
[javac] location: class org.apache.hadoop.tools.TestHarFileSystem
[javac] HadoopArchives har = new HadoopArchives(conf);
[javac] ^
[javac] Note: Some input files use or override a deprecated API.
[javac] Note: Recompile with -Xlint:deprecation for details.
[javac] 16 errors
BUILD FAILED
/home/jenkins/jenkins-slave/workspace/Hadoop-Mapreduce-trunk-Commit/trunk/hadoop-mapreduce-project/build.xml:526: The following error occurred while executing this line:
/home/jenkins/jenkins-slave/workspace/Hadoop-Mapreduce-trunk-Commit/trunk/hadoop-mapreduce-project/build.xml:603: Compile failed; see the compiler error output for details.
Total time: 1 minute 30 seconds
Build step 'Execute shell' marked build as failure
Recording test results
Updating MAPREDUCE-3545
Email was triggered for: Failure
Sending email for trigger: Failure
###################################################################################
############################## FAILED TESTS (if any) ##############################
All tests passed
Hadoop-Mapreduce-trunk-Commit - Build # 1448 - Still Failing
Posted by Apache Jenkins Server <je...@builds.apache.org>.
See https://builds.apache.org/job/Hadoop-Mapreduce-trunk-Commit/1448/
###################################################################################
########################## LAST 60 LINES OF THE CONSOLE ###########################
[...truncated 14692 lines...]
[javac] /home/jenkins/jenkins-slave/workspace/Hadoop-Mapreduce-trunk-Commit/trunk/hadoop-mapreduce-project/src/test/mapred/org/apache/hadoop/mapreduce/security/TestTokenCache.java:438: cannot find symbol
[javac] symbol : class HadoopArchives
[javac] location: class org.apache.hadoop.mapreduce.security.TestTokenCache
[javac] HadoopArchives har = new HadoopArchives(jConf);
[javac] ^
[javac] /home/jenkins/jenkins-slave/workspace/Hadoop-Mapreduce-trunk-Commit/trunk/hadoop-mapreduce-project/src/test/mapred/org/apache/hadoop/tools/TestHarFileSystem.java:177: cannot find symbol
[javac] symbol : class HadoopArchives
[javac] location: class org.apache.hadoop.tools.TestHarFileSystem
[javac] HadoopArchives har = new HadoopArchives(conf);
[javac] ^
[javac] /home/jenkins/jenkins-slave/workspace/Hadoop-Mapreduce-trunk-Commit/trunk/hadoop-mapreduce-project/src/test/mapred/org/apache/hadoop/tools/TestHarFileSystem.java:177: cannot find symbol
[javac] symbol : class HadoopArchives
[javac] location: class org.apache.hadoop.tools.TestHarFileSystem
[javac] HadoopArchives har = new HadoopArchives(conf);
[javac] ^
[javac] /home/jenkins/jenkins-slave/workspace/Hadoop-Mapreduce-trunk-Commit/trunk/hadoop-mapreduce-project/src/test/mapred/org/apache/hadoop/tools/TestHarFileSystem.java:257: cannot find symbol
[javac] symbol : class HadoopArchives
[javac] location: class org.apache.hadoop.tools.TestHarFileSystem
[javac] HadoopArchives har = new HadoopArchives(conf);
[javac] ^
[javac] /home/jenkins/jenkins-slave/workspace/Hadoop-Mapreduce-trunk-Commit/trunk/hadoop-mapreduce-project/src/test/mapred/org/apache/hadoop/tools/TestHarFileSystem.java:257: cannot find symbol
[javac] symbol : class HadoopArchives
[javac] location: class org.apache.hadoop.tools.TestHarFileSystem
[javac] HadoopArchives har = new HadoopArchives(conf);
[javac] ^
[javac] /home/jenkins/jenkins-slave/workspace/Hadoop-Mapreduce-trunk-Commit/trunk/hadoop-mapreduce-project/src/test/mapred/org/apache/hadoop/tools/TestHarFileSystem.java:375: cannot find symbol
[javac] symbol : class HadoopArchives
[javac] location: class org.apache.hadoop.tools.TestHarFileSystem
[javac] HadoopArchives har = new HadoopArchives(conf);
[javac] ^
[javac] /home/jenkins/jenkins-slave/workspace/Hadoop-Mapreduce-trunk-Commit/trunk/hadoop-mapreduce-project/src/test/mapred/org/apache/hadoop/tools/TestHarFileSystem.java:375: cannot find symbol
[javac] symbol : class HadoopArchives
[javac] location: class org.apache.hadoop.tools.TestHarFileSystem
[javac] HadoopArchives har = new HadoopArchives(conf);
[javac] ^
[javac] /home/jenkins/jenkins-slave/workspace/Hadoop-Mapreduce-trunk-Commit/trunk/hadoop-mapreduce-project/src/test/mapred/org/apache/hadoop/tools/TestHarFileSystem.java:409: cannot find symbol
[javac] symbol : class HadoopArchives
[javac] location: class org.apache.hadoop.tools.TestHarFileSystem
[javac] HadoopArchives har = new HadoopArchives(conf);
[javac] ^
[javac] /home/jenkins/jenkins-slave/workspace/Hadoop-Mapreduce-trunk-Commit/trunk/hadoop-mapreduce-project/src/test/mapred/org/apache/hadoop/tools/TestHarFileSystem.java:409: cannot find symbol
[javac] symbol : class HadoopArchives
[javac] location: class org.apache.hadoop.tools.TestHarFileSystem
[javac] HadoopArchives har = new HadoopArchives(conf);
[javac] ^
[javac] Note: Some input files use or override a deprecated API.
[javac] Note: Recompile with -Xlint:deprecation for details.
[javac] 16 errors
BUILD FAILED
/home/jenkins/jenkins-slave/workspace/Hadoop-Mapreduce-trunk-Commit/trunk/hadoop-mapreduce-project/build.xml:526: The following error occurred while executing this line:
/home/jenkins/jenkins-slave/workspace/Hadoop-Mapreduce-trunk-Commit/trunk/hadoop-mapreduce-project/build.xml:603: Compile failed; see the compiler error output for details.
Total time: 1 minute 29 seconds
Build step 'Execute shell' marked build as failure
Recording test results
Updating HDFS-2649
Email was triggered for: Failure
Sending email for trigger: Failure
###################################################################################
############################## FAILED TESTS (if any) ##############################
All tests passed
Hadoop-Mapreduce-trunk-Commit - Build # 1447 - Still Failing
Posted by Apache Jenkins Server <je...@builds.apache.org>.
See https://builds.apache.org/job/Hadoop-Mapreduce-trunk-Commit/1447/
###################################################################################
########################## LAST 60 LINES OF THE CONSOLE ###########################
[...truncated 14690 lines...]
[javac] /home/jenkins/jenkins-slave/workspace/Hadoop-Mapreduce-trunk-Commit/trunk/hadoop-mapreduce-project/src/test/mapred/org/apache/hadoop/mapreduce/security/TestTokenCache.java:438: cannot find symbol
[javac] symbol : class HadoopArchives
[javac] location: class org.apache.hadoop.mapreduce.security.TestTokenCache
[javac] HadoopArchives har = new HadoopArchives(jConf);
[javac] ^
[javac] /home/jenkins/jenkins-slave/workspace/Hadoop-Mapreduce-trunk-Commit/trunk/hadoop-mapreduce-project/src/test/mapred/org/apache/hadoop/tools/TestHarFileSystem.java:177: cannot find symbol
[javac] symbol : class HadoopArchives
[javac] location: class org.apache.hadoop.tools.TestHarFileSystem
[javac] HadoopArchives har = new HadoopArchives(conf);
[javac] ^
[javac] /home/jenkins/jenkins-slave/workspace/Hadoop-Mapreduce-trunk-Commit/trunk/hadoop-mapreduce-project/src/test/mapred/org/apache/hadoop/tools/TestHarFileSystem.java:177: cannot find symbol
[javac] symbol : class HadoopArchives
[javac] location: class org.apache.hadoop.tools.TestHarFileSystem
[javac] HadoopArchives har = new HadoopArchives(conf);
[javac] ^
[javac] /home/jenkins/jenkins-slave/workspace/Hadoop-Mapreduce-trunk-Commit/trunk/hadoop-mapreduce-project/src/test/mapred/org/apache/hadoop/tools/TestHarFileSystem.java:257: cannot find symbol
[javac] symbol : class HadoopArchives
[javac] location: class org.apache.hadoop.tools.TestHarFileSystem
[javac] HadoopArchives har = new HadoopArchives(conf);
[javac] ^
[javac] /home/jenkins/jenkins-slave/workspace/Hadoop-Mapreduce-trunk-Commit/trunk/hadoop-mapreduce-project/src/test/mapred/org/apache/hadoop/tools/TestHarFileSystem.java:257: cannot find symbol
[javac] symbol : class HadoopArchives
[javac] location: class org.apache.hadoop.tools.TestHarFileSystem
[javac] HadoopArchives har = new HadoopArchives(conf);
[javac] ^
[javac] /home/jenkins/jenkins-slave/workspace/Hadoop-Mapreduce-trunk-Commit/trunk/hadoop-mapreduce-project/src/test/mapred/org/apache/hadoop/tools/TestHarFileSystem.java:375: cannot find symbol
[javac] symbol : class HadoopArchives
[javac] location: class org.apache.hadoop.tools.TestHarFileSystem
[javac] HadoopArchives har = new HadoopArchives(conf);
[javac] ^
[javac] /home/jenkins/jenkins-slave/workspace/Hadoop-Mapreduce-trunk-Commit/trunk/hadoop-mapreduce-project/src/test/mapred/org/apache/hadoop/tools/TestHarFileSystem.java:375: cannot find symbol
[javac] symbol : class HadoopArchives
[javac] location: class org.apache.hadoop.tools.TestHarFileSystem
[javac] HadoopArchives har = new HadoopArchives(conf);
[javac] ^
[javac] /home/jenkins/jenkins-slave/workspace/Hadoop-Mapreduce-trunk-Commit/trunk/hadoop-mapreduce-project/src/test/mapred/org/apache/hadoop/tools/TestHarFileSystem.java:409: cannot find symbol
[javac] symbol : class HadoopArchives
[javac] location: class org.apache.hadoop.tools.TestHarFileSystem
[javac] HadoopArchives har = new HadoopArchives(conf);
[javac] ^
[javac] /home/jenkins/jenkins-slave/workspace/Hadoop-Mapreduce-trunk-Commit/trunk/hadoop-mapreduce-project/src/test/mapred/org/apache/hadoop/tools/TestHarFileSystem.java:409: cannot find symbol
[javac] symbol : class HadoopArchives
[javac] location: class org.apache.hadoop.tools.TestHarFileSystem
[javac] HadoopArchives har = new HadoopArchives(conf);
[javac] ^
[javac] Note: Some input files use or override a deprecated API.
[javac] Note: Recompile with -Xlint:deprecation for details.
[javac] 16 errors
BUILD FAILED
/home/jenkins/jenkins-slave/workspace/Hadoop-Mapreduce-trunk-Commit/trunk/hadoop-mapreduce-project/build.xml:526: The following error occurred while executing this line:
/home/jenkins/jenkins-slave/workspace/Hadoop-Mapreduce-trunk-Commit/trunk/hadoop-mapreduce-project/build.xml:603: Compile failed; see the compiler error output for details.
Total time: 1 minute 29 seconds
Build step 'Execute shell' marked build as failure
Recording test results
Updating HDFS-2661
Email was triggered for: Failure
Sending email for trigger: Failure
###################################################################################
############################## FAILED TESTS (if any) ##############################
All tests passed
Hadoop-Mapreduce-trunk-Commit - Build # 1446 - Still Failing
Posted by Apache Jenkins Server <je...@builds.apache.org>.
See https://builds.apache.org/job/Hadoop-Mapreduce-trunk-Commit/1446/
###################################################################################
########################## LAST 60 LINES OF THE CONSOLE ###########################
[...truncated 14691 lines...]
[javac] /home/jenkins/jenkins-slave/workspace/Hadoop-Mapreduce-trunk-Commit/trunk/hadoop-mapreduce-project/src/test/mapred/org/apache/hadoop/mapreduce/security/TestTokenCache.java:438: cannot find symbol
[javac] symbol : class HadoopArchives
[javac] location: class org.apache.hadoop.mapreduce.security.TestTokenCache
[javac] HadoopArchives har = new HadoopArchives(jConf);
[javac] ^
[javac] /home/jenkins/jenkins-slave/workspace/Hadoop-Mapreduce-trunk-Commit/trunk/hadoop-mapreduce-project/src/test/mapred/org/apache/hadoop/tools/TestHarFileSystem.java:177: cannot find symbol
[javac] symbol : class HadoopArchives
[javac] location: class org.apache.hadoop.tools.TestHarFileSystem
[javac] HadoopArchives har = new HadoopArchives(conf);
[javac] ^
[javac] /home/jenkins/jenkins-slave/workspace/Hadoop-Mapreduce-trunk-Commit/trunk/hadoop-mapreduce-project/src/test/mapred/org/apache/hadoop/tools/TestHarFileSystem.java:177: cannot find symbol
[javac] symbol : class HadoopArchives
[javac] location: class org.apache.hadoop.tools.TestHarFileSystem
[javac] HadoopArchives har = new HadoopArchives(conf);
[javac] ^
[javac] /home/jenkins/jenkins-slave/workspace/Hadoop-Mapreduce-trunk-Commit/trunk/hadoop-mapreduce-project/src/test/mapred/org/apache/hadoop/tools/TestHarFileSystem.java:257: cannot find symbol
[javac] symbol : class HadoopArchives
[javac] location: class org.apache.hadoop.tools.TestHarFileSystem
[javac] HadoopArchives har = new HadoopArchives(conf);
[javac] ^
[javac] /home/jenkins/jenkins-slave/workspace/Hadoop-Mapreduce-trunk-Commit/trunk/hadoop-mapreduce-project/src/test/mapred/org/apache/hadoop/tools/TestHarFileSystem.java:257: cannot find symbol
[javac] symbol : class HadoopArchives
[javac] location: class org.apache.hadoop.tools.TestHarFileSystem
[javac] HadoopArchives har = new HadoopArchives(conf);
[javac] ^
[javac] /home/jenkins/jenkins-slave/workspace/Hadoop-Mapreduce-trunk-Commit/trunk/hadoop-mapreduce-project/src/test/mapred/org/apache/hadoop/tools/TestHarFileSystem.java:375: cannot find symbol
[javac] symbol : class HadoopArchives
[javac] location: class org.apache.hadoop.tools.TestHarFileSystem
[javac] HadoopArchives har = new HadoopArchives(conf);
[javac] ^
[javac] /home/jenkins/jenkins-slave/workspace/Hadoop-Mapreduce-trunk-Commit/trunk/hadoop-mapreduce-project/src/test/mapred/org/apache/hadoop/tools/TestHarFileSystem.java:375: cannot find symbol
[javac] symbol : class HadoopArchives
[javac] location: class org.apache.hadoop.tools.TestHarFileSystem
[javac] HadoopArchives har = new HadoopArchives(conf);
[javac] ^
[javac] /home/jenkins/jenkins-slave/workspace/Hadoop-Mapreduce-trunk-Commit/trunk/hadoop-mapreduce-project/src/test/mapred/org/apache/hadoop/tools/TestHarFileSystem.java:409: cannot find symbol
[javac] symbol : class HadoopArchives
[javac] location: class org.apache.hadoop.tools.TestHarFileSystem
[javac] HadoopArchives har = new HadoopArchives(conf);
[javac] ^
[javac] /home/jenkins/jenkins-slave/workspace/Hadoop-Mapreduce-trunk-Commit/trunk/hadoop-mapreduce-project/src/test/mapred/org/apache/hadoop/tools/TestHarFileSystem.java:409: cannot find symbol
[javac] symbol : class HadoopArchives
[javac] location: class org.apache.hadoop.tools.TestHarFileSystem
[javac] HadoopArchives har = new HadoopArchives(conf);
[javac] ^
[javac] Note: Some input files use or override a deprecated API.
[javac] Note: Recompile with -Xlint:deprecation for details.
[javac] 16 errors
BUILD FAILED
/home/jenkins/jenkins-slave/workspace/Hadoop-Mapreduce-trunk-Commit/trunk/hadoop-mapreduce-project/build.xml:526: The following error occurred while executing this line:
/home/jenkins/jenkins-slave/workspace/Hadoop-Mapreduce-trunk-Commit/trunk/hadoop-mapreduce-project/build.xml:603: Compile failed; see the compiler error output for details.
Total time: 1 minute 27 seconds
Build step 'Execute shell' marked build as failure
Recording test results
Updating HDFS-2545
Email was triggered for: Failure
Sending email for trigger: Failure
###################################################################################
############################## FAILED TESTS (if any) ##############################
All tests passed
Hadoop-Mapreduce-trunk-Commit - Build # 1445 - Still Failing
Posted by Apache Jenkins Server <je...@builds.apache.org>.
See https://builds.apache.org/job/Hadoop-Mapreduce-trunk-Commit/1445/
###################################################################################
########################## LAST 60 LINES OF THE CONSOLE ###########################
[...truncated 14688 lines...]
[javac] /home/jenkins/jenkins-slave/workspace/Hadoop-Mapreduce-trunk-Commit/trunk/hadoop-mapreduce-project/src/test/mapred/org/apache/hadoop/mapreduce/security/TestTokenCache.java:438: cannot find symbol
[javac] symbol : class HadoopArchives
[javac] location: class org.apache.hadoop.mapreduce.security.TestTokenCache
[javac] HadoopArchives har = new HadoopArchives(jConf);
[javac] ^
[javac] /home/jenkins/jenkins-slave/workspace/Hadoop-Mapreduce-trunk-Commit/trunk/hadoop-mapreduce-project/src/test/mapred/org/apache/hadoop/tools/TestHarFileSystem.java:177: cannot find symbol
[javac] symbol : class HadoopArchives
[javac] location: class org.apache.hadoop.tools.TestHarFileSystem
[javac] HadoopArchives har = new HadoopArchives(conf);
[javac] ^
[javac] /home/jenkins/jenkins-slave/workspace/Hadoop-Mapreduce-trunk-Commit/trunk/hadoop-mapreduce-project/src/test/mapred/org/apache/hadoop/tools/TestHarFileSystem.java:177: cannot find symbol
[javac] symbol : class HadoopArchives
[javac] location: class org.apache.hadoop.tools.TestHarFileSystem
[javac] HadoopArchives har = new HadoopArchives(conf);
[javac] ^
[javac] /home/jenkins/jenkins-slave/workspace/Hadoop-Mapreduce-trunk-Commit/trunk/hadoop-mapreduce-project/src/test/mapred/org/apache/hadoop/tools/TestHarFileSystem.java:257: cannot find symbol
[javac] symbol : class HadoopArchives
[javac] location: class org.apache.hadoop.tools.TestHarFileSystem
[javac] HadoopArchives har = new HadoopArchives(conf);
[javac] ^
[javac] /home/jenkins/jenkins-slave/workspace/Hadoop-Mapreduce-trunk-Commit/trunk/hadoop-mapreduce-project/src/test/mapred/org/apache/hadoop/tools/TestHarFileSystem.java:257: cannot find symbol
[javac] symbol : class HadoopArchives
[javac] location: class org.apache.hadoop.tools.TestHarFileSystem
[javac] HadoopArchives har = new HadoopArchives(conf);
[javac] ^
[javac] /home/jenkins/jenkins-slave/workspace/Hadoop-Mapreduce-trunk-Commit/trunk/hadoop-mapreduce-project/src/test/mapred/org/apache/hadoop/tools/TestHarFileSystem.java:375: cannot find symbol
[javac] symbol : class HadoopArchives
[javac] location: class org.apache.hadoop.tools.TestHarFileSystem
[javac] HadoopArchives har = new HadoopArchives(conf);
[javac] ^
[javac] /home/jenkins/jenkins-slave/workspace/Hadoop-Mapreduce-trunk-Commit/trunk/hadoop-mapreduce-project/src/test/mapred/org/apache/hadoop/tools/TestHarFileSystem.java:375: cannot find symbol
[javac] symbol : class HadoopArchives
[javac] location: class org.apache.hadoop.tools.TestHarFileSystem
[javac] HadoopArchives har = new HadoopArchives(conf);
[javac] ^
[javac] /home/jenkins/jenkins-slave/workspace/Hadoop-Mapreduce-trunk-Commit/trunk/hadoop-mapreduce-project/src/test/mapred/org/apache/hadoop/tools/TestHarFileSystem.java:409: cannot find symbol
[javac] symbol : class HadoopArchives
[javac] location: class org.apache.hadoop.tools.TestHarFileSystem
[javac] HadoopArchives har = new HadoopArchives(conf);
[javac] ^
[javac] /home/jenkins/jenkins-slave/workspace/Hadoop-Mapreduce-trunk-Commit/trunk/hadoop-mapreduce-project/src/test/mapred/org/apache/hadoop/tools/TestHarFileSystem.java:409: cannot find symbol
[javac] symbol : class HadoopArchives
[javac] location: class org.apache.hadoop.tools.TestHarFileSystem
[javac] HadoopArchives har = new HadoopArchives(conf);
[javac] ^
[javac] Note: Some input files use or override a deprecated API.
[javac] Note: Recompile with -Xlint:deprecation for details.
[javac] 16 errors
BUILD FAILED
/home/jenkins/jenkins-slave/workspace/Hadoop-Mapreduce-trunk-Commit/trunk/hadoop-mapreduce-project/build.xml:526: The following error occurred while executing this line:
/home/jenkins/jenkins-slave/workspace/Hadoop-Mapreduce-trunk-Commit/trunk/hadoop-mapreduce-project/build.xml:603: Compile failed; see the compiler error output for details.
Total time: 1 minute 28 seconds
Build step 'Execute shell' marked build as failure
Recording test results
Updating MAPREDUCE-3544
Email was triggered for: Failure
Sending email for trigger: Failure
###################################################################################
############################## FAILED TESTS (if any) ##############################
All tests passed
Hadoop-Mapreduce-trunk-Commit - Build # 1444 - Still Failing
Posted by Apache Jenkins Server <je...@builds.apache.org>.
See https://builds.apache.org/job/Hadoop-Mapreduce-trunk-Commit/1444/
###################################################################################
########################## LAST 60 LINES OF THE CONSOLE ###########################
[...truncated 13912 lines...]
[javac] symbol : class HadoopArchives
[javac] location: class org.apache.hadoop.mapreduce.security.TestTokenCache
[javac] HadoopArchives har = new HadoopArchives(jConf);
[javac] ^
[javac] /home/jenkins/jenkins-slave/workspace/Hadoop-Mapreduce-trunk-Commit/trunk/hadoop-mapreduce-project/src/test/mapred/org/apache/hadoop/tools/TestHarFileSystem.java:177: cannot find symbol
[javac] symbol : class HadoopArchives
[javac] location: class org.apache.hadoop.tools.TestHarFileSystem
[javac] HadoopArchives har = new HadoopArchives(conf);
[javac] ^
[javac] /home/jenkins/jenkins-slave/workspace/Hadoop-Mapreduce-trunk-Commit/trunk/hadoop-mapreduce-project/src/test/mapred/org/apache/hadoop/tools/TestHarFileSystem.java:177: cannot find symbol
[javac] symbol : class HadoopArchives
[javac] location: class org.apache.hadoop.tools.TestHarFileSystem
[javac] HadoopArchives har = new HadoopArchives(conf);
[javac] ^
[javac] /home/jenkins/jenkins-slave/workspace/Hadoop-Mapreduce-trunk-Commit/trunk/hadoop-mapreduce-project/src/test/mapred/org/apache/hadoop/tools/TestHarFileSystem.java:257: cannot find symbol
[javac] symbol : class HadoopArchives
[javac] location: class org.apache.hadoop.tools.TestHarFileSystem
[javac] HadoopArchives har = new HadoopArchives(conf);
[javac] ^
[javac] /home/jenkins/jenkins-slave/workspace/Hadoop-Mapreduce-trunk-Commit/trunk/hadoop-mapreduce-project/src/test/mapred/org/apache/hadoop/tools/TestHarFileSystem.java:257: cannot find symbol
[javac] symbol : class HadoopArchives
[javac] location: class org.apache.hadoop.tools.TestHarFileSystem
[javac] HadoopArchives har = new HadoopArchives(conf);
[javac] ^
[javac] /home/jenkins/jenkins-slave/workspace/Hadoop-Mapreduce-trunk-Commit/trunk/hadoop-mapreduce-project/src/test/mapred/org/apache/hadoop/tools/TestHarFileSystem.java:375: cannot find symbol
[javac] symbol : class HadoopArchives
[javac] location: class org.apache.hadoop.tools.TestHarFileSystem
[javac] HadoopArchives har = new HadoopArchives(conf);
[javac] ^
[javac] /home/jenkins/jenkins-slave/workspace/Hadoop-Mapreduce-trunk-Commit/trunk/hadoop-mapreduce-project/src/test/mapred/org/apache/hadoop/tools/TestHarFileSystem.java:375: cannot find symbol
[javac] symbol : class HadoopArchives
[javac] location: class org.apache.hadoop.tools.TestHarFileSystem
[javac] HadoopArchives har = new HadoopArchives(conf);
[javac] ^
[javac] /home/jenkins/jenkins-slave/workspace/Hadoop-Mapreduce-trunk-Commit/trunk/hadoop-mapreduce-project/src/test/mapred/org/apache/hadoop/tools/TestHarFileSystem.java:409: cannot find symbol
[javac] symbol : class HadoopArchives
[javac] location: class org.apache.hadoop.tools.TestHarFileSystem
[javac] HadoopArchives har = new HadoopArchives(conf);
[javac] ^
[javac] /home/jenkins/jenkins-slave/workspace/Hadoop-Mapreduce-trunk-Commit/trunk/hadoop-mapreduce-project/src/test/mapred/org/apache/hadoop/tools/TestHarFileSystem.java:409: cannot find symbol
[javac] symbol : class HadoopArchives
[javac] location: class org.apache.hadoop.tools.TestHarFileSystem
[javac] HadoopArchives har = new HadoopArchives(conf);
[javac] ^
[javac] Note: Some input files use or override a deprecated API.
[javac] Note: Recompile with -Xlint:deprecation for details.
[javac] 16 errors
BUILD FAILED
/home/jenkins/jenkins-slave/workspace/Hadoop-Mapreduce-trunk-Commit/trunk/hadoop-mapreduce-project/build.xml:526: The following error occurred while executing this line:
/home/jenkins/jenkins-slave/workspace/Hadoop-Mapreduce-trunk-Commit/trunk/hadoop-mapreduce-project/build.xml:603: Compile failed; see the compiler error output for details.
Total time: 1 minute 31 seconds
Build step 'Execute shell' marked build as failure
Recording test results
Updating HDFS-2663
Updating MAPREDUCE-3426
Email was triggered for: Failure
Sending email for trigger: Failure
###################################################################################
############################## FAILED TESTS (if any) ##############################
All tests passed
Hadoop-Mapreduce-trunk-Commit - Build # 1443 - Still Failing
Posted by Apache Jenkins Server <je...@builds.apache.org>.
See https://builds.apache.org/job/Hadoop-Mapreduce-trunk-Commit/1443/
###################################################################################
########################## LAST 60 LINES OF THE CONSOLE ###########################
[...truncated 13911 lines...]
[javac] symbol : class HadoopArchives
[javac] location: class org.apache.hadoop.mapreduce.security.TestTokenCache
[javac] HadoopArchives har = new HadoopArchives(jConf);
[javac] ^
[javac] /home/jenkins/jenkins-slave/workspace/Hadoop-Mapreduce-trunk-Commit/trunk/hadoop-mapreduce-project/src/test/mapred/org/apache/hadoop/tools/TestHarFileSystem.java:177: cannot find symbol
[javac] symbol : class HadoopArchives
[javac] location: class org.apache.hadoop.tools.TestHarFileSystem
[javac] HadoopArchives har = new HadoopArchives(conf);
[javac] ^
[javac] /home/jenkins/jenkins-slave/workspace/Hadoop-Mapreduce-trunk-Commit/trunk/hadoop-mapreduce-project/src/test/mapred/org/apache/hadoop/tools/TestHarFileSystem.java:177: cannot find symbol
[javac] symbol : class HadoopArchives
[javac] location: class org.apache.hadoop.tools.TestHarFileSystem
[javac] HadoopArchives har = new HadoopArchives(conf);
[javac] ^
[javac] /home/jenkins/jenkins-slave/workspace/Hadoop-Mapreduce-trunk-Commit/trunk/hadoop-mapreduce-project/src/test/mapred/org/apache/hadoop/tools/TestHarFileSystem.java:257: cannot find symbol
[javac] symbol : class HadoopArchives
[javac] location: class org.apache.hadoop.tools.TestHarFileSystem
[javac] HadoopArchives har = new HadoopArchives(conf);
[javac] ^
[javac] /home/jenkins/jenkins-slave/workspace/Hadoop-Mapreduce-trunk-Commit/trunk/hadoop-mapreduce-project/src/test/mapred/org/apache/hadoop/tools/TestHarFileSystem.java:257: cannot find symbol
[javac] symbol : class HadoopArchives
[javac] location: class org.apache.hadoop.tools.TestHarFileSystem
[javac] HadoopArchives har = new HadoopArchives(conf);
[javac] ^
[javac] /home/jenkins/jenkins-slave/workspace/Hadoop-Mapreduce-trunk-Commit/trunk/hadoop-mapreduce-project/src/test/mapred/org/apache/hadoop/tools/TestHarFileSystem.java:375: cannot find symbol
[javac] symbol : class HadoopArchives
[javac] location: class org.apache.hadoop.tools.TestHarFileSystem
[javac] HadoopArchives har = new HadoopArchives(conf);
[javac] ^
[javac] /home/jenkins/jenkins-slave/workspace/Hadoop-Mapreduce-trunk-Commit/trunk/hadoop-mapreduce-project/src/test/mapred/org/apache/hadoop/tools/TestHarFileSystem.java:375: cannot find symbol
[javac] symbol : class HadoopArchives
[javac] location: class org.apache.hadoop.tools.TestHarFileSystem
[javac] HadoopArchives har = new HadoopArchives(conf);
[javac] ^
[javac] /home/jenkins/jenkins-slave/workspace/Hadoop-Mapreduce-trunk-Commit/trunk/hadoop-mapreduce-project/src/test/mapred/org/apache/hadoop/tools/TestHarFileSystem.java:409: cannot find symbol
[javac] symbol : class HadoopArchives
[javac] location: class org.apache.hadoop.tools.TestHarFileSystem
[javac] HadoopArchives har = new HadoopArchives(conf);
[javac] ^
[javac] /home/jenkins/jenkins-slave/workspace/Hadoop-Mapreduce-trunk-Commit/trunk/hadoop-mapreduce-project/src/test/mapred/org/apache/hadoop/tools/TestHarFileSystem.java:409: cannot find symbol
[javac] symbol : class HadoopArchives
[javac] location: class org.apache.hadoop.tools.TestHarFileSystem
[javac] HadoopArchives har = new HadoopArchives(conf);
[javac] ^
[javac] Note: Some input files use or override a deprecated API.
[javac] Note: Recompile with -Xlint:deprecation for details.
[javac] 16 errors
BUILD FAILED
/home/jenkins/jenkins-slave/workspace/Hadoop-Mapreduce-trunk-Commit/trunk/hadoop-mapreduce-project/build.xml:526: The following error occurred while executing this line:
/home/jenkins/jenkins-slave/workspace/Hadoop-Mapreduce-trunk-Commit/trunk/hadoop-mapreduce-project/build.xml:603: Compile failed; see the compiler error output for details.
Total time: 1 minute 31 seconds
Build step 'Execute shell' marked build as failure
Recording test results
Updating HDFS-2663
Updating HDFS-234
Email was triggered for: Failure
Sending email for trigger: Failure
###################################################################################
############################## FAILED TESTS (if any) ##############################
All tests passed
Hadoop-Mapreduce-trunk-Commit - Build # 1442 - Still Failing
Posted by Apache Jenkins Server <je...@builds.apache.org>.
See https://builds.apache.org/job/Hadoop-Mapreduce-trunk-Commit/1442/
###################################################################################
########################## LAST 60 LINES OF THE CONSOLE ###########################
[...truncated 19345 lines...]
[javac] /home/jenkins/jenkins-slave/workspace/Hadoop-Mapreduce-trunk-Commit/trunk/hadoop-mapreduce-project/src/test/mapred/org/apache/hadoop/mapreduce/security/TestTokenCache.java:438: cannot find symbol
[javac] symbol : class HadoopArchives
[javac] location: class org.apache.hadoop.mapreduce.security.TestTokenCache
[javac] HadoopArchives har = new HadoopArchives(jConf);
[javac] ^
[javac] /home/jenkins/jenkins-slave/workspace/Hadoop-Mapreduce-trunk-Commit/trunk/hadoop-mapreduce-project/src/test/mapred/org/apache/hadoop/tools/TestHarFileSystem.java:177: cannot find symbol
[javac] symbol : class HadoopArchives
[javac] location: class org.apache.hadoop.tools.TestHarFileSystem
[javac] HadoopArchives har = new HadoopArchives(conf);
[javac] ^
[javac] /home/jenkins/jenkins-slave/workspace/Hadoop-Mapreduce-trunk-Commit/trunk/hadoop-mapreduce-project/src/test/mapred/org/apache/hadoop/tools/TestHarFileSystem.java:177: cannot find symbol
[javac] symbol : class HadoopArchives
[javac] location: class org.apache.hadoop.tools.TestHarFileSystem
[javac] HadoopArchives har = new HadoopArchives(conf);
[javac] ^
[javac] /home/jenkins/jenkins-slave/workspace/Hadoop-Mapreduce-trunk-Commit/trunk/hadoop-mapreduce-project/src/test/mapred/org/apache/hadoop/tools/TestHarFileSystem.java:257: cannot find symbol
[javac] symbol : class HadoopArchives
[javac] location: class org.apache.hadoop.tools.TestHarFileSystem
[javac] HadoopArchives har = new HadoopArchives(conf);
[javac] ^
[javac] /home/jenkins/jenkins-slave/workspace/Hadoop-Mapreduce-trunk-Commit/trunk/hadoop-mapreduce-project/src/test/mapred/org/apache/hadoop/tools/TestHarFileSystem.java:257: cannot find symbol
[javac] symbol : class HadoopArchives
[javac] location: class org.apache.hadoop.tools.TestHarFileSystem
[javac] HadoopArchives har = new HadoopArchives(conf);
[javac] ^
[javac] /home/jenkins/jenkins-slave/workspace/Hadoop-Mapreduce-trunk-Commit/trunk/hadoop-mapreduce-project/src/test/mapred/org/apache/hadoop/tools/TestHarFileSystem.java:375: cannot find symbol
[javac] symbol : class HadoopArchives
[javac] location: class org.apache.hadoop.tools.TestHarFileSystem
[javac] HadoopArchives har = new HadoopArchives(conf);
[javac] ^
[javac] /home/jenkins/jenkins-slave/workspace/Hadoop-Mapreduce-trunk-Commit/trunk/hadoop-mapreduce-project/src/test/mapred/org/apache/hadoop/tools/TestHarFileSystem.java:375: cannot find symbol
[javac] symbol : class HadoopArchives
[javac] location: class org.apache.hadoop.tools.TestHarFileSystem
[javac] HadoopArchives har = new HadoopArchives(conf);
[javac] ^
[javac] /home/jenkins/jenkins-slave/workspace/Hadoop-Mapreduce-trunk-Commit/trunk/hadoop-mapreduce-project/src/test/mapred/org/apache/hadoop/tools/TestHarFileSystem.java:409: cannot find symbol
[javac] symbol : class HadoopArchives
[javac] location: class org.apache.hadoop.tools.TestHarFileSystem
[javac] HadoopArchives har = new HadoopArchives(conf);
[javac] ^
[javac] /home/jenkins/jenkins-slave/workspace/Hadoop-Mapreduce-trunk-Commit/trunk/hadoop-mapreduce-project/src/test/mapred/org/apache/hadoop/tools/TestHarFileSystem.java:409: cannot find symbol
[javac] symbol : class HadoopArchives
[javac] location: class org.apache.hadoop.tools.TestHarFileSystem
[javac] HadoopArchives har = new HadoopArchives(conf);
[javac] ^
[javac] Note: Some input files use or override a deprecated API.
[javac] Note: Recompile with -Xlint:deprecation for details.
[javac] 16 errors
BUILD FAILED
/home/jenkins/jenkins-slave/workspace/Hadoop-Mapreduce-trunk-Commit/trunk/hadoop-mapreduce-project/build.xml:526: The following error occurred while executing this line:
/home/jenkins/jenkins-slave/workspace/Hadoop-Mapreduce-trunk-Commit/trunk/hadoop-mapreduce-project/build.xml:603: Compile failed; see the compiler error output for details.
Total time: 1 minute 32 seconds
Build step 'Execute shell' marked build as failure
Recording test results
Updating MAPREDUCE-2863
Email was triggered for: Failure
Sending email for trigger: Failure
###################################################################################
############################## FAILED TESTS (if any) ##############################
All tests passed
Hadoop-Mapreduce-trunk-Commit - Build # 1441 - Still Failing
Posted by Apache Jenkins Server <je...@builds.apache.org>.
See https://builds.apache.org/job/Hadoop-Mapreduce-trunk-Commit/1441/
###################################################################################
########################## LAST 60 LINES OF THE CONSOLE ###########################
[...truncated 13714 lines...]
[javac] /home/jenkins/jenkins-slave/workspace/Hadoop-Mapreduce-trunk-Commit/trunk/hadoop-mapreduce-project/src/test/mapred/org/apache/hadoop/mapreduce/security/TestTokenCache.java:438: cannot find symbol
[javac] symbol : class HadoopArchives
[javac] location: class org.apache.hadoop.mapreduce.security.TestTokenCache
[javac] HadoopArchives har = new HadoopArchives(jConf);
[javac] ^
[javac] /home/jenkins/jenkins-slave/workspace/Hadoop-Mapreduce-trunk-Commit/trunk/hadoop-mapreduce-project/src/test/mapred/org/apache/hadoop/tools/TestHarFileSystem.java:177: cannot find symbol
[javac] symbol : class HadoopArchives
[javac] location: class org.apache.hadoop.tools.TestHarFileSystem
[javac] HadoopArchives har = new HadoopArchives(conf);
[javac] ^
[javac] /home/jenkins/jenkins-slave/workspace/Hadoop-Mapreduce-trunk-Commit/trunk/hadoop-mapreduce-project/src/test/mapred/org/apache/hadoop/tools/TestHarFileSystem.java:177: cannot find symbol
[javac] symbol : class HadoopArchives
[javac] location: class org.apache.hadoop.tools.TestHarFileSystem
[javac] HadoopArchives har = new HadoopArchives(conf);
[javac] ^
[javac] /home/jenkins/jenkins-slave/workspace/Hadoop-Mapreduce-trunk-Commit/trunk/hadoop-mapreduce-project/src/test/mapred/org/apache/hadoop/tools/TestHarFileSystem.java:257: cannot find symbol
[javac] symbol : class HadoopArchives
[javac] location: class org.apache.hadoop.tools.TestHarFileSystem
[javac] HadoopArchives har = new HadoopArchives(conf);
[javac] ^
[javac] /home/jenkins/jenkins-slave/workspace/Hadoop-Mapreduce-trunk-Commit/trunk/hadoop-mapreduce-project/src/test/mapred/org/apache/hadoop/tools/TestHarFileSystem.java:257: cannot find symbol
[javac] symbol : class HadoopArchives
[javac] location: class org.apache.hadoop.tools.TestHarFileSystem
[javac] HadoopArchives har = new HadoopArchives(conf);
[javac] ^
[javac] /home/jenkins/jenkins-slave/workspace/Hadoop-Mapreduce-trunk-Commit/trunk/hadoop-mapreduce-project/src/test/mapred/org/apache/hadoop/tools/TestHarFileSystem.java:375: cannot find symbol
[javac] symbol : class HadoopArchives
[javac] location: class org.apache.hadoop.tools.TestHarFileSystem
[javac] HadoopArchives har = new HadoopArchives(conf);
[javac] ^
[javac] /home/jenkins/jenkins-slave/workspace/Hadoop-Mapreduce-trunk-Commit/trunk/hadoop-mapreduce-project/src/test/mapred/org/apache/hadoop/tools/TestHarFileSystem.java:375: cannot find symbol
[javac] symbol : class HadoopArchives
[javac] location: class org.apache.hadoop.tools.TestHarFileSystem
[javac] HadoopArchives har = new HadoopArchives(conf);
[javac] ^
[javac] /home/jenkins/jenkins-slave/workspace/Hadoop-Mapreduce-trunk-Commit/trunk/hadoop-mapreduce-project/src/test/mapred/org/apache/hadoop/tools/TestHarFileSystem.java:409: cannot find symbol
[javac] symbol : class HadoopArchives
[javac] location: class org.apache.hadoop.tools.TestHarFileSystem
[javac] HadoopArchives har = new HadoopArchives(conf);
[javac] ^
[javac] /home/jenkins/jenkins-slave/workspace/Hadoop-Mapreduce-trunk-Commit/trunk/hadoop-mapreduce-project/src/test/mapred/org/apache/hadoop/tools/TestHarFileSystem.java:409: cannot find symbol
[javac] symbol : class HadoopArchives
[javac] location: class org.apache.hadoop.tools.TestHarFileSystem
[javac] HadoopArchives har = new HadoopArchives(conf);
[javac] ^
[javac] Note: Some input files use or override a deprecated API.
[javac] Note: Recompile with -Xlint:deprecation for details.
[javac] 16 errors
BUILD FAILED
/home/jenkins/jenkins-slave/workspace/Hadoop-Mapreduce-trunk-Commit/trunk/hadoop-mapreduce-project/build.xml:526: The following error occurred while executing this line:
/home/jenkins/jenkins-slave/workspace/Hadoop-Mapreduce-trunk-Commit/trunk/hadoop-mapreduce-project/build.xml:603: Compile failed; see the compiler error output for details.
Total time: 1 minute 33 seconds
Build step 'Execute shell' marked build as failure
Recording test results
Updating MAPREDUCE-3542
Email was triggered for: Failure
Sending email for trigger: Failure
###################################################################################
############################## FAILED TESTS (if any) ##############################
All tests passed
Hadoop-Mapreduce-trunk-Commit - Build # 1440 - Still Failing
Posted by Apache Jenkins Server <je...@builds.apache.org>.
See https://builds.apache.org/job/Hadoop-Mapreduce-trunk-Commit/1440/
###################################################################################
########################## LAST 60 LINES OF THE CONSOLE ###########################
[...truncated 14487 lines...]
[javac] /home/jenkins/jenkins-slave/workspace/Hadoop-Mapreduce-trunk-Commit/trunk/hadoop-mapreduce-project/src/test/mapred/org/apache/hadoop/mapreduce/security/TestTokenCache.java:438: cannot find symbol
[javac] symbol : class HadoopArchives
[javac] location: class org.apache.hadoop.mapreduce.security.TestTokenCache
[javac] HadoopArchives har = new HadoopArchives(jConf);
[javac] ^
[javac] /home/jenkins/jenkins-slave/workspace/Hadoop-Mapreduce-trunk-Commit/trunk/hadoop-mapreduce-project/src/test/mapred/org/apache/hadoop/tools/TestHarFileSystem.java:177: cannot find symbol
[javac] symbol : class HadoopArchives
[javac] location: class org.apache.hadoop.tools.TestHarFileSystem
[javac] HadoopArchives har = new HadoopArchives(conf);
[javac] ^
[javac] /home/jenkins/jenkins-slave/workspace/Hadoop-Mapreduce-trunk-Commit/trunk/hadoop-mapreduce-project/src/test/mapred/org/apache/hadoop/tools/TestHarFileSystem.java:177: cannot find symbol
[javac] symbol : class HadoopArchives
[javac] location: class org.apache.hadoop.tools.TestHarFileSystem
[javac] HadoopArchives har = new HadoopArchives(conf);
[javac] ^
[javac] /home/jenkins/jenkins-slave/workspace/Hadoop-Mapreduce-trunk-Commit/trunk/hadoop-mapreduce-project/src/test/mapred/org/apache/hadoop/tools/TestHarFileSystem.java:257: cannot find symbol
[javac] symbol : class HadoopArchives
[javac] location: class org.apache.hadoop.tools.TestHarFileSystem
[javac] HadoopArchives har = new HadoopArchives(conf);
[javac] ^
[javac] /home/jenkins/jenkins-slave/workspace/Hadoop-Mapreduce-trunk-Commit/trunk/hadoop-mapreduce-project/src/test/mapred/org/apache/hadoop/tools/TestHarFileSystem.java:257: cannot find symbol
[javac] symbol : class HadoopArchives
[javac] location: class org.apache.hadoop.tools.TestHarFileSystem
[javac] HadoopArchives har = new HadoopArchives(conf);
[javac] ^
[javac] /home/jenkins/jenkins-slave/workspace/Hadoop-Mapreduce-trunk-Commit/trunk/hadoop-mapreduce-project/src/test/mapred/org/apache/hadoop/tools/TestHarFileSystem.java:375: cannot find symbol
[javac] symbol : class HadoopArchives
[javac] location: class org.apache.hadoop.tools.TestHarFileSystem
[javac] HadoopArchives har = new HadoopArchives(conf);
[javac] ^
[javac] /home/jenkins/jenkins-slave/workspace/Hadoop-Mapreduce-trunk-Commit/trunk/hadoop-mapreduce-project/src/test/mapred/org/apache/hadoop/tools/TestHarFileSystem.java:375: cannot find symbol
[javac] symbol : class HadoopArchives
[javac] location: class org.apache.hadoop.tools.TestHarFileSystem
[javac] HadoopArchives har = new HadoopArchives(conf);
[javac] ^
[javac] /home/jenkins/jenkins-slave/workspace/Hadoop-Mapreduce-trunk-Commit/trunk/hadoop-mapreduce-project/src/test/mapred/org/apache/hadoop/tools/TestHarFileSystem.java:409: cannot find symbol
[javac] symbol : class HadoopArchives
[javac] location: class org.apache.hadoop.tools.TestHarFileSystem
[javac] HadoopArchives har = new HadoopArchives(conf);
[javac] ^
[javac] /home/jenkins/jenkins-slave/workspace/Hadoop-Mapreduce-trunk-Commit/trunk/hadoop-mapreduce-project/src/test/mapred/org/apache/hadoop/tools/TestHarFileSystem.java:409: cannot find symbol
[javac] symbol : class HadoopArchives
[javac] location: class org.apache.hadoop.tools.TestHarFileSystem
[javac] HadoopArchives har = new HadoopArchives(conf);
[javac] ^
[javac] Note: Some input files use or override a deprecated API.
[javac] Note: Recompile with -Xlint:deprecation for details.
[javac] 16 errors
BUILD FAILED
/home/jenkins/jenkins-slave/workspace/Hadoop-Mapreduce-trunk-Commit/trunk/hadoop-mapreduce-project/build.xml:526: The following error occurred while executing this line:
/home/jenkins/jenkins-slave/workspace/Hadoop-Mapreduce-trunk-Commit/trunk/hadoop-mapreduce-project/build.xml:603: Compile failed; see the compiler error output for details.
Total time: 1 minute 27 seconds
Build step 'Execute shell' marked build as failure
Recording test results
Updating HADOOP-7892
Email was triggered for: Failure
Sending email for trigger: Failure
###################################################################################
############################## FAILED TESTS (if any) ##############################
All tests passed
Hadoop-Mapreduce-trunk-Commit - Build # 1439 - Still Failing
Posted by Apache Jenkins Server <je...@builds.apache.org>.
See https://builds.apache.org/job/Hadoop-Mapreduce-trunk-Commit/1439/
###################################################################################
########################## LAST 60 LINES OF THE CONSOLE ###########################
[...truncated 14489 lines...]
[javac] /home/jenkins/jenkins-slave/workspace/Hadoop-Mapreduce-trunk-Commit/trunk/hadoop-mapreduce-project/src/test/mapred/org/apache/hadoop/mapreduce/security/TestTokenCache.java:438: cannot find symbol
[javac] symbol : class HadoopArchives
[javac] location: class org.apache.hadoop.mapreduce.security.TestTokenCache
[javac] HadoopArchives har = new HadoopArchives(jConf);
[javac] ^
[javac] /home/jenkins/jenkins-slave/workspace/Hadoop-Mapreduce-trunk-Commit/trunk/hadoop-mapreduce-project/src/test/mapred/org/apache/hadoop/tools/TestHarFileSystem.java:177: cannot find symbol
[javac] symbol : class HadoopArchives
[javac] location: class org.apache.hadoop.tools.TestHarFileSystem
[javac] HadoopArchives har = new HadoopArchives(conf);
[javac] ^
[javac] /home/jenkins/jenkins-slave/workspace/Hadoop-Mapreduce-trunk-Commit/trunk/hadoop-mapreduce-project/src/test/mapred/org/apache/hadoop/tools/TestHarFileSystem.java:177: cannot find symbol
[javac] symbol : class HadoopArchives
[javac] location: class org.apache.hadoop.tools.TestHarFileSystem
[javac] HadoopArchives har = new HadoopArchives(conf);
[javac] ^
[javac] /home/jenkins/jenkins-slave/workspace/Hadoop-Mapreduce-trunk-Commit/trunk/hadoop-mapreduce-project/src/test/mapred/org/apache/hadoop/tools/TestHarFileSystem.java:257: cannot find symbol
[javac] symbol : class HadoopArchives
[javac] location: class org.apache.hadoop.tools.TestHarFileSystem
[javac] HadoopArchives har = new HadoopArchives(conf);
[javac] ^
[javac] /home/jenkins/jenkins-slave/workspace/Hadoop-Mapreduce-trunk-Commit/trunk/hadoop-mapreduce-project/src/test/mapred/org/apache/hadoop/tools/TestHarFileSystem.java:257: cannot find symbol
[javac] symbol : class HadoopArchives
[javac] location: class org.apache.hadoop.tools.TestHarFileSystem
[javac] HadoopArchives har = new HadoopArchives(conf);
[javac] ^
[javac] /home/jenkins/jenkins-slave/workspace/Hadoop-Mapreduce-trunk-Commit/trunk/hadoop-mapreduce-project/src/test/mapred/org/apache/hadoop/tools/TestHarFileSystem.java:375: cannot find symbol
[javac] symbol : class HadoopArchives
[javac] location: class org.apache.hadoop.tools.TestHarFileSystem
[javac] HadoopArchives har = new HadoopArchives(conf);
[javac] ^
[javac] /home/jenkins/jenkins-slave/workspace/Hadoop-Mapreduce-trunk-Commit/trunk/hadoop-mapreduce-project/src/test/mapred/org/apache/hadoop/tools/TestHarFileSystem.java:375: cannot find symbol
[javac] symbol : class HadoopArchives
[javac] location: class org.apache.hadoop.tools.TestHarFileSystem
[javac] HadoopArchives har = new HadoopArchives(conf);
[javac] ^
[javac] /home/jenkins/jenkins-slave/workspace/Hadoop-Mapreduce-trunk-Commit/trunk/hadoop-mapreduce-project/src/test/mapred/org/apache/hadoop/tools/TestHarFileSystem.java:409: cannot find symbol
[javac] symbol : class HadoopArchives
[javac] location: class org.apache.hadoop.tools.TestHarFileSystem
[javac] HadoopArchives har = new HadoopArchives(conf);
[javac] ^
[javac] /home/jenkins/jenkins-slave/workspace/Hadoop-Mapreduce-trunk-Commit/trunk/hadoop-mapreduce-project/src/test/mapred/org/apache/hadoop/tools/TestHarFileSystem.java:409: cannot find symbol
[javac] symbol : class HadoopArchives
[javac] location: class org.apache.hadoop.tools.TestHarFileSystem
[javac] HadoopArchives har = new HadoopArchives(conf);
[javac] ^
[javac] Note: Some input files use or override a deprecated API.
[javac] Note: Recompile with -Xlint:deprecation for details.
[javac] 16 errors
BUILD FAILED
/home/jenkins/jenkins-slave/workspace/Hadoop-Mapreduce-trunk-Commit/trunk/hadoop-mapreduce-project/build.xml:526: The following error occurred while executing this line:
/home/jenkins/jenkins-slave/workspace/Hadoop-Mapreduce-trunk-Commit/trunk/hadoop-mapreduce-project/build.xml:603: Compile failed; see the compiler error output for details.
Total time: 1 minute 27 seconds
Build step 'Execute shell' marked build as failure
Recording test results
Updating HADOOP-7810
Email was triggered for: Failure
Sending email for trigger: Failure
###################################################################################
############################## FAILED TESTS (if any) ##############################
All tests passed
Hadoop-Mapreduce-trunk-Commit - Build # 1438 - Still Failing
Posted by Apache Jenkins Server <je...@builds.apache.org>.
See https://builds.apache.org/job/Hadoop-Mapreduce-trunk-Commit/1438/
###################################################################################
########################## LAST 60 LINES OF THE CONSOLE ###########################
[...truncated 12532 lines...]
[javac] /home/jenkins/jenkins-slave/workspace/Hadoop-Mapreduce-trunk-Commit/trunk/hadoop-mapreduce-project/src/test/mapred/org/apache/hadoop/mapreduce/security/TestTokenCache.java:438: cannot find symbol
[javac] symbol : class HadoopArchives
[javac] location: class org.apache.hadoop.mapreduce.security.TestTokenCache
[javac] HadoopArchives har = new HadoopArchives(jConf);
[javac] ^
[javac] /home/jenkins/jenkins-slave/workspace/Hadoop-Mapreduce-trunk-Commit/trunk/hadoop-mapreduce-project/src/test/mapred/org/apache/hadoop/tools/TestHarFileSystem.java:177: cannot find symbol
[javac] symbol : class HadoopArchives
[javac] location: class org.apache.hadoop.tools.TestHarFileSystem
[javac] HadoopArchives har = new HadoopArchives(conf);
[javac] ^
[javac] /home/jenkins/jenkins-slave/workspace/Hadoop-Mapreduce-trunk-Commit/trunk/hadoop-mapreduce-project/src/test/mapred/org/apache/hadoop/tools/TestHarFileSystem.java:177: cannot find symbol
[javac] symbol : class HadoopArchives
[javac] location: class org.apache.hadoop.tools.TestHarFileSystem
[javac] HadoopArchives har = new HadoopArchives(conf);
[javac] ^
[javac] /home/jenkins/jenkins-slave/workspace/Hadoop-Mapreduce-trunk-Commit/trunk/hadoop-mapreduce-project/src/test/mapred/org/apache/hadoop/tools/TestHarFileSystem.java:257: cannot find symbol
[javac] symbol : class HadoopArchives
[javac] location: class org.apache.hadoop.tools.TestHarFileSystem
[javac] HadoopArchives har = new HadoopArchives(conf);
[javac] ^
[javac] /home/jenkins/jenkins-slave/workspace/Hadoop-Mapreduce-trunk-Commit/trunk/hadoop-mapreduce-project/src/test/mapred/org/apache/hadoop/tools/TestHarFileSystem.java:257: cannot find symbol
[javac] symbol : class HadoopArchives
[javac] location: class org.apache.hadoop.tools.TestHarFileSystem
[javac] HadoopArchives har = new HadoopArchives(conf);
[javac] ^
[javac] /home/jenkins/jenkins-slave/workspace/Hadoop-Mapreduce-trunk-Commit/trunk/hadoop-mapreduce-project/src/test/mapred/org/apache/hadoop/tools/TestHarFileSystem.java:375: cannot find symbol
[javac] symbol : class HadoopArchives
[javac] location: class org.apache.hadoop.tools.TestHarFileSystem
[javac] HadoopArchives har = new HadoopArchives(conf);
[javac] ^
[javac] /home/jenkins/jenkins-slave/workspace/Hadoop-Mapreduce-trunk-Commit/trunk/hadoop-mapreduce-project/src/test/mapred/org/apache/hadoop/tools/TestHarFileSystem.java:375: cannot find symbol
[javac] symbol : class HadoopArchives
[javac] location: class org.apache.hadoop.tools.TestHarFileSystem
[javac] HadoopArchives har = new HadoopArchives(conf);
[javac] ^
[javac] /home/jenkins/jenkins-slave/workspace/Hadoop-Mapreduce-trunk-Commit/trunk/hadoop-mapreduce-project/src/test/mapred/org/apache/hadoop/tools/TestHarFileSystem.java:409: cannot find symbol
[javac] symbol : class HadoopArchives
[javac] location: class org.apache.hadoop.tools.TestHarFileSystem
[javac] HadoopArchives har = new HadoopArchives(conf);
[javac] ^
[javac] /home/jenkins/jenkins-slave/workspace/Hadoop-Mapreduce-trunk-Commit/trunk/hadoop-mapreduce-project/src/test/mapred/org/apache/hadoop/tools/TestHarFileSystem.java:409: cannot find symbol
[javac] symbol : class HadoopArchives
[javac] location: class org.apache.hadoop.tools.TestHarFileSystem
[javac] HadoopArchives har = new HadoopArchives(conf);
[javac] ^
[javac] Note: Some input files use or override a deprecated API.
[javac] Note: Recompile with -Xlint:deprecation for details.
[javac] 16 errors
BUILD FAILED
/home/jenkins/jenkins-slave/workspace/Hadoop-Mapreduce-trunk-Commit/trunk/hadoop-mapreduce-project/build.xml:526: The following error occurred while executing this line:
/home/jenkins/jenkins-slave/workspace/Hadoop-Mapreduce-trunk-Commit/trunk/hadoop-mapreduce-project/build.xml:603: Compile failed; see the compiler error output for details.
Total time: 1 minute 26 seconds
Build step 'Execute shell' marked build as failure
Recording test results
Updating HADOOP-7810
Email was triggered for: Failure
Sending email for trigger: Failure
###################################################################################
############################## FAILED TESTS (if any) ##############################
All tests passed
Re: Hadoop-Mapreduce-trunk-Commit - Build # 1437 - Still Failing
Posted by Mahadev Konar <ma...@hortonworks.com>.
Todd,
There is a jira for it.
https://issues.apache.org/jira/browse/MAPREDUCE-3541
Ravi will be posting a patch ASAP.
thanks
mahadev
On Tue, Dec 13, 2011 at 10:48 AM, Todd Lipcon <to...@cloudera.com> wrote:
> Is anyone working on this? Been failing a few days and my inbox is sad :(
>
> -Todd
>
> ---------- Forwarded message ----------
> From: Apache Jenkins Server <je...@builds.apache.org>
> Date: Tue, Dec 13, 2011 at 10:46 AM
> Subject: Hadoop-Mapreduce-trunk-Commit - Build # 1437 - Still Failing
> To: mapreduce-dev@hadoop.apache.org
>
>
> See https://builds.apache.org/job/Hadoop-Mapreduce-trunk-Commit/1437/
>
> ###################################################################################
> ########################## LAST 60 LINES OF THE CONSOLE
> ###########################
> [...truncated 14349 lines...]
> [exec] make[1]: Leaving directory
> `/home/jenkins/jenkins-slave/workspace/Hadoop-Mapreduce-trunk-Commit/trunk/hadoop-mapreduce-project/build/c++-build/Linux-i386-32/examples/pipes'
>
> compile-c++-examples:
>
> compile-examples:
>
> ivy-resolve-test:
> [ivy:resolve] downloading
> /home/jenkins/.m2/repository/org/apache/hadoop/hadoop-hdfs/0.24.0-SNAPSHOT/hadoop-hdfs-0.24.0-SNAPSHOT-tests.jar
> ...
> [ivy:resolve] ................... (1131kB)
> [ivy:resolve] [SUCCESSFUL ]
> org.apache.hadoop#hadoop-hdfs;0.24.0-SNAPSHOT!hadoop-hdfs.jar(tests)
> (4ms)
> [ivy:resolve] downloading
> /home/jenkins/.m2/repository/junit/junit/4.8.1/junit-4.8.1.jar ...
> [ivy:resolve] ..... (231kB)
> [ivy:resolve] .. (0kB)
> [ivy:resolve] [SUCCESSFUL ] junit#junit;4.8.1!junit.jar (4ms)
> [ivy:resolve] downloading
> http://repo1.maven.org/maven2/org/mockito/mockito-all/1.8.2/mockito-all-1.8.2.jar
> ...
> [ivy:resolve] ......................................................................................................................................................................................................................................................................................................................................................................................................................................................................................................................................................................................................................................................................................................................................................................................................................................................................................................................................................................................................................................................................................................................................................................................................................................................................................................................................................................................................................................................................................................................................................................................................................................................................................................................................................................................................................................................................................................................................................................................................................................................................................................................................................................................................................................................................................................................................................................................................................................................................................................................
> (1315kB)
> [ivy:resolve] .. (0kB)
> [ivy:resolve] [SUCCESSFUL ]
> org.mockito#mockito-all;1.8.2!mockito-all.jar (1609ms)
> [ivy:resolve] downloading
> http://repo1.maven.org/maven2/org/mortbay/jetty/jetty-servlet-tester/6.1.14/jetty-servlet-tester-6.1.14.jar
> ...
> [ivy:resolve] ................ (8kB)
> [ivy:resolve] .. (0kB)
> [ivy:resolve] [SUCCESSFUL ]
> org.mortbay.jetty#jetty-servlet-tester;6.1.14!jetty-servlet-tester.jar
> (987ms)
> [ivy:resolve] downloading
> /home/jenkins/.m2/repository/log4j/log4j/1.2.15/log4j-1.2.15.jar ...
> [ivy:resolve] ....... (382kB)
> [ivy:resolve] .. (0kB)
> [ivy:resolve] [SUCCESSFUL ] log4j#log4j;1.2.15!log4j.jar (6ms)
> [ivy:resolve] downloading
> /home/jenkins/.m2/repository/org/slf4j/slf4j-api/1.5.11/slf4j-api-1.5.11.jar
> ...
> [ivy:resolve] .. (23kB)
> [ivy:resolve] .. (0kB)
> [ivy:resolve] [SUCCESSFUL ] org.slf4j#slf4j-api;1.5.11!slf4j-api.jar (1ms)
> [ivy:resolve] downloading
> /home/jenkins/.m2/repository/org/slf4j/slf4j-log4j12/1.5.11/slf4j-log4j12-1.5.11.jar
> ...
> [ivy:resolve] .. (9kB)
> [ivy:resolve] .. (0kB)
> [ivy:resolve] [SUCCESSFUL ]
> org.slf4j#slf4j-log4j12;1.5.11!slf4j-log4j12.jar (1ms)
>
> ivy-retrieve-test:
>
> compile-mapred-test:
> [mkdir] Created dir:
> /home/jenkins/jenkins-slave/workspace/Hadoop-Mapreduce-trunk-Commit/trunk/hadoop-mapreduce-project/build/test/mapred/classes
> [mkdir] Created dir:
> /home/jenkins/jenkins-slave/workspace/Hadoop-Mapreduce-trunk-Commit/trunk/hadoop-mapreduce-project/build/test/mapred/testjar
> [mkdir] Created dir:
> /home/jenkins/jenkins-slave/workspace/Hadoop-Mapreduce-trunk-Commit/trunk/hadoop-mapreduce-project/build/test/mapred/testshell
> [javac] Compiling 306 source files to
> /home/jenkins/jenkins-slave/workspace/Hadoop-Mapreduce-trunk-Commit/trunk/hadoop-mapreduce-project/build/test/mapred/classes
> [javac] /home/jenkins/jenkins-slave/workspace/Hadoop-Mapreduce-trunk-Commit/trunk/hadoop-mapreduce-project/src/test/mapred/org/apache/hadoop/mapred/TestJobQueueClient.java:80:
> printJobQueueInfo(org.apache.hadoop.mapred.JobQueueInfo,java.io.Writer,java.lang.String)
> in org.apache.hadoop.mapred.JobQueueClient cannot be applied to
> (org.apache.hadoop.mapred.JobQueueInfo,java.io.StringWriter)
> [javac] client.printJobQueueInfo(root, writer);
> [javac] ^
> [javac] Note: Some input files use or override a deprecated API.
> [javac] Note: Recompile with -Xlint:deprecation for details.
> [javac] 1 error
>
> BUILD FAILED
> /home/jenkins/jenkins-slave/workspace/Hadoop-Mapreduce-trunk-Commit/trunk/hadoop-mapreduce-project/build.xml:526:
> The following error occurred while executing this line:
> /home/jenkins/jenkins-slave/workspace/Hadoop-Mapreduce-trunk-Commit/trunk/hadoop-mapreduce-project/build.xml:603:
> Compile failed; see the compiler error output for details.
>
> Total time: 1 minute 26 seconds
> Build step 'Execute shell' marked build as failure
> Recording test results
> Updating HDFS-2650
> Email was triggered for: Failure
> Sending email for trigger: Failure
>
>
>
> ###################################################################################
> ############################## FAILED TESTS (if any)
> ##############################
> All tests passed
>
>
> --
> Todd Lipcon
> Software Engineer, Cloudera
Fwd: Hadoop-Mapreduce-trunk-Commit - Build # 1437 - Still Failing
Posted by Todd Lipcon <to...@cloudera.com>.
Is anyone working on this? Been failing a few days and my inbox is sad :(
-Todd
---------- Forwarded message ----------
From: Apache Jenkins Server <je...@builds.apache.org>
Date: Tue, Dec 13, 2011 at 10:46 AM
Subject: Hadoop-Mapreduce-trunk-Commit - Build # 1437 - Still Failing
To: mapreduce-dev@hadoop.apache.org
See https://builds.apache.org/job/Hadoop-Mapreduce-trunk-Commit/1437/
###################################################################################
########################## LAST 60 LINES OF THE CONSOLE
###########################
[...truncated 14349 lines...]
[exec] make[1]: Leaving directory
`/home/jenkins/jenkins-slave/workspace/Hadoop-Mapreduce-trunk-Commit/trunk/hadoop-mapreduce-project/build/c++-build/Linux-i386-32/examples/pipes'
compile-c++-examples:
compile-examples:
ivy-resolve-test:
[ivy:resolve] downloading
/home/jenkins/.m2/repository/org/apache/hadoop/hadoop-hdfs/0.24.0-SNAPSHOT/hadoop-hdfs-0.24.0-SNAPSHOT-tests.jar
...
[ivy:resolve] ................... (1131kB)
[ivy:resolve] [SUCCESSFUL ]
org.apache.hadoop#hadoop-hdfs;0.24.0-SNAPSHOT!hadoop-hdfs.jar(tests)
(4ms)
[ivy:resolve] downloading
/home/jenkins/.m2/repository/junit/junit/4.8.1/junit-4.8.1.jar ...
[ivy:resolve] ..... (231kB)
[ivy:resolve] .. (0kB)
[ivy:resolve] [SUCCESSFUL ] junit#junit;4.8.1!junit.jar (4ms)
[ivy:resolve] downloading
http://repo1.maven.org/maven2/org/mockito/mockito-all/1.8.2/mockito-all-1.8.2.jar
...
[ivy:resolve] ......................................................................................................................................................................................................................................................................................................................................................................................................................................................................................................................................................................................................................................................................................................................................................................................................................................................................................................................................................................................................................................................................................................................................................................................................................................................................................................................................................................................................................................................................................................................................................................................................................................................................................................................................................................................................................................................................................................................................................................................................................................................................................................................................................................................................................................................................................................................................................................................................................................................................................................................
(1315kB)
[ivy:resolve] .. (0kB)
[ivy:resolve] [SUCCESSFUL ]
org.mockito#mockito-all;1.8.2!mockito-all.jar (1609ms)
[ivy:resolve] downloading
http://repo1.maven.org/maven2/org/mortbay/jetty/jetty-servlet-tester/6.1.14/jetty-servlet-tester-6.1.14.jar
...
[ivy:resolve] ................ (8kB)
[ivy:resolve] .. (0kB)
[ivy:resolve] [SUCCESSFUL ]
org.mortbay.jetty#jetty-servlet-tester;6.1.14!jetty-servlet-tester.jar
(987ms)
[ivy:resolve] downloading
/home/jenkins/.m2/repository/log4j/log4j/1.2.15/log4j-1.2.15.jar ...
[ivy:resolve] ....... (382kB)
[ivy:resolve] .. (0kB)
[ivy:resolve] [SUCCESSFUL ] log4j#log4j;1.2.15!log4j.jar (6ms)
[ivy:resolve] downloading
/home/jenkins/.m2/repository/org/slf4j/slf4j-api/1.5.11/slf4j-api-1.5.11.jar
...
[ivy:resolve] .. (23kB)
[ivy:resolve] .. (0kB)
[ivy:resolve] [SUCCESSFUL ] org.slf4j#slf4j-api;1.5.11!slf4j-api.jar (1ms)
[ivy:resolve] downloading
/home/jenkins/.m2/repository/org/slf4j/slf4j-log4j12/1.5.11/slf4j-log4j12-1.5.11.jar
...
[ivy:resolve] .. (9kB)
[ivy:resolve] .. (0kB)
[ivy:resolve] [SUCCESSFUL ]
org.slf4j#slf4j-log4j12;1.5.11!slf4j-log4j12.jar (1ms)
ivy-retrieve-test:
compile-mapred-test:
[mkdir] Created dir:
/home/jenkins/jenkins-slave/workspace/Hadoop-Mapreduce-trunk-Commit/trunk/hadoop-mapreduce-project/build/test/mapred/classes
[mkdir] Created dir:
/home/jenkins/jenkins-slave/workspace/Hadoop-Mapreduce-trunk-Commit/trunk/hadoop-mapreduce-project/build/test/mapred/testjar
[mkdir] Created dir:
/home/jenkins/jenkins-slave/workspace/Hadoop-Mapreduce-trunk-Commit/trunk/hadoop-mapreduce-project/build/test/mapred/testshell
[javac] Compiling 306 source files to
/home/jenkins/jenkins-slave/workspace/Hadoop-Mapreduce-trunk-Commit/trunk/hadoop-mapreduce-project/build/test/mapred/classes
[javac] /home/jenkins/jenkins-slave/workspace/Hadoop-Mapreduce-trunk-Commit/trunk/hadoop-mapreduce-project/src/test/mapred/org/apache/hadoop/mapred/TestJobQueueClient.java:80:
printJobQueueInfo(org.apache.hadoop.mapred.JobQueueInfo,java.io.Writer,java.lang.String)
in org.apache.hadoop.mapred.JobQueueClient cannot be applied to
(org.apache.hadoop.mapred.JobQueueInfo,java.io.StringWriter)
[javac] client.printJobQueueInfo(root, writer);
[javac] ^
[javac] Note: Some input files use or override a deprecated API.
[javac] Note: Recompile with -Xlint:deprecation for details.
[javac] 1 error
BUILD FAILED
/home/jenkins/jenkins-slave/workspace/Hadoop-Mapreduce-trunk-Commit/trunk/hadoop-mapreduce-project/build.xml:526:
The following error occurred while executing this line:
/home/jenkins/jenkins-slave/workspace/Hadoop-Mapreduce-trunk-Commit/trunk/hadoop-mapreduce-project/build.xml:603:
Compile failed; see the compiler error output for details.
Total time: 1 minute 26 seconds
Build step 'Execute shell' marked build as failure
Recording test results
Updating HDFS-2650
Email was triggered for: Failure
Sending email for trigger: Failure
###################################################################################
############################## FAILED TESTS (if any)
##############################
All tests passed
--
Todd Lipcon
Software Engineer, Cloudera
Hadoop-Mapreduce-trunk-Commit - Build # 1437 - Still Failing
Posted by Apache Jenkins Server <je...@builds.apache.org>.
See https://builds.apache.org/job/Hadoop-Mapreduce-trunk-Commit/1437/
###################################################################################
########################## LAST 60 LINES OF THE CONSOLE ###########################
[...truncated 14349 lines...]
[exec] make[1]: Leaving directory `/home/jenkins/jenkins-slave/workspace/Hadoop-Mapreduce-trunk-Commit/trunk/hadoop-mapreduce-project/build/c++-build/Linux-i386-32/examples/pipes'
compile-c++-examples:
compile-examples:
ivy-resolve-test:
[ivy:resolve] downloading /home/jenkins/.m2/repository/org/apache/hadoop/hadoop-hdfs/0.24.0-SNAPSHOT/hadoop-hdfs-0.24.0-SNAPSHOT-tests.jar ...
[ivy:resolve] ................... (1131kB)
[ivy:resolve] [SUCCESSFUL ] org.apache.hadoop#hadoop-hdfs;0.24.0-SNAPSHOT!hadoop-hdfs.jar(tests) (4ms)
[ivy:resolve] downloading /home/jenkins/.m2/repository/junit/junit/4.8.1/junit-4.8.1.jar ...
[ivy:resolve] ..... (231kB)
[ivy:resolve] .. (0kB)
[ivy:resolve] [SUCCESSFUL ] junit#junit;4.8.1!junit.jar (4ms)
[ivy:resolve] downloading http://repo1.maven.org/maven2/org/mockito/mockito-all/1.8.2/mockito-all-1.8.2.jar ...
[ivy:resolve] ...................................................................................................................................................................................................................................................................................................................................................................................................................................................................................................................................................................................................................................................................................................................................................................................................................................................................................................................................................................................................................................................................................................................................................................................................................................................................................................................................................................................................................................................................................................................................................................................................................................................................................................................................................................................................................................................................................................................................................................................................................................................................................................................................................................................................................................................................................................................................................................................................................................................................................................................... (1315kB)
[ivy:resolve] .. (0kB)
[ivy:resolve] [SUCCESSFUL ] org.mockito#mockito-all;1.8.2!mockito-all.jar (1609ms)
[ivy:resolve] downloading http://repo1.maven.org/maven2/org/mortbay/jetty/jetty-servlet-tester/6.1.14/jetty-servlet-tester-6.1.14.jar ...
[ivy:resolve] ................ (8kB)
[ivy:resolve] .. (0kB)
[ivy:resolve] [SUCCESSFUL ] org.mortbay.jetty#jetty-servlet-tester;6.1.14!jetty-servlet-tester.jar (987ms)
[ivy:resolve] downloading /home/jenkins/.m2/repository/log4j/log4j/1.2.15/log4j-1.2.15.jar ...
[ivy:resolve] ....... (382kB)
[ivy:resolve] .. (0kB)
[ivy:resolve] [SUCCESSFUL ] log4j#log4j;1.2.15!log4j.jar (6ms)
[ivy:resolve] downloading /home/jenkins/.m2/repository/org/slf4j/slf4j-api/1.5.11/slf4j-api-1.5.11.jar ...
[ivy:resolve] .. (23kB)
[ivy:resolve] .. (0kB)
[ivy:resolve] [SUCCESSFUL ] org.slf4j#slf4j-api;1.5.11!slf4j-api.jar (1ms)
[ivy:resolve] downloading /home/jenkins/.m2/repository/org/slf4j/slf4j-log4j12/1.5.11/slf4j-log4j12-1.5.11.jar ...
[ivy:resolve] .. (9kB)
[ivy:resolve] .. (0kB)
[ivy:resolve] [SUCCESSFUL ] org.slf4j#slf4j-log4j12;1.5.11!slf4j-log4j12.jar (1ms)
ivy-retrieve-test:
compile-mapred-test:
[mkdir] Created dir: /home/jenkins/jenkins-slave/workspace/Hadoop-Mapreduce-trunk-Commit/trunk/hadoop-mapreduce-project/build/test/mapred/classes
[mkdir] Created dir: /home/jenkins/jenkins-slave/workspace/Hadoop-Mapreduce-trunk-Commit/trunk/hadoop-mapreduce-project/build/test/mapred/testjar
[mkdir] Created dir: /home/jenkins/jenkins-slave/workspace/Hadoop-Mapreduce-trunk-Commit/trunk/hadoop-mapreduce-project/build/test/mapred/testshell
[javac] Compiling 306 source files to /home/jenkins/jenkins-slave/workspace/Hadoop-Mapreduce-trunk-Commit/trunk/hadoop-mapreduce-project/build/test/mapred/classes
[javac] /home/jenkins/jenkins-slave/workspace/Hadoop-Mapreduce-trunk-Commit/trunk/hadoop-mapreduce-project/src/test/mapred/org/apache/hadoop/mapred/TestJobQueueClient.java:80: printJobQueueInfo(org.apache.hadoop.mapred.JobQueueInfo,java.io.Writer,java.lang.String) in org.apache.hadoop.mapred.JobQueueClient cannot be applied to (org.apache.hadoop.mapred.JobQueueInfo,java.io.StringWriter)
[javac] client.printJobQueueInfo(root, writer);
[javac] ^
[javac] Note: Some input files use or override a deprecated API.
[javac] Note: Recompile with -Xlint:deprecation for details.
[javac] 1 error
BUILD FAILED
/home/jenkins/jenkins-slave/workspace/Hadoop-Mapreduce-trunk-Commit/trunk/hadoop-mapreduce-project/build.xml:526: The following error occurred while executing this line:
/home/jenkins/jenkins-slave/workspace/Hadoop-Mapreduce-trunk-Commit/trunk/hadoop-mapreduce-project/build.xml:603: Compile failed; see the compiler error output for details.
Total time: 1 minute 26 seconds
Build step 'Execute shell' marked build as failure
Recording test results
Updating HDFS-2650
Email was triggered for: Failure
Sending email for trigger: Failure
###################################################################################
############################## FAILED TESTS (if any) ##############################
All tests passed
Hadoop-Mapreduce-trunk-Commit - Build # 1436 - Still Failing
Posted by Apache Jenkins Server <je...@builds.apache.org>.
See https://builds.apache.org/job/Hadoop-Mapreduce-trunk-Commit/1436/
###################################################################################
########################## LAST 60 LINES OF THE CONSOLE ###########################
[...truncated 13572 lines...]
[exec] make[1]: Leaving directory `/home/jenkins/jenkins-slave/workspace/Hadoop-Mapreduce-trunk-Commit/trunk/hadoop-mapreduce-project/build/c++-build/Linux-i386-32/examples/pipes'
compile-c++-examples:
compile-examples:
ivy-resolve-test:
[ivy:resolve] downloading /home/jenkins/.m2/repository/org/apache/hadoop/hadoop-hdfs/0.24.0-SNAPSHOT/hadoop-hdfs-0.24.0-SNAPSHOT-tests.jar ...
[ivy:resolve] ................... (1131kB)
[ivy:resolve] [SUCCESSFUL ] org.apache.hadoop#hadoop-hdfs;0.24.0-SNAPSHOT!hadoop-hdfs.jar(tests) (5ms)
[ivy:resolve] downloading /home/jenkins/.m2/repository/junit/junit/4.8.1/junit-4.8.1.jar ...
[ivy:resolve] ..... (231kB)
[ivy:resolve] .. (0kB)
[ivy:resolve] [SUCCESSFUL ] junit#junit;4.8.1!junit.jar (5ms)
[ivy:resolve] downloading http://repo1.maven.org/maven2/org/mockito/mockito-all/1.8.2/mockito-all-1.8.2.jar ...
[ivy:resolve] ................................................................................................................................................................................................................................................................................................................................................................................................................................................................................................................................................................................................................................................................................................................................................................................................................................................................................................................................................................................................................................................................................................................................................................................................................................................................................................................................................................................................................................................................................................................................................................................................................................................................................................................................................................................................................................................................................................................................................................................................................................................................................................................................................................................................................................................................................................................................................................................................................................................................................................................... (1315kB)
[ivy:resolve] .. (0kB)
[ivy:resolve] [SUCCESSFUL ] org.mockito#mockito-all;1.8.2!mockito-all.jar (1619ms)
[ivy:resolve] downloading http://repo1.maven.org/maven2/org/mortbay/jetty/jetty-servlet-tester/6.1.14/jetty-servlet-tester-6.1.14.jar ...
[ivy:resolve] ................ (8kB)
[ivy:resolve] .. (0kB)
[ivy:resolve] [SUCCESSFUL ] org.mortbay.jetty#jetty-servlet-tester;6.1.14!jetty-servlet-tester.jar (1109ms)
[ivy:resolve] downloading /home/jenkins/.m2/repository/log4j/log4j/1.2.15/log4j-1.2.15.jar ...
[ivy:resolve] ....... (382kB)
[ivy:resolve] .. (0kB)
[ivy:resolve] [SUCCESSFUL ] log4j#log4j;1.2.15!log4j.jar (7ms)
[ivy:resolve] downloading /home/jenkins/.m2/repository/org/slf4j/slf4j-api/1.5.11/slf4j-api-1.5.11.jar ...
[ivy:resolve] .. (23kB)
[ivy:resolve] .. (0kB)
[ivy:resolve] [SUCCESSFUL ] org.slf4j#slf4j-api;1.5.11!slf4j-api.jar (1ms)
[ivy:resolve] downloading /home/jenkins/.m2/repository/org/slf4j/slf4j-log4j12/1.5.11/slf4j-log4j12-1.5.11.jar ...
[ivy:resolve] .. (9kB)
[ivy:resolve] .. (0kB)
[ivy:resolve] [SUCCESSFUL ] org.slf4j#slf4j-log4j12;1.5.11!slf4j-log4j12.jar (1ms)
ivy-retrieve-test:
compile-mapred-test:
[mkdir] Created dir: /home/jenkins/jenkins-slave/workspace/Hadoop-Mapreduce-trunk-Commit/trunk/hadoop-mapreduce-project/build/test/mapred/classes
[mkdir] Created dir: /home/jenkins/jenkins-slave/workspace/Hadoop-Mapreduce-trunk-Commit/trunk/hadoop-mapreduce-project/build/test/mapred/testjar
[mkdir] Created dir: /home/jenkins/jenkins-slave/workspace/Hadoop-Mapreduce-trunk-Commit/trunk/hadoop-mapreduce-project/build/test/mapred/testshell
[javac] Compiling 306 source files to /home/jenkins/jenkins-slave/workspace/Hadoop-Mapreduce-trunk-Commit/trunk/hadoop-mapreduce-project/build/test/mapred/classes
[javac] /home/jenkins/jenkins-slave/workspace/Hadoop-Mapreduce-trunk-Commit/trunk/hadoop-mapreduce-project/src/test/mapred/org/apache/hadoop/mapred/TestJobQueueClient.java:80: printJobQueueInfo(org.apache.hadoop.mapred.JobQueueInfo,java.io.Writer,java.lang.String) in org.apache.hadoop.mapred.JobQueueClient cannot be applied to (org.apache.hadoop.mapred.JobQueueInfo,java.io.StringWriter)
[javac] client.printJobQueueInfo(root, writer);
[javac] ^
[javac] Note: Some input files use or override a deprecated API.
[javac] Note: Recompile with -Xlint:deprecation for details.
[javac] 1 error
BUILD FAILED
/home/jenkins/jenkins-slave/workspace/Hadoop-Mapreduce-trunk-Commit/trunk/hadoop-mapreduce-project/build.xml:526: The following error occurred while executing this line:
/home/jenkins/jenkins-slave/workspace/Hadoop-Mapreduce-trunk-Commit/trunk/hadoop-mapreduce-project/build.xml:603: Compile failed; see the compiler error output for details.
Total time: 1 minute 30 seconds
Build step 'Execute shell' marked build as failure
Recording test results
Updating HDFS-2666
Email was triggered for: Failure
Sending email for trigger: Failure
###################################################################################
############################## FAILED TESTS (if any) ##############################
All tests passed