You are viewing a plain text version of this content. The canonical link for it is here.
Posted to commits@beam.apache.org by Apache Jenkins Server <je...@builds.apache.org> on 2018/03/21 06:22:54 UTC

Build failed in Jenkins: beam_PerformanceTests_TFRecordIOIT #275

See <https://builds.apache.org/job/beam_PerformanceTests_TFRecordIOIT/275/display/redirect>

------------------------------------------
[...truncated 17.53 KB...]
--beam_sdk=java
--temp_dir=<https://builds.apache.org/job/beam_PerformanceTests_TFRecordIOIT/ws/>
--maven_binary=/home/jenkins/tools/maven/latest/bin/mvn
--beam_it_options=[--project=apache-beam-testing,--tempRoot=gs://temp-storage-for-perf-tests,--filenamePrefix=gs://temp-storage-for-perf-tests/beam_PerformanceTests_TFRecordIOIT/275/,--numberOfRecords=1000000]
--beam_prebuilt
--project=apache-beam-testing
--bigquery_table=beam_performance.tfrecordioit_pkb_results
--official
--dpb_log_level=INFO
--beam_it_profile=io-it
--benchmarks=beam_integration_benchmark
2018-03-21 06:02:45,015 18e82b4b MainThread WARNING  The key "flags" was not in the default config, but was in user overrides. This may indicate a typo.
2018-03-21 06:02:45,016 18e82b4b MainThread INFO     Initializing the edw service decoder
2018-03-21 06:02:45,132 18e82b4b MainThread beam_integration_benchmark(1/1) INFO     Provisioning resources for benchmark beam_integration_benchmark
2018-03-21 06:02:45,134 18e82b4b MainThread beam_integration_benchmark(1/1) INFO     Preparing benchmark beam_integration_benchmark
2018-03-21 06:02:45,134 18e82b4b MainThread beam_integration_benchmark(1/1) INFO     Running: git clone https://github.com/apache/beam.git
2018-03-21 06:02:53,412 18e82b4b MainThread beam_integration_benchmark(1/1) INFO     Running benchmark beam_integration_benchmark
2018-03-21 06:02:53,457 18e82b4b MainThread beam_integration_benchmark(1/1) INFO     Running: /home/jenkins/tools/maven/latest/bin/mvn -e verify -Dit.test=org.apache.beam.sdk.io.tfrecord.TFRecordIOIT -DskipITs=false -pl sdks/java/io/file-based-io-tests -Pio-it -Pdataflow-runner -Dfilesystem=gcs -DintegrationTestPipelineOptions=["--project=apache-beam-testing","--tempRoot=gs://temp-storage-for-perf-tests","--filenamePrefix=gs://temp-storage-for-perf-tests/beam_PerformanceTests_TFRecordIOIT/275/","--numberOfRecords=1000000","--runner=TestDataflowRunner"]
2018-03-21 06:22:53,478 18e82b4b Thread-2 ERROR    IssueCommand timed out after 1200 seconds. Killing command "/home/jenkins/tools/maven/latest/bin/mvn -e verify -Dit.test=org.apache.beam.sdk.io.tfrecord.TFRecordIOIT -DskipITs=false -pl sdks/java/io/file-based-io-tests -Pio-it -Pdataflow-runner -Dfilesystem=gcs -DintegrationTestPipelineOptions=["--project=apache-beam-testing","--tempRoot=gs://temp-storage-for-perf-tests","--filenamePrefix=gs://temp-storage-for-perf-tests/beam_PerformanceTests_TFRecordIOIT/275/","--numberOfRecords=1000000","--runner=TestDataflowRunner"]".
2018-03-21 06:22:53,516 18e82b4b MainThread beam_integration_benchmark(1/1) INFO     Ran: {/home/jenkins/tools/maven/latest/bin/mvn -e verify -Dit.test=org.apache.beam.sdk.io.tfrecord.TFRecordIOIT -DskipITs=false -pl sdks/java/io/file-based-io-tests -Pio-it -Pdataflow-runner -Dfilesystem=gcs -DintegrationTestPipelineOptions=["--project=apache-beam-testing","--tempRoot=gs://temp-storage-for-perf-tests","--filenamePrefix=gs://temp-storage-for-perf-tests/beam_PerformanceTests_TFRecordIOIT/275/","--numberOfRecords=1000000","--runner=TestDataflowRunner"]}  ReturnCode:-9
STDOUT: [INFO] Error stacktraces are turned on.
[INFO] Scanning for projects...
[WARNING] 
[WARNING] Some problems were encountered while building the effective model for org.apache.beam:beam-sdks-java-build-tools:jar:2.5.0-SNAPSHOT
[WARNING] 'dependencyManagement.dependencies.dependency.(groupId:artifactId:type:classifier)' must be unique: junit:junit:jar -> duplicate declaration of version ${junit.version} @ org.apache.beam:beam-parent:2.5.0-SNAPSHOT, <https://builds.apache.org/job/beam_PerformanceTests_TFRecordIOIT/ws/runs/18e82b4b/beam/pom.xml,> line 1445, column 19
[WARNING] 'dependencyManagement.dependencies.dependency.(groupId:artifactId:type:classifier)' must be unique: com.google.guava:guava-testlib:jar -> duplicate declaration of version ${guava.version} @ org.apache.beam:beam-parent:2.5.0-SNAPSHOT, <https://builds.apache.org/job/beam_PerformanceTests_TFRecordIOIT/ws/runs/18e82b4b/beam/pom.xml,> line 1459, column 19
[WARNING] 
[WARNING] Some problems were encountered while building the effective model for org.apache.beam:beam-runners-java-fn-execution:jar:2.5.0-SNAPSHOT
[WARNING] 'dependencies.dependency.(groupId:artifactId:type:classifier)' must be unique: org.apache.beam:beam-runners-core-construction-java:jar -> duplicate declaration of version (?) @ org.apache.beam:beam-runners-java-fn-execution:[unknown-version], <https://builds.apache.org/job/beam_PerformanceTests_TFRecordIOIT/ws/runs/18e82b4b/beam/runners/java-fn-execution/pom.xml,> line 66, column 17
[WARNING] 
[WARNING] Some problems were encountered while building the effective model for org.apache.beam:beam-parent:pom:2.5.0-SNAPSHOT
[WARNING] 'dependencyManagement.dependencies.dependency.(groupId:artifactId:type:classifier)' must be unique: junit:junit:jar -> duplicate declaration of version ${junit.version} @ line 1445, column 19
[WARNING] 'dependencyManagement.dependencies.dependency.(groupId:artifactId:type:classifier)' must be unique: com.google.guava:guava-testlib:jar -> duplicate declaration of version ${guava.version} @ line 1459, column 19
[WARNING] 
[WARNING] It is highly recommended to fix these problems because they threaten the stability of your build.
[WARNING] 
[WARNING] For this reason, future Maven versions might no longer support building such malformed projects.
[WARNING] 
[INFO] ------------------------------------------------------------------------
[INFO] Detecting the operating system and CPU architecture
[INFO] ------------------------------------------------------------------------
[INFO] os.detected.name: linux
[INFO] os.detected.arch: x86_64
[INFO] os.detected.version: 4.4
[INFO] os.detected.version.major: 4
[INFO] os.detected.version.minor: 4
[INFO] os.detected.release: ubuntu
[INFO] os.detected.release.version: 14.04
[INFO] os.detected.release.like.ubuntu: true
[INFO] os.detected.release.like.debian: true
[INFO] os.detected.classifier: linux-x86_64
[INFO] 
[INFO] ------------------------------------------------------------------------
[INFO] Building Apache Beam :: SDKs :: Java :: IO :: File-based-io-tests 2.5.0-SNAPSHOT
[INFO] ------------------------------------------------------------------------
Downloading from Nexus: http://repository.apache.org/snapshots/org/apache/beam/beam-sdks-java-core/2.5.0-SNAPSHOT/maven-metadata.xml
Downloaded from Nexus: http://repository.apache.org/snapshots/org/apache/beam/beam-sdks-java-core/2.5.0-SNAPSHOT/maven-metadata.xml (0 B at 0 B/s)
Downloading from Nexus: http://repository.apache.org/snapshots/org/apache/beam/beam-sdks-java-io-xml/2.5.0-SNAPSHOT/maven-metadata.xml
Progress (1): 1.7 kB                    Downloaded from Nexus: http://repository.apache.org/snapshots/org/apache/beam/beam-sdks-java-io-xml/2.5.0-SNAPSHOT/maven-metadata.xml (1.7 kB at 9.9 kB/s)
[INFO] 
[INFO] --- maven-enforcer-plugin:3.0.0-M1:enforce (enforce-maven-version) @ beam-sdks-java-io-file-based-io-tests ---
[INFO] 
[INFO] --- maven-enforcer-plugin:3.0.0-M1:enforce (enforce) @ beam-sdks-java-io-file-based-io-tests ---
[INFO] Adding ignore: module-info
[INFO] 
[INFO] --- maven-enforcer-plugin:3.0.0-M1:enforce (enforce-banned-dependencies) @ beam-sdks-java-io-file-based-io-tests ---
[INFO] 
[INFO] --- maven-remote-resources-plugin:1.5:process (process-resource-bundles) @ beam-sdks-java-io-file-based-io-tests ---
[INFO] 
[INFO] --- maven-resources-plugin:3.0.2:resources (default-resources) @ beam-sdks-java-io-file-based-io-tests ---
[INFO] Using 'UTF-8' encoding to copy filtered resources.
[INFO] skip non existing resourceDirectory <https://builds.apache.org/job/beam_PerformanceTests_TFRecordIOIT/ws/runs/18e82b4b/beam/sdks/java/io/file-based-io-tests/src/main/resources>
[INFO] Copying 3 resources
[INFO] 
[INFO] --- maven-compiler-plugin:3.7.0:compile (default-compile) @ beam-sdks-java-io-file-based-io-tests ---
[INFO] No sources to compile
[INFO] 
[INFO] --- maven-resources-plugin:3.0.2:testResources (default-testResources) @ beam-sdks-java-io-file-based-io-tests ---
[INFO] Using 'UTF-8' encoding to copy filtered resources.
[INFO] skip non existing resourceDirectory <https://builds.apache.org/job/beam_PerformanceTests_TFRecordIOIT/ws/runs/18e82b4b/beam/sdks/java/io/file-based-io-tests/src/test/resources>
[INFO] Copying 3 resources
[INFO] 
[INFO] --- maven-compiler-plugin:3.7.0:testCompile (default-testCompile) @ beam-sdks-java-io-file-based-io-tests ---
[INFO] Changes detected - recompiling the module!
[INFO] Compiling 5 source files to <https://builds.apache.org/job/beam_PerformanceTests_TFRecordIOIT/ws/runs/18e82b4b/beam/sdks/java/io/file-based-io-tests/target/test-classes>
[INFO] <https://builds.apache.org/job/beam_PerformanceTests_TFRecordIOIT/ws/runs/18e82b4b/beam/sdks/java/io/file-based-io-tests/src/test/java/org/apache/beam/sdk/io/text/TextIOIT.java>: Some input files use or override a deprecated API.
[INFO] <https://builds.apache.org/job/beam_PerformanceTests_TFRecordIOIT/ws/runs/18e82b4b/beam/sdks/java/io/file-based-io-tests/src/test/java/org/apache/beam/sdk/io/text/TextIOIT.java>: Recompile with -Xlint:deprecation for details.
[INFO] 
[INFO] --- maven-checkstyle-plugin:3.0.0:check (default) @ beam-sdks-java-io-file-based-io-tests ---
[INFO] Starting audit...
Audit done.
[INFO] 
[INFO] --- maven-surefire-plugin:2.20.1:test (default-test) @ beam-sdks-java-io-file-based-io-tests ---
[INFO] Tests are skipped.
[INFO] 
[INFO] --- build-helper-maven-plugin:3.0.0:regex-properties (render-artifact-id) @ beam-sdks-java-io-file-based-io-tests ---
[INFO] 
[INFO] --- maven-jar-plugin:3.0.2:jar (default-jar) @ beam-sdks-java-io-file-based-io-tests ---
[INFO] Building jar: <https://builds.apache.org/job/beam_PerformanceTests_TFRecordIOIT/ws/runs/18e82b4b/beam/sdks/java/io/file-based-io-tests/target/beam-sdks-java-io-file-based-io-tests-2.5.0-SNAPSHOT.jar>
[INFO] 
[INFO] --- maven-site-plugin:3.7:attach-descriptor (attach-descriptor) @ beam-sdks-java-io-file-based-io-tests ---
[INFO] Skipping because packaging 'jar' is not pom.
[INFO] 
[INFO] --- maven-jar-plugin:3.0.2:test-jar (default-test-jar) @ beam-sdks-java-io-file-based-io-tests ---
[INFO] Building jar: <https://builds.apache.org/job/beam_PerformanceTests_TFRecordIOIT/ws/runs/18e82b4b/beam/sdks/java/io/file-based-io-tests/target/beam-sdks-java-io-file-based-io-tests-2.5.0-SNAPSHOT-tests.jar>
[INFO] 
[INFO] --- maven-shade-plugin:3.1.0:shade (bundle-and-repackage) @ beam-sdks-java-io-file-based-io-tests ---
[INFO] Excluding com.google.code.findbugs:jsr305:jar:3.0.1 from the shaded jar.
[INFO] Excluding com.fasterxml.jackson.core:jackson-core:jar:2.8.9 from the shaded jar.
[INFO] Excluding com.fasterxml.jackson.core:jackson-annotations:jar:2.8.9 from the shaded jar.
[INFO] Excluding com.fasterxml.jackson.core:jackson-databind:jar:2.8.9 from the shaded jar.
[INFO] Excluding org.slf4j:slf4j-api:jar:1.7.25 from the shaded jar.
[INFO] Excluding joda-time:joda-time:jar:2.4 from the shaded jar.
[INFO] Excluding org.apache.beam:beam-runners-google-cloud-dataflow-java:jar:2.5.0-SNAPSHOT from the shaded jar.
[INFO] Excluding org.apache.beam:beam-sdks-java-extensions-google-cloud-platform-core:jar:2.5.0-SNAPSHOT from the shaded jar.
[INFO] Excluding com.google.cloud.bigdataoss:gcsio:jar:1.4.5 from the shaded jar.
[INFO] Excluding com.google.apis:google-api-services-cloudresourcemanager:jar:v1-rev6-1.22.0 from the shaded jar.
[INFO] Excluding com.google.api-client:google-api-client:jar:1.22.0 from the shaded jar.
[INFO] Excluding com.google.oauth-client:google-oauth-client:jar:1.22.0 from the shaded jar.
[INFO] Excluding com.google.http-client:google-http-client:jar:1.22.0 from the shaded jar.
[INFO] Excluding org.apache.httpcomponents:httpclient:jar:4.0.1 from the shaded jar.
[INFO] Excluding org.apache.httpcomponents:httpcore:jar:4.0.1 from the shaded jar.
[INFO] Excluding commons-codec:commons-codec:jar:1.3 from the shaded jar.
[INFO] Excluding com.google.http-client:google-http-client-jackson2:jar:1.22.0 from the shaded jar.
[INFO] Excluding com.google.apis:google-api-services-dataflow:jar:v1b3-rev221-1.22.0 from the shaded jar.
[INFO] Excluding com.google.apis:google-api-services-clouddebugger:jar:v2-rev8-1.22.0 from the shaded jar.
[INFO] Excluding com.google.apis:google-api-services-storage:jar:v1-rev71-1.22.0 from the shaded jar.
[INFO] Excluding com.google.auth:google-auth-library-credentials:jar:0.7.1 from the shaded jar.
[INFO] Excluding com.google.auth:google-auth-library-oauth2-http:jar:0.7.1 from the shaded jar.
[INFO] Excluding com.google.cloud.bigdataoss:util:jar:1.4.5 from the shaded jar.
[INFO] Excluding com.google.api-client:google-api-client-java6:jar:1.22.0 from the shaded jar.
[INFO] Excluding com.google.api-client:google-api-client-jackson2:jar:1.22.0 from the shaded jar.
[INFO] Excluding com.google.oauth-client:google-oauth-client-java6:jar:1.22.0 from the shaded jar.
[INFO] Excluding org.apache.beam:beam-sdks-java-io-google-cloud-platform:jar:2.5.0-SNAPSHOT from the shaded jar.
[INFO] Excluding org.apache.beam:beam-sdks-java-extensions-protobuf:jar:2.5.0-SNAPSHOT from the shaded jar.
[INFO] Excluding io.grpc:grpc-core:jar:1.2.0 from the shaded jar.
[INFO] Excluding com.google.errorprone:error_prone_annotations:jar:2.0.15 from the shaded jar.
[INFO] Excluding io.grpc:grpc-context:jar:1.2.0 from the shaded jar.
[INFO] Excluding com.google.instrumentation:instrumentation-api:jar:0.3.0 from the shaded jar.
[INFO] Excluding com.google.apis:google-api-services-bigquery:jar:v2-rev374-1.22.0 from the shaded jar.
[INFO] Excluding com.google.api:gax-grpc:jar:0.20.0 from the shaded jar.
[INFO] Excluding io.grpc:grpc-protobuf:jar:1.2.0 from the shaded jar.
[INFO] Excluding com.google.api:api-common:jar:1.0.0-rc2 from the shaded jar.
[INFO] Excluding com.google.auto.value:auto-value:jar:1.5.3 from the shaded jar.
[INFO] Excluding com.google.api:gax:jar:1.3.1 from the shaded jar.
[INFO] Excluding org.threeten:threetenbp:jar:1.3.3 from the shaded jar.
[INFO] Excluding com.google.cloud:google-cloud-core-grpc:jar:1.2.0 from the shaded jar.
[INFO] Excluding com.google.protobuf:protobuf-java-util:jar:3.2.0 from the shaded jar.
[INFO] Excluding com.google.code.gson:gson:jar:2.7 from the shaded jar.
[INFO] Excluding com.google.apis:google-api-services-pubsub:jar:v1-rev10-1.22.0 from the shaded jar.
[INFO] Excluding com.google.api.grpc:grpc-google-cloud-pubsub-v1:jar:0.1.18 from the shaded jar.
[INFO] Excluding com.google.api.grpc:proto-google-cloud-pubsub-v1:jar:0.1.18 from the shaded jar.
[INFO] Excluding com.google.api.grpc:proto-google-iam-v1:jar:0.1.18 from the shaded jar.
[INFO] Excluding com.google.cloud.datastore:datastore-v1-proto-client:jar:1.4.0 from the shaded jar.
[INFO] Excluding com.google.http-client:google-http-client-protobuf:jar:1.22.0 from the shaded jar.
[INFO] Excluding com.google.http-client:google-http-client-jackson:jar:1.22.0 from the shaded jar.
[INFO] Excluding com.google.cloud.datastore:datastore-v1-protos:jar:1.3.0 from the shaded jar.
[INFO] Excluding com.google.api.grpc:grpc-google-common-protos:jar:0.1.9 from the shaded jar.
[INFO] Excluding io.grpc:grpc-auth:jar:1.2.0 from the shaded jar.
[INFO] Excluding io.grpc:grpc-netty:jar:1.2.0 from the shaded jar.
[INFO] Excluding io.netty:netty-codec-http2:jar:4.1.8.Final from the shaded jar.
[INFO] Excluding io.netty:netty-codec-http:jar:4.1.8.Final from the shaded jar.
[INFO] Excluding io.netty:netty-handler-proxy:jar:4.1.8.Final from the shaded jar.
[INFO] Excluding io.netty:netty-codec-socks:jar:4.1.8.Final from the shaded jar.
[INFO] Excluding io.netty:netty-handler:jar:4.1.8.Final from the shaded jar.
[INFO] Excluding io.netty:netty-buffer:jar:4.1.8.Final from the shaded jar.
[INFO] Excluding io.netty:netty-common:jar:4.1.8.Final from the shaded jar.
[INFO] Excluding io.netty:netty-transport:jar:4.1.8.Final from the shaded jar.
[INFO] Excluding io.netty:netty-resolver:jar:4.1.8.Final from the shaded jar.
[INFO] Excluding io.netty:netty-codec:jar:4.1.8.Final from the shaded jar.
[INFO] Excluding io.grpc:grpc-stub:jar:1.2.0 from the shaded jar.
[INFO] Excluding io.grpc:grpc-all:jar:1.2.0 from the shaded jar.
[INFO] Excluding io.grpc:grpc-okhttp:jar:1.2.0 from the shaded jar.
[INFO] Excluding com.squareup.okhttp:okhttp:jar:2.5.0 from the shaded jar.
[INFO] Excluding com.squareup.okio:okio:jar:1.6.0 from the shaded jar.
[INFO] Excluding io.grpc:grpc-protobuf-lite:jar:1.2.0 from the shaded jar.
[INFO] Excluding io.grpc:grpc-protobuf-nano:jar:1.2.0 from the shaded jar.
[INFO] Excluding com.google.protobuf.nano:protobuf-javanano:jar:3.0.0-alpha-5 from the shaded jar.
[INFO] Excluding com.google.cloud:google-cloud-core:jar:1.0.2 from the shaded jar.
[INFO] Excluding org.json:json:jar:20160810 from the shaded jar.
[INFO] Excluding com.google.cloud:google-cloud-spanner:jar:0.20.0b-beta from the shaded jar.
[INFO] Excluding com.google.api.grpc:proto-google-cloud-spanner-v1:jar:0.1.11b from the shaded jar.
[INFO] Excluding com.google.api.grpc:proto-google-cloud-spanner-admin-instance-v1:jar:0.1.11 from the shaded jar.
[INFO] Excluding com.google.api.grpc:grpc-google-cloud-spanner-v1:jar:0.1.11b from the shaded jar.
[INFO] Excluding com.google.api.grpc:grpc-google-cloud-spanner-admin-database-v1:jar:0.1.11 from the shaded jar.
[INFO] Excluding com.google.api.grpc:grpc-google-cloud-spanner-admin-instance-v1:jar:0.1.11 from the shaded jar.
[INFO] Excluding com.google.api.grpc:grpc-google-longrunning-v1:jar:0.1.11 from the shaded jar.
[INFO] Excluding com.google.api.grpc:proto-google-longrunning-v1:jar:0.1.11 from the shaded jar.
[INFO] Excluding com.google.cloud.bigtable:bigtable-protos:jar:1.0.0-pre3 from the shaded jar.
[INFO] Excluding com.google.cloud.bigtable:bigtable-client-core:jar:1.0.0 from the shaded jar.
[INFO] Excluding commons-logging:commons-logging:jar:1.2 from the shaded jar.
[INFO] Excluding com.google.auth:google-auth-library-appengine:jar:0.7.0 from the shaded jar.
[INFO] Excluding io.opencensus:opencensus-contrib-grpc-util:jar:0.7.0 from the shaded jar.
[INFO] Excluding io.opencensus:opencensus-api:jar:0.7.0 from the shaded jar.
[INFO] Excluding io.dropwizard.metrics:metrics-core:jar:3.1.2 from the shaded jar.
[INFO] Excluding com.google.protobuf:protobuf-java:jar:3.2.0 from the shaded jar.
[INFO] Excluding io.netty:netty-tcnative-boringssl-static:jar:1.1.33.Fork26 from the shaded jar.
[INFO] Excluding com.google.api.grpc:proto-google-cloud-spanner-admin-database-v1:jar:0.1.9 from the shaded jar.
[INFO] Excluding com.google.api.grpc:proto-google-common-protos:jar:0.1.9 from the shaded jar.
[INFO] Replacing original artifact with shaded artifact.
[INFO] Replacing <https://builds.apache.org/job/beam_PerformanceTests_TFRecordIOIT/ws/runs/18e82b4b/beam/sdks/java/io/file-based-io-tests/target/beam-sdks-java-io-file-based-io-tests-2.5.0-SNAPSHOT.jar> with <https://builds.apache.org/job/beam_PerformanceTests_TFRecordIOIT/ws/runs/18e82b4b/beam/sdks/java/io/file-based-io-tests/target/beam-sdks-java-io-file-based-io-tests-2.5.0-SNAPSHOT-shaded.jar>
[INFO] Replacing original test artifact with shaded test artifact.
[INFO] Replacing <https://builds.apache.org/job/beam_PerformanceTests_TFRecordIOIT/ws/runs/18e82b4b/beam/sdks/java/io/file-based-io-tests/target/beam-sdks-java-io-file-based-io-tests-2.5.0-SNAPSHOT-tests.jar> with <https://builds.apache.org/job/beam_PerformanceTests_TFRecordIOIT/ws/runs/18e82b4b/beam/sdks/java/io/file-based-io-tests/target/beam-sdks-java-io-file-based-io-tests-2.5.0-SNAPSHOT-shaded-tests.jar>
[INFO] 
[INFO] --- maven-failsafe-plugin:2.20.1:integration-test (default) @ beam-sdks-java-io-file-based-io-tests ---
[INFO] Failsafe report directory: <https://builds.apache.org/job/beam_PerformanceTests_TFRecordIOIT/ws/runs/18e82b4b/beam/sdks/java/io/file-based-io-tests/target/failsafe-reports>
[INFO] parallel='all', perCoreThreadCount=true, threadCount=4, useUnlimitedThreads=false, threadCountSuites=0, threadCountClasses=0, threadCountMethods=0, parallelOptimized=true
[INFO] 
[INFO] -------------------------------------------------------
[INFO]  T E S T S
[INFO] -------------------------------------------------------

STDERR: 
2018-03-21 06:22:53,517 18e82b4b MainThread beam_integration_benchmark(1/1) ERROR    Error during benchmark beam_integration_benchmark
Traceback (most recent call last):
  File "<https://builds.apache.org/job/beam_PerformanceTests_TFRecordIOIT/ws/PerfKitBenchmarker/perfkitbenchmarker/pkb.py",> line 623, in RunBenchmark
    DoRunPhase(spec, collector, detailed_timer)
  File "<https://builds.apache.org/job/beam_PerformanceTests_TFRecordIOIT/ws/PerfKitBenchmarker/perfkitbenchmarker/pkb.py",> line 526, in DoRunPhase
    samples = spec.BenchmarkRun(spec)
  File "<https://builds.apache.org/job/beam_PerformanceTests_TFRecordIOIT/ws/PerfKitBenchmarker/perfkitbenchmarker/linux_benchmarks/beam_integration_benchmark.py",> line 159, in Run
    job_type=job_type)
  File "<https://builds.apache.org/job/beam_PerformanceTests_TFRecordIOIT/ws/PerfKitBenchmarker/perfkitbenchmarker/providers/gcp/gcp_dpb_dataflow.py",> line 90, in SubmitJob
    assert retcode == 0, "Integration Test Failed."
AssertionError: Integration Test Failed.
2018-03-21 06:22:53,518 18e82b4b MainThread beam_integration_benchmark(1/1) INFO     Cleaning up benchmark beam_integration_benchmark
2018-03-21 06:22:53,521 18e82b4b MainThread beam_integration_benchmark(1/1) ERROR    Exception running benchmark
Traceback (most recent call last):
  File "<https://builds.apache.org/job/beam_PerformanceTests_TFRecordIOIT/ws/PerfKitBenchmarker/perfkitbenchmarker/pkb.py",> line 733, in RunBenchmarkTask
    RunBenchmark(spec, collector)
  File "<https://builds.apache.org/job/beam_PerformanceTests_TFRecordIOIT/ws/PerfKitBenchmarker/perfkitbenchmarker/pkb.py",> line 623, in RunBenchmark
    DoRunPhase(spec, collector, detailed_timer)
  File "<https://builds.apache.org/job/beam_PerformanceTests_TFRecordIOIT/ws/PerfKitBenchmarker/perfkitbenchmarker/pkb.py",> line 526, in DoRunPhase
    samples = spec.BenchmarkRun(spec)
  File "<https://builds.apache.org/job/beam_PerformanceTests_TFRecordIOIT/ws/PerfKitBenchmarker/perfkitbenchmarker/linux_benchmarks/beam_integration_benchmark.py",> line 159, in Run
    job_type=job_type)
  File "<https://builds.apache.org/job/beam_PerformanceTests_TFRecordIOIT/ws/PerfKitBenchmarker/perfkitbenchmarker/providers/gcp/gcp_dpb_dataflow.py",> line 90, in SubmitJob
    assert retcode == 0, "Integration Test Failed."
AssertionError: Integration Test Failed.
2018-03-21 06:22:53,521 18e82b4b MainThread beam_integration_benchmark(1/1) ERROR    Benchmark 1/1 beam_integration_benchmark (UID: beam_integration_benchmark0) failed. Execution will continue.
2018-03-21 06:22:53,521 18e82b4b MainThread beam_integration_benchmark(1/1) INFO     Benchmark run statuses:
---------------------------------------------------------------------------------
Name                        UID                          Status  Failed Substatus
---------------------------------------------------------------------------------
beam_integration_benchmark  beam_integration_benchmark0  FAILED                  
---------------------------------------------------------------------------------
Success rate: 0.00% (0/1)
2018-03-21 06:22:53,521 18e82b4b MainThread beam_integration_benchmark(1/1) INFO     Complete logs can be found at: <https://builds.apache.org/job/beam_PerformanceTests_TFRecordIOIT/ws/runs/18e82b4b/pkb.log>
2018-03-21 06:22:53,521 18e82b4b MainThread beam_integration_benchmark(1/1) INFO     Completion statuses can be found at: <https://builds.apache.org/job/beam_PerformanceTests_TFRecordIOIT/ws/runs/18e82b4b/completion_statuses.json>
Build step 'Execute shell' marked build as failure

Jenkins build is back to normal : beam_PerformanceTests_TFRecordIOIT #277

Posted by Apache Jenkins Server <je...@builds.apache.org>.
See <https://builds.apache.org/job/beam_PerformanceTests_TFRecordIOIT/277/display/redirect?page=changes>


Build failed in Jenkins: beam_PerformanceTests_TFRecordIOIT #276

Posted by Apache Jenkins Server <je...@builds.apache.org>.
See <https://builds.apache.org/job/beam_PerformanceTests_TFRecordIOIT/276/display/redirect>

------------------------------------------
[...truncated 29.43 KB...]
[INFO] Excluding com.google.oauth-client:google-oauth-client:jar:1.22.0 from the shaded jar.
[INFO] Excluding com.google.http-client:google-http-client:jar:1.22.0 from the shaded jar.
[INFO] Excluding org.apache.httpcomponents:httpclient:jar:4.0.1 from the shaded jar.
[INFO] Excluding org.apache.httpcomponents:httpcore:jar:4.0.1 from the shaded jar.
[INFO] Excluding commons-codec:commons-codec:jar:1.3 from the shaded jar.
[INFO] Excluding com.google.http-client:google-http-client-jackson2:jar:1.22.0 from the shaded jar.
[INFO] Excluding com.google.apis:google-api-services-dataflow:jar:v1b3-rev221-1.22.0 from the shaded jar.
[INFO] Excluding com.google.apis:google-api-services-clouddebugger:jar:v2-rev8-1.22.0 from the shaded jar.
[INFO] Excluding com.google.apis:google-api-services-storage:jar:v1-rev71-1.22.0 from the shaded jar.
[INFO] Excluding com.google.auth:google-auth-library-credentials:jar:0.7.1 from the shaded jar.
[INFO] Excluding com.google.auth:google-auth-library-oauth2-http:jar:0.7.1 from the shaded jar.
[INFO] Excluding com.google.cloud.bigdataoss:util:jar:1.4.5 from the shaded jar.
[INFO] Excluding com.google.api-client:google-api-client-java6:jar:1.22.0 from the shaded jar.
[INFO] Excluding com.google.api-client:google-api-client-jackson2:jar:1.22.0 from the shaded jar.
[INFO] Excluding com.google.oauth-client:google-oauth-client-java6:jar:1.22.0 from the shaded jar.
[INFO] Excluding org.apache.beam:beam-sdks-java-io-google-cloud-platform:jar:2.5.0-SNAPSHOT from the shaded jar.
[INFO] Excluding org.apache.beam:beam-sdks-java-extensions-protobuf:jar:2.5.0-SNAPSHOT from the shaded jar.
[INFO] Excluding io.grpc:grpc-core:jar:1.2.0 from the shaded jar.
[INFO] Excluding com.google.errorprone:error_prone_annotations:jar:2.0.15 from the shaded jar.
[INFO] Excluding io.grpc:grpc-context:jar:1.2.0 from the shaded jar.
[INFO] Excluding com.google.instrumentation:instrumentation-api:jar:0.3.0 from the shaded jar.
[INFO] Excluding com.google.apis:google-api-services-bigquery:jar:v2-rev374-1.22.0 from the shaded jar.
[INFO] Excluding com.google.api:gax-grpc:jar:0.20.0 from the shaded jar.
[INFO] Excluding io.grpc:grpc-protobuf:jar:1.2.0 from the shaded jar.
[INFO] Excluding com.google.api:api-common:jar:1.0.0-rc2 from the shaded jar.
[INFO] Excluding com.google.auto.value:auto-value:jar:1.5.3 from the shaded jar.
[INFO] Excluding com.google.api:gax:jar:1.3.1 from the shaded jar.
[INFO] Excluding org.threeten:threetenbp:jar:1.3.3 from the shaded jar.
[INFO] Excluding com.google.cloud:google-cloud-core-grpc:jar:1.2.0 from the shaded jar.
[INFO] Excluding com.google.protobuf:protobuf-java-util:jar:3.2.0 from the shaded jar.
[INFO] Excluding com.google.code.gson:gson:jar:2.7 from the shaded jar.
[INFO] Excluding com.google.apis:google-api-services-pubsub:jar:v1-rev10-1.22.0 from the shaded jar.
[INFO] Excluding com.google.api.grpc:grpc-google-cloud-pubsub-v1:jar:0.1.18 from the shaded jar.
[INFO] Excluding com.google.api.grpc:proto-google-cloud-pubsub-v1:jar:0.1.18 from the shaded jar.
[INFO] Excluding com.google.api.grpc:proto-google-iam-v1:jar:0.1.18 from the shaded jar.
[INFO] Excluding com.google.cloud.datastore:datastore-v1-proto-client:jar:1.4.0 from the shaded jar.
[INFO] Excluding com.google.http-client:google-http-client-protobuf:jar:1.22.0 from the shaded jar.
[INFO] Excluding com.google.http-client:google-http-client-jackson:jar:1.22.0 from the shaded jar.
[INFO] Excluding com.google.cloud.datastore:datastore-v1-protos:jar:1.3.0 from the shaded jar.
[INFO] Excluding com.google.api.grpc:grpc-google-common-protos:jar:0.1.9 from the shaded jar.
[INFO] Excluding io.grpc:grpc-auth:jar:1.2.0 from the shaded jar.
[INFO] Excluding io.grpc:grpc-netty:jar:1.2.0 from the shaded jar.
[INFO] Excluding io.netty:netty-codec-http2:jar:4.1.8.Final from the shaded jar.
[INFO] Excluding io.netty:netty-codec-http:jar:4.1.8.Final from the shaded jar.
[INFO] Excluding io.netty:netty-handler-proxy:jar:4.1.8.Final from the shaded jar.
[INFO] Excluding io.netty:netty-codec-socks:jar:4.1.8.Final from the shaded jar.
[INFO] Excluding io.netty:netty-handler:jar:4.1.8.Final from the shaded jar.
[INFO] Excluding io.netty:netty-buffer:jar:4.1.8.Final from the shaded jar.
[INFO] Excluding io.netty:netty-common:jar:4.1.8.Final from the shaded jar.
[INFO] Excluding io.netty:netty-transport:jar:4.1.8.Final from the shaded jar.
[INFO] Excluding io.netty:netty-resolver:jar:4.1.8.Final from the shaded jar.
[INFO] Excluding io.netty:netty-codec:jar:4.1.8.Final from the shaded jar.
[INFO] Excluding io.grpc:grpc-stub:jar:1.2.0 from the shaded jar.
[INFO] Excluding io.grpc:grpc-all:jar:1.2.0 from the shaded jar.
[INFO] Excluding io.grpc:grpc-okhttp:jar:1.2.0 from the shaded jar.
[INFO] Excluding com.squareup.okhttp:okhttp:jar:2.5.0 from the shaded jar.
[INFO] Excluding com.squareup.okio:okio:jar:1.6.0 from the shaded jar.
[INFO] Excluding io.grpc:grpc-protobuf-lite:jar:1.2.0 from the shaded jar.
[INFO] Excluding io.grpc:grpc-protobuf-nano:jar:1.2.0 from the shaded jar.
[INFO] Excluding com.google.protobuf.nano:protobuf-javanano:jar:3.0.0-alpha-5 from the shaded jar.
[INFO] Excluding com.google.cloud:google-cloud-core:jar:1.0.2 from the shaded jar.
[INFO] Excluding org.json:json:jar:20160810 from the shaded jar.
[INFO] Excluding com.google.cloud:google-cloud-spanner:jar:0.20.0b-beta from the shaded jar.
[INFO] Excluding com.google.api.grpc:proto-google-cloud-spanner-v1:jar:0.1.11b from the shaded jar.
[INFO] Excluding com.google.api.grpc:proto-google-cloud-spanner-admin-instance-v1:jar:0.1.11 from the shaded jar.
[INFO] Excluding com.google.api.grpc:grpc-google-cloud-spanner-v1:jar:0.1.11b from the shaded jar.
[INFO] Excluding com.google.api.grpc:grpc-google-cloud-spanner-admin-database-v1:jar:0.1.11 from the shaded jar.
[INFO] Excluding com.google.api.grpc:grpc-google-cloud-spanner-admin-instance-v1:jar:0.1.11 from the shaded jar.
[INFO] Excluding com.google.api.grpc:grpc-google-longrunning-v1:jar:0.1.11 from the shaded jar.
[INFO] Excluding com.google.api.grpc:proto-google-longrunning-v1:jar:0.1.11 from the shaded jar.
[INFO] Excluding com.google.cloud.bigtable:bigtable-protos:jar:1.0.0-pre3 from the shaded jar.
[INFO] Excluding com.google.cloud.bigtable:bigtable-client-core:jar:1.0.0 from the shaded jar.
[INFO] Excluding commons-logging:commons-logging:jar:1.2 from the shaded jar.
[INFO] Excluding com.google.auth:google-auth-library-appengine:jar:0.7.0 from the shaded jar.
[INFO] Excluding io.opencensus:opencensus-contrib-grpc-util:jar:0.7.0 from the shaded jar.
[INFO] Excluding io.opencensus:opencensus-api:jar:0.7.0 from the shaded jar.
[INFO] Excluding io.dropwizard.metrics:metrics-core:jar:3.1.2 from the shaded jar.
[INFO] Excluding com.google.protobuf:protobuf-java:jar:3.2.0 from the shaded jar.
[INFO] Excluding io.netty:netty-tcnative-boringssl-static:jar:1.1.33.Fork26 from the shaded jar.
[INFO] Excluding com.google.api.grpc:proto-google-cloud-spanner-admin-database-v1:jar:0.1.9 from the shaded jar.
[INFO] Excluding com.google.api.grpc:proto-google-common-protos:jar:0.1.9 from the shaded jar.
[INFO] Replacing original artifact with shaded artifact.
[INFO] Replacing <https://builds.apache.org/job/beam_PerformanceTests_TFRecordIOIT/ws/runs/6ac57e22/beam/sdks/java/io/file-based-io-tests/target/beam-sdks-java-io-file-based-io-tests-2.5.0-SNAPSHOT.jar> with <https://builds.apache.org/job/beam_PerformanceTests_TFRecordIOIT/ws/runs/6ac57e22/beam/sdks/java/io/file-based-io-tests/target/beam-sdks-java-io-file-based-io-tests-2.5.0-SNAPSHOT-shaded.jar>
[INFO] Replacing original test artifact with shaded test artifact.
[INFO] Replacing <https://builds.apache.org/job/beam_PerformanceTests_TFRecordIOIT/ws/runs/6ac57e22/beam/sdks/java/io/file-based-io-tests/target/beam-sdks-java-io-file-based-io-tests-2.5.0-SNAPSHOT-tests.jar> with <https://builds.apache.org/job/beam_PerformanceTests_TFRecordIOIT/ws/runs/6ac57e22/beam/sdks/java/io/file-based-io-tests/target/beam-sdks-java-io-file-based-io-tests-2.5.0-SNAPSHOT-shaded-tests.jar>
[INFO] 
[INFO] --- maven-failsafe-plugin:2.20.1:integration-test (default) @ beam-sdks-java-io-file-based-io-tests ---
[INFO] Failsafe report directory: <https://builds.apache.org/job/beam_PerformanceTests_TFRecordIOIT/ws/runs/6ac57e22/beam/sdks/java/io/file-based-io-tests/target/failsafe-reports>
[INFO] parallel='all', perCoreThreadCount=true, threadCount=4, useUnlimitedThreads=false, threadCountSuites=0, threadCountClasses=0, threadCountMethods=0, parallelOptimized=true
[INFO] 
[INFO] -------------------------------------------------------
[INFO]  T E S T S
[INFO] -------------------------------------------------------
[INFO] Running org.apache.beam.sdk.io.tfrecord.TFRecordIOIT
[ERROR] Tests run: 1, Failures: 0, Errors: 1, Skipped: 0, Time elapsed: 104.68 s <<< FAILURE! - in org.apache.beam.sdk.io.tfrecord.TFRecordIOIT
[ERROR] writeThenReadAll(org.apache.beam.sdk.io.tfrecord.TFRecordIOIT)  Time elapsed: 104.68 s  <<< ERROR!
java.lang.RuntimeException: Startup of the worker pool in zone us-central1-f failed to bring up any of the desired 1 workers. QUOTA_EXCEEDED: Quota 'DISKS_TOTAL_GB' exceeded.  Limit: 21000.0 in region us-central1.Workflow failed.
	at org.apache.beam.runners.dataflow.TestDataflowRunner.run(TestDataflowRunner.java:134)
	at org.apache.beam.runners.dataflow.TestDataflowRunner.run(TestDataflowRunner.java:90)
	at org.apache.beam.runners.dataflow.TestDataflowRunner.run(TestDataflowRunner.java:55)
	at org.apache.beam.sdk.Pipeline.run(Pipeline.java:311)
	at org.apache.beam.sdk.testing.TestPipeline.run(TestPipeline.java:346)
	at org.apache.beam.sdk.testing.TestPipeline.run(TestPipeline.java:328)
	at org.apache.beam.sdk.io.tfrecord.TFRecordIOIT.writeThenReadAll(TFRecordIOIT.java:108)
	at sun.reflect.NativeMethodAccessorImpl.invoke0(Native Method)
	at sun.reflect.NativeMethodAccessorImpl.invoke(NativeMethodAccessorImpl.java:62)
	at sun.reflect.DelegatingMethodAccessorImpl.invoke(DelegatingMethodAccessorImpl.java:43)
	at java.lang.reflect.Method.invoke(Method.java:498)
	at org.junit.runners.model.FrameworkMethod$1.runReflectiveCall(FrameworkMethod.java:50)
	at org.junit.internal.runners.model.ReflectiveCallable.run(ReflectiveCallable.java:12)
	at org.junit.runners.model.FrameworkMethod.invokeExplosively(FrameworkMethod.java:47)
	at org.junit.internal.runners.statements.InvokeMethod.evaluate(InvokeMethod.java:17)
	at org.apache.beam.sdk.testing.TestPipeline$1.evaluate(TestPipeline.java:317)
	at org.apache.beam.sdk.testing.TestPipeline$1.evaluate(TestPipeline.java:317)
	at org.junit.rules.RunRules.evaluate(RunRules.java:20)
	at org.junit.runners.ParentRunner.runLeaf(ParentRunner.java:325)
	at org.junit.runners.BlockJUnit4ClassRunner.runChild(BlockJUnit4ClassRunner.java:78)
	at org.junit.runners.BlockJUnit4ClassRunner.runChild(BlockJUnit4ClassRunner.java:57)
	at org.junit.runners.ParentRunner$3.run(ParentRunner.java:290)
	at org.apache.maven.surefire.junitcore.pc.Scheduler$1.run(Scheduler.java:410)
	at java.util.concurrent.Executors$RunnableAdapter.call(Executors.java:511)
	at java.util.concurrent.FutureTask.run(FutureTask.java:266)
	at java.util.concurrent.ThreadPoolExecutor.runWorker(ThreadPoolExecutor.java:1149)
	at java.util.concurrent.ThreadPoolExecutor$Worker.run(ThreadPoolExecutor.java:624)
	at java.lang.Thread.run(Thread.java:748)

[INFO] 
[INFO] Results:
[INFO] 
[ERROR] Errors: 
[ERROR]   TFRecordIOIT.writeThenReadAll:108  Runtime Startup of the worker pool in zone...
[INFO] 
[ERROR] Tests run: 1, Failures: 0, Errors: 1, Skipped: 0
[INFO] 
[INFO] 
[INFO] --- maven-dependency-plugin:3.0.2:analyze-only (default) @ beam-sdks-java-io-file-based-io-tests ---
[INFO] No dependency problems found
[INFO] 
[INFO] --- maven-failsafe-plugin:2.20.1:verify (default) @ beam-sdks-java-io-file-based-io-tests ---
[INFO] Failsafe report directory: <https://builds.apache.org/job/beam_PerformanceTests_TFRecordIOIT/ws/runs/6ac57e22/beam/sdks/java/io/file-based-io-tests/target/failsafe-reports>
[INFO] ------------------------------------------------------------------------
[INFO] BUILD FAILURE
[INFO] ------------------------------------------------------------------------
[INFO] Total time: 02:26 min
[INFO] Finished at: 2018-03-21T12:03:25Z
[INFO] Final Memory: 92M/998M
[INFO] ------------------------------------------------------------------------
[ERROR] Failed to execute goal org.apache.maven.plugins:maven-failsafe-plugin:2.20.1:verify (default) on project beam-sdks-java-io-file-based-io-tests: There are test failures.
[ERROR] 
[ERROR] Please refer to <https://builds.apache.org/job/beam_PerformanceTests_TFRecordIOIT/ws/runs/6ac57e22/beam/sdks/java/io/file-based-io-tests/target/failsafe-reports> for the individual test results.
[ERROR] Please refer to dump files (if any exist) [date]-jvmRun[N].dump, [date].dumpstream and [date]-jvmRun[N].dumpstream.
[ERROR] -> [Help 1]
org.apache.maven.lifecycle.LifecycleExecutionException: Failed to execute goal org.apache.maven.plugins:maven-failsafe-plugin:2.20.1:verify (default) on project beam-sdks-java-io-file-based-io-tests: There are test failures.

Please refer to <https://builds.apache.org/job/beam_PerformanceTests_TFRecordIOIT/ws/runs/6ac57e22/beam/sdks/java/io/file-based-io-tests/target/failsafe-reports> for the individual test results.
Please refer to dump files (if any exist) [date]-jvmRun[N].dump, [date].dumpstream and [date]-jvmRun[N].dumpstream.
    at org.apache.maven.lifecycle.internal.MojoExecutor.execute (MojoExecutor.java:213)
    at org.apache.maven.lifecycle.internal.MojoExecutor.execute (MojoExecutor.java:154)
    at org.apache.maven.lifecycle.internal.MojoExecutor.execute (MojoExecutor.java:146)
    at org.apache.maven.lifecycle.internal.LifecycleModuleBuilder.buildProject (LifecycleModuleBuilder.java:117)
    at org.apache.maven.lifecycle.internal.LifecycleModuleBuilder.buildProject (LifecycleModuleBuilder.java:81)
    at org.apache.maven.lifecycle.internal.builder.singlethreaded.SingleThreadedBuilder.build (SingleThreadedBuilder.java:51)
    at org.apache.maven.lifecycle.internal.LifecycleStarter.execute (LifecycleStarter.java:128)
    at org.apache.maven.DefaultMaven.doExecute (DefaultMaven.java:309)
    at org.apache.maven.DefaultMaven.doExecute (DefaultMaven.java:194)
    at org.apache.maven.DefaultMaven.execute (DefaultMaven.java:107)
    at org.apache.maven.cli.MavenCli.execute (MavenCli.java:955)
    at org.apache.maven.cli.MavenCli.doMain (MavenCli.java:290)
    at org.apache.maven.cli.MavenCli.main (MavenCli.java:194)
    at sun.reflect.NativeMethodAccessorImpl.invoke0 (Native Method)
    at sun.reflect.NativeMethodAccessorImpl.invoke (NativeMethodAccessorImpl.java:62)
    at sun.reflect.DelegatingMethodAccessorImpl.invoke (DelegatingMethodAccessorImpl.java:43)
    at java.lang.reflect.Method.invoke (Method.java:498)
    at org.codehaus.plexus.classworlds.launcher.Launcher.launchEnhanced (Launcher.java:289)
    at org.codehaus.plexus.classworlds.launcher.Launcher.launch (Launcher.java:229)
    at org.codehaus.plexus.classworlds.launcher.Launcher.mainWithExitCode (Launcher.java:415)
    at org.codehaus.plexus.classworlds.launcher.Launcher.main (Launcher.java:356)
Caused by: org.apache.maven.plugin.MojoFailureException: There are test failures.

Please refer to <https://builds.apache.org/job/beam_PerformanceTests_TFRecordIOIT/ws/runs/6ac57e22/beam/sdks/java/io/file-based-io-tests/target/failsafe-reports> for the individual test results.
Please refer to dump files (if any exist) [date]-jvmRun[N].dump, [date].dumpstream and [date]-jvmRun[N].dumpstream.
    at org.apache.maven.plugin.surefire.SurefireHelper.throwException (SurefireHelper.java:240)
    at org.apache.maven.plugin.surefire.SurefireHelper.reportExecution (SurefireHelper.java:112)
    at org.apache.maven.plugin.failsafe.VerifyMojo.execute (VerifyMojo.java:188)
    at org.apache.maven.plugin.DefaultBuildPluginManager.executeMojo (DefaultBuildPluginManager.java:134)
    at org.apache.maven.lifecycle.internal.MojoExecutor.execute (MojoExecutor.java:208)
    at org.apache.maven.lifecycle.internal.MojoExecutor.execute (MojoExecutor.java:154)
    at org.apache.maven.lifecycle.internal.MojoExecutor.execute (MojoExecutor.java:146)
    at org.apache.maven.lifecycle.internal.LifecycleModuleBuilder.buildProject (LifecycleModuleBuilder.java:117)
    at org.apache.maven.lifecycle.internal.LifecycleModuleBuilder.buildProject (LifecycleModuleBuilder.java:81)
    at org.apache.maven.lifecycle.internal.builder.singlethreaded.SingleThreadedBuilder.build (SingleThreadedBuilder.java:51)
    at org.apache.maven.lifecycle.internal.LifecycleStarter.execute (LifecycleStarter.java:128)
    at org.apache.maven.DefaultMaven.doExecute (DefaultMaven.java:309)
    at org.apache.maven.DefaultMaven.doExecute (DefaultMaven.java:194)
    at org.apache.maven.DefaultMaven.execute (DefaultMaven.java:107)
    at org.apache.maven.cli.MavenCli.execute (MavenCli.java:955)
    at org.apache.maven.cli.MavenCli.doMain (MavenCli.java:290)
    at org.apache.maven.cli.MavenCli.main (MavenCli.java:194)
    at sun.reflect.NativeMethodAccessorImpl.invoke0 (Native Method)
    at sun.reflect.NativeMethodAccessorImpl.invoke (NativeMethodAccessorImpl.java:62)
    at sun.reflect.DelegatingMethodAccessorImpl.invoke (DelegatingMethodAccessorImpl.java:43)
    at java.lang.reflect.Method.invoke (Method.java:498)
    at org.codehaus.plexus.classworlds.launcher.Launcher.launchEnhanced (Launcher.java:289)
    at org.codehaus.plexus.classworlds.launcher.Launcher.launch (Launcher.java:229)
    at org.codehaus.plexus.classworlds.launcher.Launcher.mainWithExitCode (Launcher.java:415)
    at org.codehaus.plexus.classworlds.launcher.Launcher.main (Launcher.java:356)
[ERROR] 
[ERROR] Re-run Maven using the -X switch to enable full debug logging.
[ERROR] 
[ERROR] For more information about the errors and possible solutions, please read the following articles:
[ERROR] [Help 1] http://cwiki.apache.org/confluence/display/MAVEN/MojoFailureException

STDERR: 
2018-03-21 12:03:25,481 6ac57e22 MainThread beam_integration_benchmark(1/1) ERROR    Error during benchmark beam_integration_benchmark
Traceback (most recent call last):
  File "<https://builds.apache.org/job/beam_PerformanceTests_TFRecordIOIT/ws/PerfKitBenchmarker/perfkitbenchmarker/pkb.py",> line 623, in RunBenchmark
    DoRunPhase(spec, collector, detailed_timer)
  File "<https://builds.apache.org/job/beam_PerformanceTests_TFRecordIOIT/ws/PerfKitBenchmarker/perfkitbenchmarker/pkb.py",> line 526, in DoRunPhase
    samples = spec.BenchmarkRun(spec)
  File "<https://builds.apache.org/job/beam_PerformanceTests_TFRecordIOIT/ws/PerfKitBenchmarker/perfkitbenchmarker/linux_benchmarks/beam_integration_benchmark.py",> line 159, in Run
    job_type=job_type)
  File "<https://builds.apache.org/job/beam_PerformanceTests_TFRecordIOIT/ws/PerfKitBenchmarker/perfkitbenchmarker/providers/gcp/gcp_dpb_dataflow.py",> line 90, in SubmitJob
    assert retcode == 0, "Integration Test Failed."
AssertionError: Integration Test Failed.
2018-03-21 12:03:25,481 6ac57e22 MainThread beam_integration_benchmark(1/1) INFO     Cleaning up benchmark beam_integration_benchmark
2018-03-21 12:03:25,483 6ac57e22 MainThread beam_integration_benchmark(1/1) ERROR    Exception running benchmark
Traceback (most recent call last):
  File "<https://builds.apache.org/job/beam_PerformanceTests_TFRecordIOIT/ws/PerfKitBenchmarker/perfkitbenchmarker/pkb.py",> line 733, in RunBenchmarkTask
    RunBenchmark(spec, collector)
  File "<https://builds.apache.org/job/beam_PerformanceTests_TFRecordIOIT/ws/PerfKitBenchmarker/perfkitbenchmarker/pkb.py",> line 623, in RunBenchmark
    DoRunPhase(spec, collector, detailed_timer)
  File "<https://builds.apache.org/job/beam_PerformanceTests_TFRecordIOIT/ws/PerfKitBenchmarker/perfkitbenchmarker/pkb.py",> line 526, in DoRunPhase
    samples = spec.BenchmarkRun(spec)
  File "<https://builds.apache.org/job/beam_PerformanceTests_TFRecordIOIT/ws/PerfKitBenchmarker/perfkitbenchmarker/linux_benchmarks/beam_integration_benchmark.py",> line 159, in Run
    job_type=job_type)
  File "<https://builds.apache.org/job/beam_PerformanceTests_TFRecordIOIT/ws/PerfKitBenchmarker/perfkitbenchmarker/providers/gcp/gcp_dpb_dataflow.py",> line 90, in SubmitJob
    assert retcode == 0, "Integration Test Failed."
AssertionError: Integration Test Failed.
2018-03-21 12:03:25,484 6ac57e22 MainThread beam_integration_benchmark(1/1) ERROR    Benchmark 1/1 beam_integration_benchmark (UID: beam_integration_benchmark0) failed. Execution will continue.
2018-03-21 12:03:25,484 6ac57e22 MainThread beam_integration_benchmark(1/1) INFO     Benchmark run statuses:
---------------------------------------------------------------------------------
Name                        UID                          Status  Failed Substatus
---------------------------------------------------------------------------------
beam_integration_benchmark  beam_integration_benchmark0  FAILED                  
---------------------------------------------------------------------------------
Success rate: 0.00% (0/1)
2018-03-21 12:03:25,484 6ac57e22 MainThread beam_integration_benchmark(1/1) INFO     Complete logs can be found at: <https://builds.apache.org/job/beam_PerformanceTests_TFRecordIOIT/ws/runs/6ac57e22/pkb.log>
2018-03-21 12:03:25,484 6ac57e22 MainThread beam_integration_benchmark(1/1) INFO     Completion statuses can be found at: <https://builds.apache.org/job/beam_PerformanceTests_TFRecordIOIT/ws/runs/6ac57e22/completion_statuses.json>
Build step 'Execute shell' marked build as failure