You are viewing a plain text version of this content. The canonical link for it is here.
Posted to dev@poi.apache.org by Apache Jenkins Server <je...@builds.apache.org> on 2024/03/10 12:00:12 UTC
Build failed in Jenkins: POI » POI-XMLBeans-DSL-1.22 #16
See <https://ci-builds.apache.org/job/POI/job/POI-XMLBeans-DSL-1.22/16/display/redirect?page=changes>
Changes:
[PJ Fanning] add logic back to gradlew to download the wrapper jar
[PJ Fanning] gradle 8.6
------------------------------------------
[...truncated 11.49 MB...]
At edu.umd.cs.findbugs.classfile.engine.asm.ClassReaderAnalysisEngine.analyze(ClassReaderAnalysisEngine.java:48)
At edu.umd.cs.findbugs.classfile.engine.asm.ClassReaderAnalysisEngine.analyze(ClassReaderAnalysisEngine.java:34)
At edu.umd.cs.findbugs.classfile.impl.AnalysisCache.getClassAnalysis(AnalysisCache.java:261)
At edu.umd.cs.findbugs.classfile.engine.ClassInfoAnalysisEngine.analyze(ClassInfoAnalysisEngine.java:75)
At edu.umd.cs.findbugs.classfile.engine.ClassInfoAnalysisEngine.analyze(ClassInfoAnalysisEngine.java:38)
At edu.umd.cs.findbugs.classfile.impl.AnalysisCache.getClassAnalysis(AnalysisCache.java:261)
At edu.umd.cs.findbugs.ba.XFactory.getXClass(XFactory.java:693)
At edu.umd.cs.findbugs.ba.AnalysisContext.setAppClassList(AnalysisContext.java:975)
At edu.umd.cs.findbugs.FindBugs2.setAppClassList(FindBugs2.java:909)
At edu.umd.cs.findbugs.FindBugs2.execute(FindBugs2.java:252)
At edu.umd.cs.findbugs.FindBugs.runMain(FindBugs.java:395)
At edu.umd.cs.findbugs.FindBugs2.main(FindBugs2.java:1231)
Couldn't get class info for java/lang/LinkageError
java.lang.IllegalArgumentException: Unsupported class file major version 66
At org.objectweb.asm.ClassReader.<init>(ClassReader.java:199)
At org.objectweb.asm.ClassReader.<init>(ClassReader.java:180)
At org.objectweb.asm.ClassReader.<init>(ClassReader.java:166)
At edu.umd.cs.findbugs.asm.FBClassReader.<init>(FBClassReader.java:35)
At edu.umd.cs.findbugs.classfile.engine.asm.ClassReaderAnalysisEngine.analyze(ClassReaderAnalysisEngine.java:48)
At edu.umd.cs.findbugs.classfile.engine.asm.ClassReaderAnalysisEngine.analyze(ClassReaderAnalysisEngine.java:34)
At edu.umd.cs.findbugs.classfile.impl.AnalysisCache.getClassAnalysis(AnalysisCache.java:261)
At edu.umd.cs.findbugs.classfile.engine.ClassInfoAnalysisEngine.analyze(ClassInfoAnalysisEngine.java:75)
At edu.umd.cs.findbugs.classfile.engine.ClassInfoAnalysisEngine.analyze(ClassInfoAnalysisEngine.java:38)
At edu.umd.cs.findbugs.classfile.impl.AnalysisCache.getClassAnalysis(AnalysisCache.java:261)
At edu.umd.cs.findbugs.ba.XFactory.getXClass(XFactory.java:693)
At edu.umd.cs.findbugs.ba.AnalysisContext.setAppClassList(AnalysisContext.java:975)
At edu.umd.cs.findbugs.FindBugs2.setAppClassList(FindBugs2.java:909)
At edu.umd.cs.findbugs.FindBugs2.execute(FindBugs2.java:252)
At edu.umd.cs.findbugs.FindBugs.runMain(FindBugs.java:395)
At edu.umd.cs.findbugs.FindBugs2.main(FindBugs2.java:1231)
Couldn't get class info for java/io/File
java.lang.IllegalArgumentException: Unsupported class file major version 66
At org.objectweb.asm.ClassReader.<init>(ClassReader.java:199)
At org.objectweb.asm.ClassReader.<init>(ClassReader.java:180)
At org.objectweb.asm.ClassReader.<init>(ClassReader.java:166)
At edu.umd.cs.findbugs.asm.FBClassReader.<init>(FBClassReader.java:35)
At edu.umd.cs.findbugs.classfile.engine.asm.ClassReaderAnalysisEngine.analyze(ClassReaderAnalysisEngine.java:48)
At edu.umd.cs.findbugs.classfile.engine.asm.ClassReaderAnalysisEngine.analyze(ClassReaderAnalysisEngine.java:34)
At edu.umd.cs.findbugs.classfile.impl.AnalysisCache.getClassAnalysis(AnalysisCache.java:261)
At edu.umd.cs.findbugs.classfile.engine.ClassInfoAnalysisEngine.analyze(ClassInfoAnalysisEngine.java:75)
At edu.umd.cs.findbugs.classfile.engine.ClassInfoAnalysisEngine.analyze(ClassInfoAnalysisEngine.java:38)
At edu.umd.cs.findbugs.classfile.impl.AnalysisCache.getClassAnalysis(AnalysisCache.java:261)
At edu.umd.cs.findbugs.ba.XFactory.getXClass(XFactory.java:693)
At edu.umd.cs.findbugs.ba.AnalysisContext.setAppClassList(AnalysisContext.java:975)
At edu.umd.cs.findbugs.FindBugs2.setAppClassList(FindBugs2.java:909)
At edu.umd.cs.findbugs.FindBugs2.execute(FindBugs2.java:252)
At edu.umd.cs.findbugs.FindBugs.runMain(FindBugs.java:395)
At edu.umd.cs.findbugs.FindBugs2.main(FindBugs2.java:1231)
Couldn't get class info for java/nio/file/attribute/FileAttribute
java.lang.IllegalArgumentException: Unsupported class file major version 66
At org.objectweb.asm.ClassReader.<init>(ClassReader.java:199)
At org.objectweb.asm.ClassReader.<init>(ClassReader.java:180)
At org.objectweb.asm.ClassReader.<init>(ClassReader.java:166)
At edu.umd.cs.findbugs.asm.FBClassReader.<init>(FBClassReader.java:35)
At edu.umd.cs.findbugs.classfile.engine.asm.ClassReaderAnalysisEngine.analyze(ClassReaderAnalysisEngine.java:48)
At edu.umd.cs.findbugs.classfile.engine.asm.ClassReaderAnalysisEngine.analyze(ClassReaderAnalysisEngine.java:34)
At edu.umd.cs.findbugs.classfile.impl.AnalysisCache.getClassAnalysis(AnalysisCache.java:261)
At edu.umd.cs.findbugs.classfile.engine.ClassInfoAnalysisEngine.analyze(ClassInfoAnalysisEngine.java:75)
At edu.umd.cs.findbugs.classfile.engine.ClassInfoAnalysisEngine.analyze(ClassInfoAnalysisEngine.java:38)
At edu.umd.cs.findbugs.classfile.impl.AnalysisCache.getClassAnalysis(AnalysisCache.java:261)
At edu.umd.cs.findbugs.ba.XFactory.getXClass(XFactory.java:693)
At edu.umd.cs.findbugs.ba.AnalysisContext.setAppClassList(AnalysisContext.java:975)
At edu.umd.cs.findbugs.FindBugs2.setAppClassList(FindBugs2.java:909)
At edu.umd.cs.findbugs.FindBugs2.execute(FindBugs2.java:252)
At edu.umd.cs.findbugs.FindBugs.runMain(FindBugs.java:395)
At edu.umd.cs.findbugs.FindBugs2.main(FindBugs2.java:1231)
Couldn't get class info for java/util/Calendar
java.lang.IllegalArgumentException: Unsupported class file major version 66
At org.objectweb.asm.ClassReader.<init>(ClassReader.java:199)
At org.objectweb.asm.ClassReader.<init>(ClassReader.java:180)
At org.objectweb.asm.ClassReader.<init>(ClassReader.java:166)
At edu.umd.cs.findbugs.asm.FBClassReader.<init>(FBClassReader.java:35)
At edu.umd.cs.findbugs.classfile.engine.asm.ClassReaderAnalysisEngine.analyze(ClassReaderAnalysisEngine.java:48)
At edu.umd.cs.findbugs.classfile.engine.asm.ClassReaderAnalysisEngine.analyze(ClassReaderAnalysisEngine.java:34)
At edu.umd.cs.findbugs.classfile.impl.AnalysisCache.getClassAnalysis(AnalysisCache.java:261)
At edu.umd.cs.findbugs.classfile.engine.ClassInfoAnalysisEngine.analyze(ClassInfoAnalysisEngine.java:75)
At edu.umd.cs.findbugs.classfile.engine.ClassInfoAnalysisEngine.analyze(ClassInfoAnalysisEngine.java:38)
At edu.umd.cs.findbugs.classfile.impl.AnalysisCache.getClassAnalysis(AnalysisCache.java:261)
At edu.umd.cs.findbugs.ba.XFactory.getXClass(XFactory.java:693)
At edu.umd.cs.findbugs.ba.AnalysisContext.setAppClassList(AnalysisContext.java:975)
At edu.umd.cs.findbugs.FindBugs2.setAppClassList(FindBugs2.java:909)
At edu.umd.cs.findbugs.FindBugs2.execute(FindBugs2.java:252)
At edu.umd.cs.findbugs.FindBugs.runMain(FindBugs.java:395)
At edu.umd.cs.findbugs.FindBugs2.main(FindBugs2.java:1231)
Couldn't get class info for java/util/Random
java.lang.IllegalArgumentException: Unsupported class file major version 66
At org.objectweb.asm.ClassReader.<init>(ClassReader.java:199)
At org.objectweb.asm.ClassReader.<init>(ClassReader.java:180)
At org.objectweb.asm.ClassReader.<init>(ClassReader.java:166)
At edu.umd.cs.findbugs.asm.FBClassReader.<init>(FBClassReader.java:35)
At edu.umd.cs.findbugs.classfile.engine.asm.ClassReaderAnalysisEngine.analyze(ClassReaderAnalysisEngine.java:48)
At edu.umd.cs.findbugs.classfile.engine.asm.ClassReaderAnalysisEngine.analyze(ClassReaderAnalysisEngine.java:34)
At edu.umd.cs.findbugs.classfile.impl.AnalysisCache.getClassAnalysis(AnalysisCache.java:261)
At edu.umd.cs.findbugs.classfile.engine.ClassInfoAnalysisEngine.analyze(ClassInfoAnalysisEngine.java:75)
At edu.umd.cs.findbugs.classfile.engine.ClassInfoAnalysisEngine.analyze(ClassInfoAnalysisEngine.java:38)
At edu.umd.cs.findbugs.classfile.impl.AnalysisCache.getClassAnalysis(AnalysisCache.java:261)
At edu.umd.cs.findbugs.ba.XFactory.getXClass(XFactory.java:693)
At edu.umd.cs.findbugs.ba.AnalysisContext.setAppClassList(AnalysisContext.java:975)
At edu.umd.cs.findbugs.FindBugs2.setAppClassList(FindBugs2.java:909)
At edu.umd.cs.findbugs.FindBugs2.execute(FindBugs2.java:252)
At edu.umd.cs.findbugs.FindBugs.runMain(FindBugs.java:395)
At edu.umd.cs.findbugs.FindBugs2.main(FindBugs2.java:1231)
Couldn't get class info for java/util/Locale
java.lang.IllegalArgumentException: Unsupported class file major version 66
At org.objectweb.asm.ClassReader.<init>(ClassReader.java:199)
At org.objectweb.asm.ClassReader.<init>(ClassReader.java:180)
At org.objectweb.asm.ClassReader.<init>(ClassReader.java:166)
At edu.umd.cs.findbugs.asm.FBClassReader.<init>(FBClassReader.java:35)
At edu.umd.cs.findbugs.classfile.engine.asm.ClassReaderAnalysisEngine.analyze(ClassReaderAnalysisEngine.java:48)
At edu.umd.cs.findbugs.classfile.engine.asm.ClassReaderAnalysisEngine.analyze(ClassReaderAnalysisEngine.java:34)
At edu.umd.cs.findbugs.classfile.impl.AnalysisCache.getClassAnalysis(AnalysisCache.java:261)
At edu.umd.cs.findbugs.classfile.engine.ClassInfoAnalysisEngine.analyze(ClassInfoAnalysisEngine.java:75)
At edu.umd.cs.findbugs.classfile.engine.ClassInfoAnalysisEngine.analyze(ClassInfoAnalysisEngine.java:38)
At edu.umd.cs.findbugs.classfile.impl.AnalysisCache.getClassAnalysis(AnalysisCache.java:261)
At edu.umd.cs.findbugs.ba.XFactory.getXClass(XFactory.java:693)
At edu.umd.cs.findbugs.ba.AnalysisContext.setAppClassList(AnalysisContext.java:975)
At edu.umd.cs.findbugs.FindBugs2.setAppClassList(FindBugs2.java:909)
At edu.umd.cs.findbugs.FindBugs2.execute(FindBugs2.java:252)
At edu.umd.cs.findbugs.FindBugs.runMain(FindBugs.java:395)
At edu.umd.cs.findbugs.FindBugs2.main(FindBugs2.java:1231)
Couldn't get class info for java/lang/AssertionError
java.lang.IllegalArgumentException: Unsupported class file major version 66
At org.objectweb.asm.ClassReader.<init>(ClassReader.java:199)
At org.objectweb.asm.ClassReader.<init>(ClassReader.java:180)
At org.objectweb.asm.ClassReader.<init>(ClassReader.java:166)
At edu.umd.cs.findbugs.asm.FBClassReader.<init>(FBClassReader.java:35)
At edu.umd.cs.findbugs.classfile.engine.asm.ClassReaderAnalysisEngine.analyze(ClassReaderAnalysisEngine.java:48)
At edu.umd.cs.findbugs.classfile.engine.asm.ClassReaderAnalysisEngine.analyze(ClassReaderAnalysisEngine.java:34)
At edu.umd.cs.findbugs.classfile.impl.AnalysisCache.getClassAnalysis(AnalysisCache.java:261)
At edu.umd.cs.findbugs.classfile.engine.ClassInfoAnalysisEngine.analyze(ClassInfoAnalysisEngine.java:75)
At edu.umd.cs.findbugs.classfile.engine.ClassInfoAnalysisEngine.analyze(ClassInfoAnalysisEngine.java:38)
At edu.umd.cs.findbugs.classfile.impl.AnalysisCache.getClassAnalysis(AnalysisCache.java:261)
At edu.umd.cs.findbugs.ba.XFactory.getXClass(XFactory.java:693)
At edu.umd.cs.findbugs.ba.AnalysisContext.setAppClassList(AnalysisContext.java:975)
At edu.umd.cs.findbugs.FindBugs2.setAppClassList(FindBugs2.java:909)
At edu.umd.cs.findbugs.FindBugs2.execute(FindBugs2.java:252)
At edu.umd.cs.findbugs.FindBugs.runMain(FindBugs.java:395)
At edu.umd.cs.findbugs.FindBugs2.main(FindBugs2.java:1231)
Couldn't get class info for java/lang/NoSuchFieldException
java.lang.IllegalArgumentException: Unsupported class file major version 66
At org.objectweb.asm.ClassReader.<init>(ClassReader.java:199)
At org.objectweb.asm.ClassReader.<init>(ClassReader.java:180)
At org.objectweb.asm.ClassReader.<init>(ClassReader.java:166)
At edu.umd.cs.findbugs.asm.FBClassReader.<init>(FBClassReader.java:35)
At edu.umd.cs.findbugs.classfile.engine.asm.ClassReaderAnalysisEngine.analyze(ClassReaderAnalysisEngine.java:48)
At edu.umd.cs.findbugs.classfile.engine.asm.ClassReaderAnalysisEngine.analyze(ClassReaderAnalysisEngine.java:34)
At edu.umd.cs.findbugs.classfile.impl.AnalysisCache.getClassAnalysis(AnalysisCache.java:261)
At edu.umd.cs.findbugs.classfile.engine.ClassInfoAnalysisEngine.analyze(ClassInfoAnalysisEngine.java:75)
At edu.umd.cs.findbugs.classfile.engine.ClassInfoAnalysisEngine.analyze(ClassInfoAnalysisEngine.java:38)
At edu.umd.cs.findbugs.classfile.impl.AnalysisCache.getClassAnalysis(AnalysisCache.java:261)
At edu.umd.cs.findbugs.ba.XFactory.getXClass(XFactory.java:693)
At edu.umd.cs.findbugs.ba.AnalysisContext.setAppClassList(AnalysisContext.java:975)
At edu.umd.cs.findbugs.FindBugs2.setAppClassList(FindBugs2.java:909)
At edu.umd.cs.findbugs.FindBugs2.execute(FindBugs2.java:252)
At edu.umd.cs.findbugs.FindBugs.runMain(FindBugs.java:395)
At edu.umd.cs.findbugs.FindBugs2.main(FindBugs2.java:1231)
Couldn't get class info for java/util/Set
java.lang.IllegalArgumentException: Unsupported class file major version 66
At org.objectweb.asm.ClassReader.<init>(ClassReader.java:199)
At org.objectweb.asm.ClassReader.<init>(ClassReader.java:180)
At org.objectweb.asm.ClassReader.<init>(ClassReader.java:166)
At edu.umd.cs.findbugs.asm.FBClassReader.<init>(FBClassReader.java:35)
At edu.umd.cs.findbugs.classfile.engine.asm.ClassReaderAnalysisEngine.analyze(ClassReaderAnalysisEngine.java:48)
At edu.umd.cs.findbugs.classfile.engine.asm.ClassReaderAnalysisEngine.analyze(ClassReaderAnalysisEngine.java:34)
At edu.umd.cs.findbugs.classfile.impl.AnalysisCache.getClassAnalysis(AnalysisCache.java:261)
At edu.umd.cs.findbugs.classfile.engine.ClassInfoAnalysisEngine.analyze(ClassInfoAnalysisEngine.java:75)
At edu.umd.cs.findbugs.classfile.engine.ClassInfoAnalysisEngine.analyze(ClassInfoAnalysisEngine.java:38)
At edu.umd.cs.findbugs.classfile.impl.AnalysisCache.getClassAnalysis(AnalysisCache.java:261)
At edu.umd.cs.findbugs.ba.XFactory.getXClass(XFactory.java:693)
At edu.umd.cs.findbugs.ba.AnalysisContext.setAppClassList(AnalysisContext.java:975)
At edu.umd.cs.findbugs.FindBugs2.setAppClassList(FindBugs2.java:909)
At edu.umd.cs.findbugs.FindBugs2.execute(FindBugs2.java:252)
At edu.umd.cs.findbugs.FindBugs.runMain(FindBugs.java:395)
At edu.umd.cs.findbugs.FindBugs2.main(FindBugs2.java:1231)
Couldn't get class info for javax/xml/stream/util/StreamReaderDelegate
java.lang.IllegalArgumentException: Unsupported class file major version 66
At org.objectweb.asm.ClassReader.<init>(ClassReader.java:199)
At org.objectweb.asm.ClassReader.<init>(ClassReader.java:180)
At org.objectweb.asm.ClassReader.<init>(ClassReader.java:166)
At edu.umd.cs.findbugs.asm.FBClassReader.<init>(FBClassReader.java:35)
At edu.umd.cs.findbugs.classfile.engine.asm.ClassReaderAnalysisEngine.analyze(ClassReaderAnalysisEngine.java:48)
At edu.umd.cs.findbugs.classfile.engine.asm.ClassReaderAnalysisEngine.analyze(ClassReaderAnalysisEngine.java:34)
At edu.umd.cs.findbugs.classfile.impl.AnalysisCache.getClassAnalysis(AnalysisCache.java:261)
At edu.umd.cs.findbugs.classfile.engine.ClassInfoAnalysisEngine.analyze(ClassInfoAnalysisEngine.java:75)
At edu.umd.cs.findbugs.classfile.engine.ClassInfoAnalysisEngine.analyze(ClassInfoAnalysisEngine.java:38)
At edu.umd.cs.findbugs.classfile.impl.AnalysisCache.getClassAnalysis(AnalysisCache.java:261)
At edu.umd.cs.findbugs.FindBugs2.buildReferencedClassSet(FindBugs2.java:806)
At edu.umd.cs.findbugs.FindBugs2.execute(FindBugs2.java:249)
At edu.umd.cs.findbugs.FindBugs.runMain(FindBugs.java:395)
At edu.umd.cs.findbugs.FindBugs2.main(FindBugs2.java:1231)
java.lang.IllegalArgumentException: Unsupported class file major version 66
at org.objectweb.asm.ClassReader.<init>(ClassReader.java:199)
at org.objectweb.asm.ClassReader.<init>(ClassReader.java:180)
at org.objectweb.asm.ClassReader.<init>(ClassReader.java:166)
at edu.umd.cs.findbugs.asm.FBClassReader.<init>(FBClassReader.java:35)
at edu.umd.cs.findbugs.classfile.engine.asm.ClassReaderAnalysisEngine.analyze(ClassReaderAnalysisEngine.java:48)
at edu.umd.cs.findbugs.classfile.engine.asm.ClassReaderAnalysisEngine.analyze(ClassReaderAnalysisEngine.java:34)
at edu.umd.cs.findbugs.classfile.impl.AnalysisCache.getClassAnalysis(AnalysisCache.java:261)
at edu.umd.cs.findbugs.classfile.engine.ClassInfoAnalysisEngine.analyze(ClassInfoAnalysisEngine.java:75)
at edu.umd.cs.findbugs.classfile.engine.ClassInfoAnalysisEngine.analyze(ClassInfoAnalysisEngine.java:38)
at edu.umd.cs.findbugs.classfile.impl.AnalysisCache.getClassAnalysis(AnalysisCache.java:261)
at edu.umd.cs.findbugs.ba.XFactory.getXClass(XFactory.java:693)
at edu.umd.cs.findbugs.ba.AnalysisContext.setAppClassList(AnalysisContext.java:975)
at edu.umd.cs.findbugs.FindBugs2.setAppClassList(FindBugs2.java:909)
at edu.umd.cs.findbugs.FindBugs2.execute(FindBugs2.java:252)
at edu.umd.cs.findbugs.FindBugs.runMain(FindBugs.java:395)
at edu.umd.cs.findbugs.FindBugs2.main(FindBugs2.java:1231)
SpotBugs ended with exit code 4
> Task :test
ParserTest > testXmlInputFactoryPropertyDefaults() FAILED
org.opentest4j.AssertionFailedError at ParserTest.java:70
ParserTest > testXmlInputFactoryPropertyOverrides() FAILED
org.opentest4j.AssertionFailedError at ParserTest.java:81
2963 tests completed, 2 failed, 170 skipped
> Task :test FAILED
FAILURE: Build failed with an exception.
* What went wrong:
Execution failed for task ':test'.
> There were failing tests. See the report at: file://<https://ci-builds.apache.org/job/POI/job/POI-XMLBeans-DSL-1.22/ws/build/reports/tests/test/index.html>
* Try:
> Run with --scan to get full insights.
Deprecated Gradle features were used in this build, making it incompatible with Gradle 9.0.
You can use '--warning-mode all' to show the individual deprecation warnings and determine if they come from your own scripts or plugins.
For more on this, please refer to https://docs.gradle.org/8.6/userguide/command_line_interface.html#sec:command_line_warnings in the Gradle documentation.
BUILD FAILED in 7m 29s
45 actionable tasks: 43 executed, 2 from cache
Build step 'Invoke Gradle script' changed build result to FAILURE
Build step 'Invoke Gradle script' marked build as failure
ERROR: Not all environment variables could be successfully injected. Check for similarly-named environment variables.
Archiving artifacts
ERROR: Not all environment variables could be successfully injected. Check for similarly-named environment variables.
Recording test results
ERROR: Not all environment variables could be successfully injected. Check for similarly-named environment variables.
[Checks API] No suitable checks publisher found.
[SpotBugs] Skipping execution of recorder since overall result is 'FAILURE'
ERROR: Not all environment variables could be successfully injected. Check for similarly-named environment variables.
---------------------------------------------------------------------
To unsubscribe, e-mail: dev-unsubscribe@poi.apache.org
For additional commands, e-mail: dev-help@poi.apache.org
Build failed in Jenkins: POI » POI-XMLBeans-DSL-1.22 #21
Posted by Apache Jenkins Server <je...@builds.apache.org>.
See <https://ci-builds.apache.org/job/POI/job/POI-XMLBeans-DSL-1.22/21/display/redirect?page=changes>
Changes:
[PJ Fanning] gradle 8.7
------------------------------------------
Started by an SCM change
Running as SYSTEM
ERROR: Not all environment variables could be successfully injected. Check for similarly-named environment variables.
[EnvInject] - Loading node environment variables.
[EnvInject] - Preparing an environment for the build.
[EnvInject] - Keeping Jenkins system variables.
[EnvInject] - Keeping Jenkins build variables.
[EnvInject] - Injecting as environment variables the properties content
FORREST_HOME=/home/jenkins/tools/forrest/latest
LANG=en_US.UTF-8
[EnvInject] - Variables injected successfully.
[EnvInject] - Injecting contributions.
Building remotely on builds40 (ubuntu) in workspace <https://ci-builds.apache.org/job/POI/job/POI-XMLBeans-DSL-1.22/ws/>
ERROR: Not all environment variables could be successfully injected. Check for similarly-named environment variables.
Updating https://svn.apache.org/repos/asf/xmlbeans/trunk at revision '2024-04-21T11:52:08.610 +0000'
U build.gradle
U gradle/wrapper/gradle-wrapper.properties
At revision 1917236
ERROR: Not all environment variables could be successfully injected. Check for similarly-named environment variables.
[POI-XMLBeans-DSL-1.22] $ /bin/sh -xe /tmp/jenkins13351854141898633261.sh
+ rm -rf examples excelant integrationtest main ooxml ooxml-schema scratchpad build.javacheck.xml
+ svn status
+ svn revert poi*/src/*/java9/module-info.*
svn: E155010: The node '<https://ci-builds.apache.org/job/POI/job/POI-XMLBeans-DSL-1.22/ws/poi*/src/*'> was not found.
+ true
+ svn revert src/resources/ooxml-lite-report.*
Skipped 'src/resources/ooxml-lite-report.*'
+ echo Java-Home: /home/jenkins/tools/java/latest22
Java-Home: /home/jenkins/tools/java/latest22
+ ls -al /home/jenkins/tools/java/latest22/
total 36
drwxr-xr-x 8 root root 4096 Nov 13 21:50 .
drwxrwxr-x 39 root root 4096 Feb 8 19:07 ..
drwxr-xr-x 2 root root 4096 Nov 13 21:50 bin
drwxr-xr-x 5 root root 4096 Nov 13 21:50 conf
drwxr-xr-x 3 root root 4096 Nov 13 21:50 include
drwxr-xr-x 2 root root 4096 Nov 13 21:50 jmods
drwxr-xr-x 71 root root 4096 Nov 13 21:50 legal
drwxr-xr-x 5 root root 4096 Nov 13 21:50 lib
-rw-r--r-- 1 root root 1220 Oct 18 2023 release
+ ls -al /home/jenkins/tools/java/latest22/bin
total 472
drwxr-xr-x 2 root root 4096 Nov 13 21:50 .
drwxr-xr-x 8 root root 4096 Nov 13 21:50 ..
-rwxr-xr-x 1 root root 12384 Oct 18 2023 jar
-rwxr-xr-x 1 root root 12392 Oct 18 2023 jarsigner
-rwxr-xr-x 1 root root 12328 Oct 18 2023 java
-rwxr-xr-x 1 root root 12416 Oct 18 2023 javac
-rwxr-xr-x 1 root root 12424 Oct 18 2023 javadoc
-rwxr-xr-x 1 root root 12384 Oct 18 2023 javap
-rwxr-xr-x 1 root root 12384 Oct 18 2023 jcmd
-rwxr-xr-x 1 root root 12456 Oct 18 2023 jconsole
-rwxr-xr-x 1 root root 12384 Oct 18 2023 jdb
-rwxr-xr-x 1 root root 12392 Oct 18 2023 jdeprscan
-rwxr-xr-x 1 root root 12384 Oct 18 2023 jdeps
-rwxr-xr-x 1 root root 12384 Oct 18 2023 jfr
-rwxr-xr-x 1 root root 12384 Oct 18 2023 jhsdb
-rwxr-xr-x 1 root root 12392 Oct 18 2023 jimage
-rwxr-xr-x 1 root root 12416 Oct 18 2023 jinfo
-rwxr-xr-x 1 root root 12416 Oct 18 2023 jlink
-rwxr-xr-x 1 root root 12416 Oct 18 2023 jmap
-rwxr-xr-x 1 root root 12384 Oct 18 2023 jmod
-rwxr-xr-x 1 root root 12392 Oct 18 2023 jpackage
-rwxr-xr-x 1 root root 12384 Oct 18 2023 jps
-rwxr-xr-x 1 root root 12424 Oct 18 2023 jrunscript
-rwxr-xr-x 1 root root 12392 Oct 18 2023 jshell
-rwxr-xr-x 1 root root 12424 Oct 18 2023 jstack
-rwxr-xr-x 1 root root 12384 Oct 18 2023 jstat
-rwxr-xr-x 1 root root 12392 Oct 18 2023 jstatd
-rwxr-xr-x 1 root root 12392 Oct 18 2023 jwebserver
-rwxr-xr-x 1 root root 12392 Oct 18 2023 keytool
-rwxr-xr-x 1 root root 12416 Oct 18 2023 rmiregistry
-rwxr-xr-x 1 root root 12392 Oct 18 2023 serialver
+ /home/jenkins/tools/java/latest22/bin/java -version
openjdk version "22-ea" 2024-03-19
OpenJDK Runtime Environment (build 22-ea+20-1570)
OpenJDK 64-Bit Server VM (build 22-ea+20-1570, mixed mode, sharing)
+ echo which java
which java
+ which java
/home/jenkins/tools/java/latest22/bin/java
+ java -version
openjdk version "22-ea" 2024-03-19
OpenJDK Runtime Environment (build 22-ea+20-1570)
OpenJDK 64-Bit Server VM (build 22-ea+20-1570, mixed mode, sharing)
+ echo which javac
which javac
+ which javac
/home/jenkins/tools/java/latest22/bin/javac
+ javac -version
javac 22-ea
+ echo Ant-Home:
Ant-Home:
+ ls -al
total 416
drwxr-xr-x 11 jenkins jenkins 4096 Apr 21 11:52 .
drwxr-xr-x 6 jenkins jenkins 4096 Apr 19 12:59 ..
-rw-r--r-- 1 jenkins jenkins 29242 Apr 21 11:52 build.gradle
-rw-r--r-- 1 jenkins jenkins 54123 Mar 17 11:52 build.xml
-rw-r--r-- 1 jenkins jenkins 11963 Mar 17 11:52 CHANGES.txt
drwxr-xr-x 3 jenkins jenkins 4096 Mar 17 11:52 .github
-rw-r--r-- 1 jenkins jenkins 14 Mar 17 11:52 .gitignore
drwxr-xr-x 4 jenkins jenkins 4096 Mar 17 11:52 .gradle
drwxr-xr-x 3 jenkins jenkins 4096 Mar 17 11:52 gradle
-rw-r--r-- 1 jenkins jenkins 1338 Mar 17 11:52 gradle.properties
-rwxr-xr-x 1 jenkins jenkins 9177 Mar 17 11:52 gradlew
-rw-r--r-- 1 jenkins jenkins 176157 Mar 17 11:52 KEYS
drwxr-xr-x 2 jenkins jenkins 4096 Mar 17 11:52 legal
-rwxr-xr-x 1 jenkins jenkins 12458 Mar 17 11:52 LICENSE-binary.txt
-rwxr-xr-x 1 jenkins jenkins 11884 Mar 17 11:52 LICENSE.txt
-rw-r--r-- 1 jenkins jenkins 2561 Mar 17 11:52 NOTICE-binary.txt
-rw-r--r-- 1 jenkins jenkins 1592 Mar 17 11:52 NOTICE.txt
-rw-r--r-- 1 jenkins jenkins 2227 Mar 17 11:52 README.txt
-rw-r--r-- 1 jenkins jenkins 10995 Mar 17 11:52 release-guide.txt
drwxr-xr-x 16 jenkins jenkins 4096 Mar 17 11:52 samples
-rw-r--r-- 1 jenkins jenkins 238 Mar 17 11:52 SECURITY.md
-rw-r--r-- 1 jenkins jenkins 661 Mar 17 11:52 settings.gradle
drwxr-xr-x 4 jenkins jenkins 4096 Mar 17 11:52 src
-rw-r--r-- 1 jenkins jenkins 359 Mar 17 11:52 STATUS
drwxr-xr-x 4 jenkins jenkins 4096 Apr 21 11:52 .svn
drwxr-xr-x 4 jenkins jenkins 4096 Mar 17 11:52 test
-rw-r--r-- 1 jenkins jenkins 3803 Mar 17 11:52 wrapper.gradle
-rw-r--r-- 1 jenkins jenkins 25 Mar 17 11:52 xbeanenv.cmd
-rwxr-xr-x 1 jenkins jenkins 27 Mar 17 11:52 xbeanenv.sh
drwxr-xr-x 2 jenkins jenkins 4096 Mar 17 11:52 xkit
+ echo which ant
which ant
+ which ant
/usr/bin/ant
+ ant -version
Apache Ant(TM) version 1.10.12 compiled on January 17 1970
+ echo <project default="test"><target name="test"><echo>Java ${ant.java.version}/${java.version}</echo><exec executable="javac"><arg value="-version"/></exec></target></project>
+ ant -f build.javacheck.xml -v
Apache Ant(TM) version 1.10.12 compiled on January 17 1970
Buildfile: <https://ci-builds.apache.org/job/POI/job/POI-XMLBeans-DSL-1.22/ws/build.javacheck.xml>
Detected Java version: 22 in: /usr/local/asfpackages/java/openjdk-22-ea+20
Detected OS: Linux
parsing buildfile <https://ci-builds.apache.org/job/POI/job/POI-XMLBeans-DSL-1.22/ws/build.javacheck.xml> with URI = <https://ci-builds.apache.org/job/POI/job/POI-XMLBeans-DSL-1.22/ws/build.javacheck.xml>
Project base dir set to: <https://ci-builds.apache.org/job/POI/job/POI-XMLBeans-DSL-1.22/ws/>
Build sequence for target(s) `test' is [test]
Complete build sequence is [test, ]
test:
parsing buildfile jar:file:/usr/share/ant/lib/ant.jar!/org/apache/tools/ant/antlib.xml with URI = jar:file:/usr/share/ant/lib/ant.jar!/org/apache/tools/ant/antlib.xml from a zip file
[echo] Java 22/22-ea
[exec] Current OS is Linux
[exec] Executing 'javac' with arguments:
[exec] '-version'
[exec]
[exec] The ' characters around the executable and arguments are
[exec] not part of the command.
[exec] javac 22-ea
BUILD SUCCESSFUL
Total time: 0 seconds
+ exit 0
[Gradle] - Launching build.
ERROR: Not all environment variables could be successfully injected. Check for similarly-named environment variables.
[POI-XMLBeans-DSL-1.22] $ <https://ci-builds.apache.org/job/POI/job/POI-XMLBeans-DSL-1.22/ws/gradlew> clean jenkins jacocoTestReport
To honour the JVM settings for this build a single-use Daemon process will be forked. For more on this, please refer to https://docs.gradle.org/8.7/userguide/gradle_daemon.html#sec:disabling_the_daemon in the Gradle documentation.
Daemon will be stopped at the end of the build
Configuration on demand is an incubating feature.
FAILURE: Build failed with an exception.
* What went wrong:
BUG! exception in phase 'semantic analysis' in source unit '_BuildScript_' Unsupported class file major version 66
> Unsupported class file major version 66
* Try:
> Run with --stacktrace option to get the stack trace.
> Run with --info or --debug option to get more log output.
> Run with --scan to get full insights.
> Get more help at https://help.gradle.org.
BUILD FAILED in 9s
Build step 'Invoke Gradle script' changed build result to FAILURE
Build step 'Invoke Gradle script' marked build as failure
ERROR: Not all environment variables could be successfully injected. Check for similarly-named environment variables.
Archiving artifacts
ERROR: Not all environment variables could be successfully injected. Check for similarly-named environment variables.
Recording test results
ERROR: Not all environment variables could be successfully injected. Check for similarly-named environment variables.
ERROR: Step ‘Publish JUnit test result report’ failed: No test report files were found. Configuration error?
[SpotBugs] Skipping execution of recorder since overall result is 'FAILURE'
ERROR: Not all environment variables could be successfully injected. Check for similarly-named environment variables.
---------------------------------------------------------------------
To unsubscribe, e-mail: dev-unsubscribe@poi.apache.org
For additional commands, e-mail: dev-help@poi.apache.org
Build failed in Jenkins: POI » POI-XMLBeans-DSL-1.22 #20
Posted by Apache Jenkins Server <je...@builds.apache.org>.
See <https://ci-builds.apache.org/job/POI/job/POI-XMLBeans-DSL-1.22/20/display/redirect?page=changes>
Changes:
[PJ Fanning] commons-io 2.16.1
------------------------------------------
Started by an SCM change
Running as SYSTEM
ERROR: Not all environment variables could be successfully injected. Check for similarly-named environment variables.
[EnvInject] - Loading node environment variables.
[EnvInject] - Preparing an environment for the build.
[EnvInject] - Keeping Jenkins system variables.
[EnvInject] - Keeping Jenkins build variables.
[EnvInject] - Injecting as environment variables the properties content
FORREST_HOME=/home/jenkins/tools/forrest/latest
LANG=en_US.UTF-8
[EnvInject] - Variables injected successfully.
[EnvInject] - Injecting contributions.
Building remotely on builds40 (ubuntu) in workspace <https://ci-builds.apache.org/job/POI/job/POI-XMLBeans-DSL-1.22/ws/>
ERROR: Not all environment variables could be successfully injected. Check for similarly-named environment variables.
Updating https://svn.apache.org/repos/asf/xmlbeans/trunk at revision '2024-04-14T11:52:08.770 +0000'
U build.gradle
U src/main/java/org/apache/xmlbeans/impl/common/DefaultClassLoaderResourceLoader.java
U src/main/java/org/apache/xmlbeans/impl/schema/SchemaTypeLoaderImpl.java
U src/main/java/org/apache/xmlbeans/impl/schema/SchemaTypeSystemImpl.java
U src/main/java9/module-info.class
U src/test/java/xmlobject/detailed/TestsFromBugs.java
At revision 1916982
ERROR: Not all environment variables could be successfully injected. Check for similarly-named environment variables.
[POI-XMLBeans-DSL-1.22] $ /bin/sh -xe /tmp/jenkins4367824871911539433.sh
+ rm -rf examples excelant integrationtest main ooxml ooxml-schema scratchpad build.javacheck.xml
+ svn status
+ svn revert poi*/src/*/java9/module-info.*
svn: E155010: The node '<https://ci-builds.apache.org/job/POI/job/POI-XMLBeans-DSL-1.22/ws/poi*/src/*'> was not found.
+ true
+ svn revert src/resources/ooxml-lite-report.*
Skipped 'src/resources/ooxml-lite-report.*'
+ echo Java-Home: /home/jenkins/tools/java/latest22
Java-Home: /home/jenkins/tools/java/latest22
+ ls -al /home/jenkins/tools/java/latest22/
total 36
drwxr-xr-x 8 root root 4096 Nov 13 21:50 .
drwxrwxr-x 39 root root 4096 Feb 8 19:07 ..
drwxr-xr-x 2 root root 4096 Nov 13 21:50 bin
drwxr-xr-x 5 root root 4096 Nov 13 21:50 conf
drwxr-xr-x 3 root root 4096 Nov 13 21:50 include
drwxr-xr-x 2 root root 4096 Nov 13 21:50 jmods
drwxr-xr-x 71 root root 4096 Nov 13 21:50 legal
drwxr-xr-x 5 root root 4096 Nov 13 21:50 lib
-rw-r--r-- 1 root root 1220 Oct 18 14:34 release
+ ls -al /home/jenkins/tools/java/latest22/bin
total 472
drwxr-xr-x 2 root root 4096 Nov 13 21:50 .
drwxr-xr-x 8 root root 4096 Nov 13 21:50 ..
-rwxr-xr-x 1 root root 12384 Oct 18 14:34 jar
-rwxr-xr-x 1 root root 12392 Oct 18 14:34 jarsigner
-rwxr-xr-x 1 root root 12328 Oct 18 14:34 java
-rwxr-xr-x 1 root root 12416 Oct 18 14:34 javac
-rwxr-xr-x 1 root root 12424 Oct 18 14:34 javadoc
-rwxr-xr-x 1 root root 12384 Oct 18 14:34 javap
-rwxr-xr-x 1 root root 12384 Oct 18 14:34 jcmd
-rwxr-xr-x 1 root root 12456 Oct 18 14:34 jconsole
-rwxr-xr-x 1 root root 12384 Oct 18 14:34 jdb
-rwxr-xr-x 1 root root 12392 Oct 18 14:34 jdeprscan
-rwxr-xr-x 1 root root 12384 Oct 18 14:34 jdeps
-rwxr-xr-x 1 root root 12384 Oct 18 14:34 jfr
-rwxr-xr-x 1 root root 12384 Oct 18 14:34 jhsdb
-rwxr-xr-x 1 root root 12392 Oct 18 14:34 jimage
-rwxr-xr-x 1 root root 12416 Oct 18 14:34 jinfo
-rwxr-xr-x 1 root root 12416 Oct 18 14:34 jlink
-rwxr-xr-x 1 root root 12416 Oct 18 14:34 jmap
-rwxr-xr-x 1 root root 12384 Oct 18 14:34 jmod
-rwxr-xr-x 1 root root 12392 Oct 18 14:34 jpackage
-rwxr-xr-x 1 root root 12384 Oct 18 14:34 jps
-rwxr-xr-x 1 root root 12424 Oct 18 14:34 jrunscript
-rwxr-xr-x 1 root root 12392 Oct 18 14:34 jshell
-rwxr-xr-x 1 root root 12424 Oct 18 14:34 jstack
-rwxr-xr-x 1 root root 12384 Oct 18 14:34 jstat
-rwxr-xr-x 1 root root 12392 Oct 18 14:34 jstatd
-rwxr-xr-x 1 root root 12392 Oct 18 14:34 jwebserver
-rwxr-xr-x 1 root root 12392 Oct 18 14:34 keytool
-rwxr-xr-x 1 root root 12416 Oct 18 14:34 rmiregistry
-rwxr-xr-x 1 root root 12392 Oct 18 14:34 serialver
+ /home/jenkins/tools/java/latest22/bin/java -version
openjdk version "22-ea" 2024-03-19
OpenJDK Runtime Environment (build 22-ea+20-1570)
OpenJDK 64-Bit Server VM (build 22-ea+20-1570, mixed mode, sharing)
+ echo which java
which java
+ which java
/home/jenkins/tools/java/latest22/bin/java
+ java -version
openjdk version "22-ea" 2024-03-19
OpenJDK Runtime Environment (build 22-ea+20-1570)
OpenJDK 64-Bit Server VM (build 22-ea+20-1570, mixed mode, sharing)
+ echo which javac
which javac
+ which javac
/home/jenkins/tools/java/latest22/bin/javac
+ javac -version
javac 22-ea
+ echo Ant-Home:
Ant-Home:
+ ls -al
total 416
drwxr-xr-x 11 jenkins jenkins 4096 Apr 14 11:52 .
drwxr-xr-x 4 jenkins jenkins 4096 Mar 28 09:03 ..
-rw-r--r-- 1 jenkins jenkins 29242 Apr 14 11:52 build.gradle
-rw-r--r-- 1 jenkins jenkins 54123 Mar 17 11:52 build.xml
-rw-r--r-- 1 jenkins jenkins 11963 Mar 17 11:52 CHANGES.txt
drwxr-xr-x 3 jenkins jenkins 4096 Mar 17 11:52 .github
-rw-r--r-- 1 jenkins jenkins 14 Mar 17 11:52 .gitignore
drwxr-xr-x 4 jenkins jenkins 4096 Mar 17 11:52 .gradle
drwxr-xr-x 3 jenkins jenkins 4096 Mar 17 11:52 gradle
-rw-r--r-- 1 jenkins jenkins 1338 Mar 17 11:52 gradle.properties
-rwxr-xr-x 1 jenkins jenkins 9177 Mar 17 11:52 gradlew
-rw-r--r-- 1 jenkins jenkins 176157 Mar 17 11:52 KEYS
drwxr-xr-x 2 jenkins jenkins 4096 Mar 17 11:52 legal
-rwxr-xr-x 1 jenkins jenkins 12458 Mar 17 11:52 LICENSE-binary.txt
-rwxr-xr-x 1 jenkins jenkins 11884 Mar 17 11:52 LICENSE.txt
-rw-r--r-- 1 jenkins jenkins 2561 Mar 17 11:52 NOTICE-binary.txt
-rw-r--r-- 1 jenkins jenkins 1592 Mar 17 11:52 NOTICE.txt
-rw-r--r-- 1 jenkins jenkins 2227 Mar 17 11:52 README.txt
-rw-r--r-- 1 jenkins jenkins 10995 Mar 17 11:52 release-guide.txt
drwxr-xr-x 16 jenkins jenkins 4096 Mar 17 11:52 samples
-rw-r--r-- 1 jenkins jenkins 238 Mar 17 11:52 SECURITY.md
-rw-r--r-- 1 jenkins jenkins 661 Mar 17 11:52 settings.gradle
drwxr-xr-x 4 jenkins jenkins 4096 Mar 17 11:52 src
-rw-r--r-- 1 jenkins jenkins 359 Mar 17 11:52 STATUS
drwxr-xr-x 4 jenkins jenkins 4096 Apr 14 11:52 .svn
drwxr-xr-x 4 jenkins jenkins 4096 Mar 17 11:52 test
-rw-r--r-- 1 jenkins jenkins 3803 Mar 17 11:52 wrapper.gradle
-rw-r--r-- 1 jenkins jenkins 25 Mar 17 11:52 xbeanenv.cmd
-rwxr-xr-x 1 jenkins jenkins 27 Mar 17 11:52 xbeanenv.sh
drwxr-xr-x 2 jenkins jenkins 4096 Mar 17 11:52 xkit
+ echo which ant
which ant
+ which ant
/usr/bin/ant
+ ant -version
Apache Ant(TM) version 1.10.12 compiled on January 17 1970
+ echo <project default="test"><target name="test"><echo>Java ${ant.java.version}/${java.version}</echo><exec executable="javac"><arg value="-version"/></exec></target></project>
+ ant -f build.javacheck.xml -v
Apache Ant(TM) version 1.10.12 compiled on January 17 1970
Buildfile: <https://ci-builds.apache.org/job/POI/job/POI-XMLBeans-DSL-1.22/ws/build.javacheck.xml>
Detected Java version: 22 in: /usr/local/asfpackages/java/openjdk-22-ea+20
Detected OS: Linux
parsing buildfile <https://ci-builds.apache.org/job/POI/job/POI-XMLBeans-DSL-1.22/ws/build.javacheck.xml> with URI = <https://ci-builds.apache.org/job/POI/job/POI-XMLBeans-DSL-1.22/ws/build.javacheck.xml>
Project base dir set to: <https://ci-builds.apache.org/job/POI/job/POI-XMLBeans-DSL-1.22/ws/>
Build sequence for target(s) `test' is [test]
Complete build sequence is [test, ]
test:
parsing buildfile jar:file:/usr/share/ant/lib/ant.jar!/org/apache/tools/ant/antlib.xml with URI = jar:file:/usr/share/ant/lib/ant.jar!/org/apache/tools/ant/antlib.xml from a zip file
[echo] Java 22/22-ea
[exec] Current OS is Linux
[exec] Executing 'javac' with arguments:
[exec] '-version'
[exec]
[exec] The ' characters around the executable and arguments are
[exec] not part of the command.
[exec] javac 22-ea
BUILD SUCCESSFUL
Total time: 1 second
+ exit 0
[Gradle] - Launching build.
ERROR: Not all environment variables could be successfully injected. Check for similarly-named environment variables.
[POI-XMLBeans-DSL-1.22] $ <https://ci-builds.apache.org/job/POI/job/POI-XMLBeans-DSL-1.22/ws/gradlew> clean jenkins jacocoTestReport
To honour the JVM settings for this build a single-use Daemon process will be forked. For more on this, please refer to https://docs.gradle.org/8.6/userguide/gradle_daemon.html#sec:disabling_the_daemon in the Gradle documentation.
Daemon will be stopped at the end of the build
Configuration on demand is an incubating feature.
FAILURE: Build failed with an exception.
* What went wrong:
Could not open settings generic class cache for settings file '<https://ci-builds.apache.org/job/POI/job/POI-XMLBeans-DSL-1.22/ws/settings.gradle'> (/home/jenkins/.gradle/caches/8.6/scripts/f1vtb3f18o718s5f2prqhsmqz).
> BUG! exception in phase 'semantic analysis' in source unit '_BuildScript_' Unsupported class file major version 66
* Try:
> Run with --stacktrace option to get the stack trace.
> Run with --info or --debug option to get more log output.
> Run with --scan to get full insights.
> Get more help at https://help.gradle.org.
BUILD FAILED in 11s
Build step 'Invoke Gradle script' changed build result to FAILURE
Build step 'Invoke Gradle script' marked build as failure
ERROR: Not all environment variables could be successfully injected. Check for similarly-named environment variables.
Archiving artifacts
ERROR: Not all environment variables could be successfully injected. Check for similarly-named environment variables.
Recording test results
ERROR: Not all environment variables could be successfully injected. Check for similarly-named environment variables.
ERROR: Step ‘Publish JUnit test result report’ failed: No test report files were found. Configuration error?
[SpotBugs] Skipping execution of recorder since overall result is 'FAILURE'
ERROR: Not all environment variables could be successfully injected. Check for similarly-named environment variables.
---------------------------------------------------------------------
To unsubscribe, e-mail: dev-unsubscribe@poi.apache.org
For additional commands, e-mail: dev-help@poi.apache.org
Build failed in Jenkins: POI » POI-XMLBeans-DSL-1.22 #19
Posted by Apache Jenkins Server <je...@builds.apache.org>.
See <https://ci-builds.apache.org/job/POI/job/POI-XMLBeans-DSL-1.22/19/display/redirect?page=changes>
Changes:
[PJ Fanning] commons-io 2.16.0
------------------------------------------
[...truncated 7.49 MB...]
At edu.umd.cs.findbugs.classfile.engine.asm.ClassReaderAnalysisEngine.analyze(ClassReaderAnalysisEngine.java:48)
At edu.umd.cs.findbugs.classfile.engine.asm.ClassReaderAnalysisEngine.analyze(ClassReaderAnalysisEngine.java:34)
At edu.umd.cs.findbugs.classfile.impl.AnalysisCache.getClassAnalysis(AnalysisCache.java:261)
At edu.umd.cs.findbugs.classfile.engine.ClassInfoAnalysisEngine.analyze(ClassInfoAnalysisEngine.java:75)
At edu.umd.cs.findbugs.classfile.engine.ClassInfoAnalysisEngine.analyze(ClassInfoAnalysisEngine.java:38)
At edu.umd.cs.findbugs.classfile.impl.AnalysisCache.getClassAnalysis(AnalysisCache.java:261)
At edu.umd.cs.findbugs.ba.XFactory.getXClass(XFactory.java:693)
At edu.umd.cs.findbugs.ba.AnalysisContext.setAppClassList(AnalysisContext.java:975)
At edu.umd.cs.findbugs.FindBugs2.setAppClassList(FindBugs2.java:909)
At edu.umd.cs.findbugs.FindBugs2.execute(FindBugs2.java:252)
At edu.umd.cs.findbugs.FindBugs.runMain(FindBugs.java:395)
At edu.umd.cs.findbugs.FindBugs2.main(FindBugs2.java:1231)
Couldn't get class info for java/lang/LinkageError
java.lang.IllegalArgumentException: Unsupported class file major version 66
At org.objectweb.asm.ClassReader.<init>(ClassReader.java:199)
At org.objectweb.asm.ClassReader.<init>(ClassReader.java:180)
At org.objectweb.asm.ClassReader.<init>(ClassReader.java:166)
At edu.umd.cs.findbugs.asm.FBClassReader.<init>(FBClassReader.java:35)
At edu.umd.cs.findbugs.classfile.engine.asm.ClassReaderAnalysisEngine.analyze(ClassReaderAnalysisEngine.java:48)
At edu.umd.cs.findbugs.classfile.engine.asm.ClassReaderAnalysisEngine.analyze(ClassReaderAnalysisEngine.java:34)
At edu.umd.cs.findbugs.classfile.impl.AnalysisCache.getClassAnalysis(AnalysisCache.java:261)
At edu.umd.cs.findbugs.classfile.engine.ClassInfoAnalysisEngine.analyze(ClassInfoAnalysisEngine.java:75)
At edu.umd.cs.findbugs.classfile.engine.ClassInfoAnalysisEngine.analyze(ClassInfoAnalysisEngine.java:38)
At edu.umd.cs.findbugs.classfile.impl.AnalysisCache.getClassAnalysis(AnalysisCache.java:261)
At edu.umd.cs.findbugs.ba.XFactory.getXClass(XFactory.java:693)
At edu.umd.cs.findbugs.ba.AnalysisContext.setAppClassList(AnalysisContext.java:975)
At edu.umd.cs.findbugs.FindBugs2.setAppClassList(FindBugs2.java:909)
At edu.umd.cs.findbugs.FindBugs2.execute(FindBugs2.java:252)
At edu.umd.cs.findbugs.FindBugs.runMain(FindBugs.java:395)
At edu.umd.cs.findbugs.FindBugs2.main(FindBugs2.java:1231)
Couldn't get class info for java/io/File
java.lang.IllegalArgumentException: Unsupported class file major version 66
At org.objectweb.asm.ClassReader.<init>(ClassReader.java:199)
At org.objectweb.asm.ClassReader.<init>(ClassReader.java:180)
At org.objectweb.asm.ClassReader.<init>(ClassReader.java:166)
At edu.umd.cs.findbugs.asm.FBClassReader.<init>(FBClassReader.java:35)
At edu.umd.cs.findbugs.classfile.engine.asm.ClassReaderAnalysisEngine.analyze(ClassReaderAnalysisEngine.java:48)
At edu.umd.cs.findbugs.classfile.engine.asm.ClassReaderAnalysisEngine.analyze(ClassReaderAnalysisEngine.java:34)
At edu.umd.cs.findbugs.classfile.impl.AnalysisCache.getClassAnalysis(AnalysisCache.java:261)
At edu.umd.cs.findbugs.classfile.engine.ClassInfoAnalysisEngine.analyze(ClassInfoAnalysisEngine.java:75)
At edu.umd.cs.findbugs.classfile.engine.ClassInfoAnalysisEngine.analyze(ClassInfoAnalysisEngine.java:38)
At edu.umd.cs.findbugs.classfile.impl.AnalysisCache.getClassAnalysis(AnalysisCache.java:261)
At edu.umd.cs.findbugs.ba.XFactory.getXClass(XFactory.java:693)
At edu.umd.cs.findbugs.ba.AnalysisContext.setAppClassList(AnalysisContext.java:975)
At edu.umd.cs.findbugs.FindBugs2.setAppClassList(FindBugs2.java:909)
At edu.umd.cs.findbugs.FindBugs2.execute(FindBugs2.java:252)
At edu.umd.cs.findbugs.FindBugs.runMain(FindBugs.java:395)
At edu.umd.cs.findbugs.FindBugs2.main(FindBugs2.java:1231)
Couldn't get class info for java/nio/file/attribute/FileAttribute
java.lang.IllegalArgumentException: Unsupported class file major version 66
At org.objectweb.asm.ClassReader.<init>(ClassReader.java:199)
At org.objectweb.asm.ClassReader.<init>(ClassReader.java:180)
At org.objectweb.asm.ClassReader.<init>(ClassReader.java:166)
At edu.umd.cs.findbugs.asm.FBClassReader.<init>(FBClassReader.java:35)
At edu.umd.cs.findbugs.classfile.engine.asm.ClassReaderAnalysisEngine.analyze(ClassReaderAnalysisEngine.java:48)
At edu.umd.cs.findbugs.classfile.engine.asm.ClassReaderAnalysisEngine.analyze(ClassReaderAnalysisEngine.java:34)
At edu.umd.cs.findbugs.classfile.impl.AnalysisCache.getClassAnalysis(AnalysisCache.java:261)
At edu.umd.cs.findbugs.classfile.engine.ClassInfoAnalysisEngine.analyze(ClassInfoAnalysisEngine.java:75)
At edu.umd.cs.findbugs.classfile.engine.ClassInfoAnalysisEngine.analyze(ClassInfoAnalysisEngine.java:38)
At edu.umd.cs.findbugs.classfile.impl.AnalysisCache.getClassAnalysis(AnalysisCache.java:261)
At edu.umd.cs.findbugs.ba.XFactory.getXClass(XFactory.java:693)
At edu.umd.cs.findbugs.ba.AnalysisContext.setAppClassList(AnalysisContext.java:975)
At edu.umd.cs.findbugs.FindBugs2.setAppClassList(FindBugs2.java:909)
At edu.umd.cs.findbugs.FindBugs2.execute(FindBugs2.java:252)
At edu.umd.cs.findbugs.FindBugs.runMain(FindBugs.java:395)
At edu.umd.cs.findbugs.FindBugs2.main(FindBugs2.java:1231)
Couldn't get class info for java/util/Calendar
java.lang.IllegalArgumentException: Unsupported class file major version 66
At org.objectweb.asm.ClassReader.<init>(ClassReader.java:199)
At org.objectweb.asm.ClassReader.<init>(ClassReader.java:180)
At org.objectweb.asm.ClassReader.<init>(ClassReader.java:166)
At edu.umd.cs.findbugs.asm.FBClassReader.<init>(FBClassReader.java:35)
At edu.umd.cs.findbugs.classfile.engine.asm.ClassReaderAnalysisEngine.analyze(ClassReaderAnalysisEngine.java:48)
At edu.umd.cs.findbugs.classfile.engine.asm.ClassReaderAnalysisEngine.analyze(ClassReaderAnalysisEngine.java:34)
At edu.umd.cs.findbugs.classfile.impl.AnalysisCache.getClassAnalysis(AnalysisCache.java:261)
At edu.umd.cs.findbugs.classfile.engine.ClassInfoAnalysisEngine.analyze(ClassInfoAnalysisEngine.java:75)
At edu.umd.cs.findbugs.classfile.engine.ClassInfoAnalysisEngine.analyze(ClassInfoAnalysisEngine.java:38)
At edu.umd.cs.findbugs.classfile.impl.AnalysisCache.getClassAnalysis(AnalysisCache.java:261)
At edu.umd.cs.findbugs.ba.XFactory.getXClass(XFactory.java:693)
At edu.umd.cs.findbugs.ba.AnalysisContext.setAppClassList(AnalysisContext.java:975)
At edu.umd.cs.findbugs.FindBugs2.setAppClassList(FindBugs2.java:909)
At edu.umd.cs.findbugs.FindBugs2.execute(FindBugs2.java:252)
At edu.umd.cs.findbugs.FindBugs.runMain(FindBugs.java:395)
At edu.umd.cs.findbugs.FindBugs2.main(FindBugs2.java:1231)
Couldn't get class info for java/util/Random
java.lang.IllegalArgumentException: Unsupported class file major version 66
At org.objectweb.asm.ClassReader.<init>(ClassReader.java:199)
At org.objectweb.asm.ClassReader.<init>(ClassReader.java:180)
At org.objectweb.asm.ClassReader.<init>(ClassReader.java:166)
At edu.umd.cs.findbugs.asm.FBClassReader.<init>(FBClassReader.java:35)
At edu.umd.cs.findbugs.classfile.engine.asm.ClassReaderAnalysisEngine.analyze(ClassReaderAnalysisEngine.java:48)
At edu.umd.cs.findbugs.classfile.engine.asm.ClassReaderAnalysisEngine.analyze(ClassReaderAnalysisEngine.java:34)
At edu.umd.cs.findbugs.classfile.impl.AnalysisCache.getClassAnalysis(AnalysisCache.java:261)
At edu.umd.cs.findbugs.classfile.engine.ClassInfoAnalysisEngine.analyze(ClassInfoAnalysisEngine.java:75)
At edu.umd.cs.findbugs.classfile.engine.ClassInfoAnalysisEngine.analyze(ClassInfoAnalysisEngine.java:38)
At edu.umd.cs.findbugs.classfile.impl.AnalysisCache.getClassAnalysis(AnalysisCache.java:261)
At edu.umd.cs.findbugs.ba.XFactory.getXClass(XFactory.java:693)
At edu.umd.cs.findbugs.ba.AnalysisContext.setAppClassList(AnalysisContext.java:975)
At edu.umd.cs.findbugs.FindBugs2.setAppClassList(FindBugs2.java:909)
At edu.umd.cs.findbugs.FindBugs2.execute(FindBugs2.java:252)
At edu.umd.cs.findbugs.FindBugs.runMain(FindBugs.java:395)
At edu.umd.cs.findbugs.FindBugs2.main(FindBugs2.java:1231)
Couldn't get class info for java/util/Locale
java.lang.IllegalArgumentException: Unsupported class file major version 66
At org.objectweb.asm.ClassReader.<init>(ClassReader.java:199)
At org.objectweb.asm.ClassReader.<init>(ClassReader.java:180)
At org.objectweb.asm.ClassReader.<init>(ClassReader.java:166)
At edu.umd.cs.findbugs.asm.FBClassReader.<init>(FBClassReader.java:35)
At edu.umd.cs.findbugs.classfile.engine.asm.ClassReaderAnalysisEngine.analyze(ClassReaderAnalysisEngine.java:48)
At edu.umd.cs.findbugs.classfile.engine.asm.ClassReaderAnalysisEngine.analyze(ClassReaderAnalysisEngine.java:34)
At edu.umd.cs.findbugs.classfile.impl.AnalysisCache.getClassAnalysis(AnalysisCache.java:261)
At edu.umd.cs.findbugs.classfile.engine.ClassInfoAnalysisEngine.analyze(ClassInfoAnalysisEngine.java:75)
At edu.umd.cs.findbugs.classfile.engine.ClassInfoAnalysisEngine.analyze(ClassInfoAnalysisEngine.java:38)
At edu.umd.cs.findbugs.classfile.impl.AnalysisCache.getClassAnalysis(AnalysisCache.java:261)
At edu.umd.cs.findbugs.ba.XFactory.getXClass(XFactory.java:693)
At edu.umd.cs.findbugs.ba.AnalysisContext.setAppClassList(AnalysisContext.java:975)
At edu.umd.cs.findbugs.FindBugs2.setAppClassList(FindBugs2.java:909)
At edu.umd.cs.findbugs.FindBugs2.execute(FindBugs2.java:252)
At edu.umd.cs.findbugs.FindBugs.runMain(FindBugs.java:395)
At edu.umd.cs.findbugs.FindBugs2.main(FindBugs2.java:1231)
Couldn't get class info for java/lang/AssertionError
java.lang.IllegalArgumentException: Unsupported class file major version 66
At org.objectweb.asm.ClassReader.<init>(ClassReader.java:199)
At org.objectweb.asm.ClassReader.<init>(ClassReader.java:180)
At org.objectweb.asm.ClassReader.<init>(ClassReader.java:166)
At edu.umd.cs.findbugs.asm.FBClassReader.<init>(FBClassReader.java:35)
At edu.umd.cs.findbugs.classfile.engine.asm.ClassReaderAnalysisEngine.analyze(ClassReaderAnalysisEngine.java:48)
At edu.umd.cs.findbugs.classfile.engine.asm.ClassReaderAnalysisEngine.analyze(ClassReaderAnalysisEngine.java:34)
At edu.umd.cs.findbugs.classfile.impl.AnalysisCache.getClassAnalysis(AnalysisCache.java:261)
At edu.umd.cs.findbugs.classfile.engine.ClassInfoAnalysisEngine.analyze(ClassInfoAnalysisEngine.java:75)
At edu.umd.cs.findbugs.classfile.engine.ClassInfoAnalysisEngine.analyze(ClassInfoAnalysisEngine.java:38)
At edu.umd.cs.findbugs.classfile.impl.AnalysisCache.getClassAnalysis(AnalysisCache.java:261)
At edu.umd.cs.findbugs.ba.XFactory.getXClass(XFactory.java:693)
At edu.umd.cs.findbugs.ba.AnalysisContext.setAppClassList(AnalysisContext.java:975)
At edu.umd.cs.findbugs.FindBugs2.setAppClassList(FindBugs2.java:909)
At edu.umd.cs.findbugs.FindBugs2.execute(FindBugs2.java:252)
At edu.umd.cs.findbugs.FindBugs.runMain(FindBugs.java:395)
At edu.umd.cs.findbugs.FindBugs2.main(FindBugs2.java:1231)
Couldn't get class info for java/lang/NoSuchFieldException
java.lang.IllegalArgumentException: Unsupported class file major version 66
At org.objectweb.asm.ClassReader.<init>(ClassReader.java:199)
At org.objectweb.asm.ClassReader.<init>(ClassReader.java:180)
At org.objectweb.asm.ClassReader.<init>(ClassReader.java:166)
At edu.umd.cs.findbugs.asm.FBClassReader.<init>(FBClassReader.java:35)
At edu.umd.cs.findbugs.classfile.engine.asm.ClassReaderAnalysisEngine.analyze(ClassReaderAnalysisEngine.java:48)
At edu.umd.cs.findbugs.classfile.engine.asm.ClassReaderAnalysisEngine.analyze(ClassReaderAnalysisEngine.java:34)
At edu.umd.cs.findbugs.classfile.impl.AnalysisCache.getClassAnalysis(AnalysisCache.java:261)
At edu.umd.cs.findbugs.classfile.engine.ClassInfoAnalysisEngine.analyze(ClassInfoAnalysisEngine.java:75)
At edu.umd.cs.findbugs.classfile.engine.ClassInfoAnalysisEngine.analyze(ClassInfoAnalysisEngine.java:38)
At edu.umd.cs.findbugs.classfile.impl.AnalysisCache.getClassAnalysis(AnalysisCache.java:261)
At edu.umd.cs.findbugs.ba.XFactory.getXClass(XFactory.java:693)
At edu.umd.cs.findbugs.ba.AnalysisContext.setAppClassList(AnalysisContext.java:975)
At edu.umd.cs.findbugs.FindBugs2.setAppClassList(FindBugs2.java:909)
At edu.umd.cs.findbugs.FindBugs2.execute(FindBugs2.java:252)
At edu.umd.cs.findbugs.FindBugs.runMain(FindBugs.java:395)
At edu.umd.cs.findbugs.FindBugs2.main(FindBugs2.java:1231)
Couldn't get class info for java/util/Set
java.lang.IllegalArgumentException: Unsupported class file major version 66
At org.objectweb.asm.ClassReader.<init>(ClassReader.java:199)
At org.objectweb.asm.ClassReader.<init>(ClassReader.java:180)
At org.objectweb.asm.ClassReader.<init>(ClassReader.java:166)
At edu.umd.cs.findbugs.asm.FBClassReader.<init>(FBClassReader.java:35)
At edu.umd.cs.findbugs.classfile.engine.asm.ClassReaderAnalysisEngine.analyze(ClassReaderAnalysisEngine.java:48)
At edu.umd.cs.findbugs.classfile.engine.asm.ClassReaderAnalysisEngine.analyze(ClassReaderAnalysisEngine.java:34)
At edu.umd.cs.findbugs.classfile.impl.AnalysisCache.getClassAnalysis(AnalysisCache.java:261)
At edu.umd.cs.findbugs.classfile.engine.ClassInfoAnalysisEngine.analyze(ClassInfoAnalysisEngine.java:75)
At edu.umd.cs.findbugs.classfile.engine.ClassInfoAnalysisEngine.analyze(ClassInfoAnalysisEngine.java:38)
At edu.umd.cs.findbugs.classfile.impl.AnalysisCache.getClassAnalysis(AnalysisCache.java:261)
At edu.umd.cs.findbugs.ba.XFactory.getXClass(XFactory.java:693)
At edu.umd.cs.findbugs.ba.AnalysisContext.setAppClassList(AnalysisContext.java:975)
At edu.umd.cs.findbugs.FindBugs2.setAppClassList(FindBugs2.java:909)
At edu.umd.cs.findbugs.FindBugs2.execute(FindBugs2.java:252)
At edu.umd.cs.findbugs.FindBugs.runMain(FindBugs.java:395)
At edu.umd.cs.findbugs.FindBugs2.main(FindBugs2.java:1231)
Couldn't get class info for javax/xml/stream/util/StreamReaderDelegate
java.lang.IllegalArgumentException: Unsupported class file major version 66
At org.objectweb.asm.ClassReader.<init>(ClassReader.java:199)
At org.objectweb.asm.ClassReader.<init>(ClassReader.java:180)
At org.objectweb.asm.ClassReader.<init>(ClassReader.java:166)
At edu.umd.cs.findbugs.asm.FBClassReader.<init>(FBClassReader.java:35)
At edu.umd.cs.findbugs.classfile.engine.asm.ClassReaderAnalysisEngine.analyze(ClassReaderAnalysisEngine.java:48)
At edu.umd.cs.findbugs.classfile.engine.asm.ClassReaderAnalysisEngine.analyze(ClassReaderAnalysisEngine.java:34)
At edu.umd.cs.findbugs.classfile.impl.AnalysisCache.getClassAnalysis(AnalysisCache.java:261)
At edu.umd.cs.findbugs.classfile.engine.ClassInfoAnalysisEngine.analyze(ClassInfoAnalysisEngine.java:75)
At edu.umd.cs.findbugs.classfile.engine.ClassInfoAnalysisEngine.analyze(ClassInfoAnalysisEngine.java:38)
At edu.umd.cs.findbugs.classfile.impl.AnalysisCache.getClassAnalysis(AnalysisCache.java:261)
At edu.umd.cs.findbugs.FindBugs2.buildReferencedClassSet(FindBugs2.java:806)
At edu.umd.cs.findbugs.FindBugs2.execute(FindBugs2.java:249)
At edu.umd.cs.findbugs.FindBugs.runMain(FindBugs.java:395)
At edu.umd.cs.findbugs.FindBugs2.main(FindBugs2.java:1231)
java.lang.IllegalArgumentException: Unsupported class file major version 66
at org.objectweb.asm.ClassReader.<init>(ClassReader.java:199)
at org.objectweb.asm.ClassReader.<init>(ClassReader.java:180)
at org.objectweb.asm.ClassReader.<init>(ClassReader.java:166)
at edu.umd.cs.findbugs.asm.FBClassReader.<init>(FBClassReader.java:35)
at edu.umd.cs.findbugs.classfile.engine.asm.ClassReaderAnalysisEngine.analyze(ClassReaderAnalysisEngine.java:48)
at edu.umd.cs.findbugs.classfile.engine.asm.ClassReaderAnalysisEngine.analyze(ClassReaderAnalysisEngine.java:34)
at edu.umd.cs.findbugs.classfile.impl.AnalysisCache.getClassAnalysis(AnalysisCache.java:261)
at edu.umd.cs.findbugs.classfile.engine.ClassInfoAnalysisEngine.analyze(ClassInfoAnalysisEngine.java:75)
at edu.umd.cs.findbugs.classfile.engine.ClassInfoAnalysisEngine.analyze(ClassInfoAnalysisEngine.java:38)
at edu.umd.cs.findbugs.classfile.impl.AnalysisCache.getClassAnalysis(AnalysisCache.java:261)
at edu.umd.cs.findbugs.ba.XFactory.getXClass(XFactory.java:693)
at edu.umd.cs.findbugs.ba.AnalysisContext.setAppClassList(AnalysisContext.java:975)
at edu.umd.cs.findbugs.FindBugs2.setAppClassList(FindBugs2.java:909)
at edu.umd.cs.findbugs.FindBugs2.execute(FindBugs2.java:252)
at edu.umd.cs.findbugs.FindBugs.runMain(FindBugs.java:395)
at edu.umd.cs.findbugs.FindBugs2.main(FindBugs2.java:1231)
SpotBugs ended with exit code 4
> Task :test
ParserTest > testXmlInputFactoryPropertyDefaults() FAILED
org.opentest4j.AssertionFailedError at ParserTest.java:70
ParserTest > testXmlInputFactoryPropertyOverrides() FAILED
org.opentest4j.AssertionFailedError at ParserTest.java:81
2964 tests completed, 2 failed, 170 skipped
> Task :test FAILED
FAILURE: Build failed with an exception.
* What went wrong:
Execution failed for task ':test'.
> There were failing tests. See the report at: file://<https://ci-builds.apache.org/job/POI/job/POI-XMLBeans-DSL-1.22/ws/build/reports/tests/test/index.html>
* Try:
> Run with --scan to get full insights.
Deprecated Gradle features were used in this build, making it incompatible with Gradle 9.0.
You can use '--warning-mode all' to show the individual deprecation warnings and determine if they come from your own scripts or plugins.
For more on this, please refer to https://docs.gradle.org/8.6/userguide/command_line_interface.html#sec:command_line_warnings in the Gradle documentation.
BUILD FAILED in 6m 56s
45 actionable tasks: 37 executed, 5 from cache, 3 up-to-date
Build step 'Invoke Gradle script' changed build result to FAILURE
Build step 'Invoke Gradle script' marked build as failure
ERROR: Not all environment variables could be successfully injected. Check for similarly-named environment variables.
Archiving artifacts
ERROR: Not all environment variables could be successfully injected. Check for similarly-named environment variables.
Recording test results
ERROR: Not all environment variables could be successfully injected. Check for similarly-named environment variables.
[Checks API] No suitable checks publisher found.
[SpotBugs] Skipping execution of recorder since overall result is 'FAILURE'
ERROR: Not all environment variables could be successfully injected. Check for similarly-named environment variables.
---------------------------------------------------------------------
To unsubscribe, e-mail: dev-unsubscribe@poi.apache.org
For additional commands, e-mail: dev-help@poi.apache.org
Build failed in Jenkins: POI » POI-XMLBeans-DSL-1.22 #18
Posted by Apache Jenkins Server <je...@builds.apache.org>.
See <https://ci-builds.apache.org/job/POI/job/POI-XMLBeans-DSL-1.22/18/display/redirect?page=changes>
Changes:
[PJ Fanning] [XMLBEANS-648] issue with compiling XSDs when using modularized runtimes. Thanks to Rodrigo Merino. This closes #13
------------------------------------------
[...truncated 11.49 MB...]
At edu.umd.cs.findbugs.classfile.engine.asm.ClassReaderAnalysisEngine.analyze(ClassReaderAnalysisEngine.java:48)
At edu.umd.cs.findbugs.classfile.engine.asm.ClassReaderAnalysisEngine.analyze(ClassReaderAnalysisEngine.java:34)
At edu.umd.cs.findbugs.classfile.impl.AnalysisCache.getClassAnalysis(AnalysisCache.java:261)
At edu.umd.cs.findbugs.classfile.engine.ClassInfoAnalysisEngine.analyze(ClassInfoAnalysisEngine.java:75)
At edu.umd.cs.findbugs.classfile.engine.ClassInfoAnalysisEngine.analyze(ClassInfoAnalysisEngine.java:38)
At edu.umd.cs.findbugs.classfile.impl.AnalysisCache.getClassAnalysis(AnalysisCache.java:261)
At edu.umd.cs.findbugs.ba.XFactory.getXClass(XFactory.java:693)
At edu.umd.cs.findbugs.ba.AnalysisContext.setAppClassList(AnalysisContext.java:975)
At edu.umd.cs.findbugs.FindBugs2.setAppClassList(FindBugs2.java:909)
At edu.umd.cs.findbugs.FindBugs2.execute(FindBugs2.java:252)
At edu.umd.cs.findbugs.FindBugs.runMain(FindBugs.java:395)
At edu.umd.cs.findbugs.FindBugs2.main(FindBugs2.java:1231)
Couldn't get class info for java/lang/LinkageError
java.lang.IllegalArgumentException: Unsupported class file major version 66
At org.objectweb.asm.ClassReader.<init>(ClassReader.java:199)
At org.objectweb.asm.ClassReader.<init>(ClassReader.java:180)
At org.objectweb.asm.ClassReader.<init>(ClassReader.java:166)
At edu.umd.cs.findbugs.asm.FBClassReader.<init>(FBClassReader.java:35)
At edu.umd.cs.findbugs.classfile.engine.asm.ClassReaderAnalysisEngine.analyze(ClassReaderAnalysisEngine.java:48)
At edu.umd.cs.findbugs.classfile.engine.asm.ClassReaderAnalysisEngine.analyze(ClassReaderAnalysisEngine.java:34)
At edu.umd.cs.findbugs.classfile.impl.AnalysisCache.getClassAnalysis(AnalysisCache.java:261)
At edu.umd.cs.findbugs.classfile.engine.ClassInfoAnalysisEngine.analyze(ClassInfoAnalysisEngine.java:75)
At edu.umd.cs.findbugs.classfile.engine.ClassInfoAnalysisEngine.analyze(ClassInfoAnalysisEngine.java:38)
At edu.umd.cs.findbugs.classfile.impl.AnalysisCache.getClassAnalysis(AnalysisCache.java:261)
At edu.umd.cs.findbugs.ba.XFactory.getXClass(XFactory.java:693)
At edu.umd.cs.findbugs.ba.AnalysisContext.setAppClassList(AnalysisContext.java:975)
At edu.umd.cs.findbugs.FindBugs2.setAppClassList(FindBugs2.java:909)
At edu.umd.cs.findbugs.FindBugs2.execute(FindBugs2.java:252)
At edu.umd.cs.findbugs.FindBugs.runMain(FindBugs.java:395)
At edu.umd.cs.findbugs.FindBugs2.main(FindBugs2.java:1231)
Couldn't get class info for java/io/File
java.lang.IllegalArgumentException: Unsupported class file major version 66
At org.objectweb.asm.ClassReader.<init>(ClassReader.java:199)
At org.objectweb.asm.ClassReader.<init>(ClassReader.java:180)
At org.objectweb.asm.ClassReader.<init>(ClassReader.java:166)
At edu.umd.cs.findbugs.asm.FBClassReader.<init>(FBClassReader.java:35)
At edu.umd.cs.findbugs.classfile.engine.asm.ClassReaderAnalysisEngine.analyze(ClassReaderAnalysisEngine.java:48)
At edu.umd.cs.findbugs.classfile.engine.asm.ClassReaderAnalysisEngine.analyze(ClassReaderAnalysisEngine.java:34)
At edu.umd.cs.findbugs.classfile.impl.AnalysisCache.getClassAnalysis(AnalysisCache.java:261)
At edu.umd.cs.findbugs.classfile.engine.ClassInfoAnalysisEngine.analyze(ClassInfoAnalysisEngine.java:75)
At edu.umd.cs.findbugs.classfile.engine.ClassInfoAnalysisEngine.analyze(ClassInfoAnalysisEngine.java:38)
At edu.umd.cs.findbugs.classfile.impl.AnalysisCache.getClassAnalysis(AnalysisCache.java:261)
At edu.umd.cs.findbugs.ba.XFactory.getXClass(XFactory.java:693)
At edu.umd.cs.findbugs.ba.AnalysisContext.setAppClassList(AnalysisContext.java:975)
At edu.umd.cs.findbugs.FindBugs2.setAppClassList(FindBugs2.java:909)
At edu.umd.cs.findbugs.FindBugs2.execute(FindBugs2.java:252)
At edu.umd.cs.findbugs.FindBugs.runMain(FindBugs.java:395)
At edu.umd.cs.findbugs.FindBugs2.main(FindBugs2.java:1231)
Couldn't get class info for java/nio/file/attribute/FileAttribute
java.lang.IllegalArgumentException: Unsupported class file major version 66
At org.objectweb.asm.ClassReader.<init>(ClassReader.java:199)
At org.objectweb.asm.ClassReader.<init>(ClassReader.java:180)
At org.objectweb.asm.ClassReader.<init>(ClassReader.java:166)
At edu.umd.cs.findbugs.asm.FBClassReader.<init>(FBClassReader.java:35)
At edu.umd.cs.findbugs.classfile.engine.asm.ClassReaderAnalysisEngine.analyze(ClassReaderAnalysisEngine.java:48)
At edu.umd.cs.findbugs.classfile.engine.asm.ClassReaderAnalysisEngine.analyze(ClassReaderAnalysisEngine.java:34)
At edu.umd.cs.findbugs.classfile.impl.AnalysisCache.getClassAnalysis(AnalysisCache.java:261)
At edu.umd.cs.findbugs.classfile.engine.ClassInfoAnalysisEngine.analyze(ClassInfoAnalysisEngine.java:75)
At edu.umd.cs.findbugs.classfile.engine.ClassInfoAnalysisEngine.analyze(ClassInfoAnalysisEngine.java:38)
At edu.umd.cs.findbugs.classfile.impl.AnalysisCache.getClassAnalysis(AnalysisCache.java:261)
At edu.umd.cs.findbugs.ba.XFactory.getXClass(XFactory.java:693)
At edu.umd.cs.findbugs.ba.AnalysisContext.setAppClassList(AnalysisContext.java:975)
At edu.umd.cs.findbugs.FindBugs2.setAppClassList(FindBugs2.java:909)
At edu.umd.cs.findbugs.FindBugs2.execute(FindBugs2.java:252)
At edu.umd.cs.findbugs.FindBugs.runMain(FindBugs.java:395)
At edu.umd.cs.findbugs.FindBugs2.main(FindBugs2.java:1231)
Couldn't get class info for java/util/Calendar
java.lang.IllegalArgumentException: Unsupported class file major version 66
At org.objectweb.asm.ClassReader.<init>(ClassReader.java:199)
At org.objectweb.asm.ClassReader.<init>(ClassReader.java:180)
At org.objectweb.asm.ClassReader.<init>(ClassReader.java:166)
At edu.umd.cs.findbugs.asm.FBClassReader.<init>(FBClassReader.java:35)
At edu.umd.cs.findbugs.classfile.engine.asm.ClassReaderAnalysisEngine.analyze(ClassReaderAnalysisEngine.java:48)
At edu.umd.cs.findbugs.classfile.engine.asm.ClassReaderAnalysisEngine.analyze(ClassReaderAnalysisEngine.java:34)
At edu.umd.cs.findbugs.classfile.impl.AnalysisCache.getClassAnalysis(AnalysisCache.java:261)
At edu.umd.cs.findbugs.classfile.engine.ClassInfoAnalysisEngine.analyze(ClassInfoAnalysisEngine.java:75)
At edu.umd.cs.findbugs.classfile.engine.ClassInfoAnalysisEngine.analyze(ClassInfoAnalysisEngine.java:38)
At edu.umd.cs.findbugs.classfile.impl.AnalysisCache.getClassAnalysis(AnalysisCache.java:261)
At edu.umd.cs.findbugs.ba.XFactory.getXClass(XFactory.java:693)
At edu.umd.cs.findbugs.ba.AnalysisContext.setAppClassList(AnalysisContext.java:975)
At edu.umd.cs.findbugs.FindBugs2.setAppClassList(FindBugs2.java:909)
At edu.umd.cs.findbugs.FindBugs2.execute(FindBugs2.java:252)
At edu.umd.cs.findbugs.FindBugs.runMain(FindBugs.java:395)
At edu.umd.cs.findbugs.FindBugs2.main(FindBugs2.java:1231)
Couldn't get class info for java/util/Random
java.lang.IllegalArgumentException: Unsupported class file major version 66
At org.objectweb.asm.ClassReader.<init>(ClassReader.java:199)
At org.objectweb.asm.ClassReader.<init>(ClassReader.java:180)
At org.objectweb.asm.ClassReader.<init>(ClassReader.java:166)
At edu.umd.cs.findbugs.asm.FBClassReader.<init>(FBClassReader.java:35)
At edu.umd.cs.findbugs.classfile.engine.asm.ClassReaderAnalysisEngine.analyze(ClassReaderAnalysisEngine.java:48)
At edu.umd.cs.findbugs.classfile.engine.asm.ClassReaderAnalysisEngine.analyze(ClassReaderAnalysisEngine.java:34)
At edu.umd.cs.findbugs.classfile.impl.AnalysisCache.getClassAnalysis(AnalysisCache.java:261)
At edu.umd.cs.findbugs.classfile.engine.ClassInfoAnalysisEngine.analyze(ClassInfoAnalysisEngine.java:75)
At edu.umd.cs.findbugs.classfile.engine.ClassInfoAnalysisEngine.analyze(ClassInfoAnalysisEngine.java:38)
At edu.umd.cs.findbugs.classfile.impl.AnalysisCache.getClassAnalysis(AnalysisCache.java:261)
At edu.umd.cs.findbugs.ba.XFactory.getXClass(XFactory.java:693)
At edu.umd.cs.findbugs.ba.AnalysisContext.setAppClassList(AnalysisContext.java:975)
At edu.umd.cs.findbugs.FindBugs2.setAppClassList(FindBugs2.java:909)
At edu.umd.cs.findbugs.FindBugs2.execute(FindBugs2.java:252)
At edu.umd.cs.findbugs.FindBugs.runMain(FindBugs.java:395)
At edu.umd.cs.findbugs.FindBugs2.main(FindBugs2.java:1231)
Couldn't get class info for java/util/Locale
java.lang.IllegalArgumentException: Unsupported class file major version 66
At org.objectweb.asm.ClassReader.<init>(ClassReader.java:199)
At org.objectweb.asm.ClassReader.<init>(ClassReader.java:180)
At org.objectweb.asm.ClassReader.<init>(ClassReader.java:166)
At edu.umd.cs.findbugs.asm.FBClassReader.<init>(FBClassReader.java:35)
At edu.umd.cs.findbugs.classfile.engine.asm.ClassReaderAnalysisEngine.analyze(ClassReaderAnalysisEngine.java:48)
At edu.umd.cs.findbugs.classfile.engine.asm.ClassReaderAnalysisEngine.analyze(ClassReaderAnalysisEngine.java:34)
At edu.umd.cs.findbugs.classfile.impl.AnalysisCache.getClassAnalysis(AnalysisCache.java:261)
At edu.umd.cs.findbugs.classfile.engine.ClassInfoAnalysisEngine.analyze(ClassInfoAnalysisEngine.java:75)
At edu.umd.cs.findbugs.classfile.engine.ClassInfoAnalysisEngine.analyze(ClassInfoAnalysisEngine.java:38)
At edu.umd.cs.findbugs.classfile.impl.AnalysisCache.getClassAnalysis(AnalysisCache.java:261)
At edu.umd.cs.findbugs.ba.XFactory.getXClass(XFactory.java:693)
At edu.umd.cs.findbugs.ba.AnalysisContext.setAppClassList(AnalysisContext.java:975)
At edu.umd.cs.findbugs.FindBugs2.setAppClassList(FindBugs2.java:909)
At edu.umd.cs.findbugs.FindBugs2.execute(FindBugs2.java:252)
At edu.umd.cs.findbugs.FindBugs.runMain(FindBugs.java:395)
At edu.umd.cs.findbugs.FindBugs2.main(FindBugs2.java:1231)
Couldn't get class info for java/lang/AssertionError
java.lang.IllegalArgumentException: Unsupported class file major version 66
At org.objectweb.asm.ClassReader.<init>(ClassReader.java:199)
At org.objectweb.asm.ClassReader.<init>(ClassReader.java:180)
At org.objectweb.asm.ClassReader.<init>(ClassReader.java:166)
At edu.umd.cs.findbugs.asm.FBClassReader.<init>(FBClassReader.java:35)
At edu.umd.cs.findbugs.classfile.engine.asm.ClassReaderAnalysisEngine.analyze(ClassReaderAnalysisEngine.java:48)
At edu.umd.cs.findbugs.classfile.engine.asm.ClassReaderAnalysisEngine.analyze(ClassReaderAnalysisEngine.java:34)
At edu.umd.cs.findbugs.classfile.impl.AnalysisCache.getClassAnalysis(AnalysisCache.java:261)
At edu.umd.cs.findbugs.classfile.engine.ClassInfoAnalysisEngine.analyze(ClassInfoAnalysisEngine.java:75)
At edu.umd.cs.findbugs.classfile.engine.ClassInfoAnalysisEngine.analyze(ClassInfoAnalysisEngine.java:38)
At edu.umd.cs.findbugs.classfile.impl.AnalysisCache.getClassAnalysis(AnalysisCache.java:261)
At edu.umd.cs.findbugs.ba.XFactory.getXClass(XFactory.java:693)
At edu.umd.cs.findbugs.ba.AnalysisContext.setAppClassList(AnalysisContext.java:975)
At edu.umd.cs.findbugs.FindBugs2.setAppClassList(FindBugs2.java:909)
At edu.umd.cs.findbugs.FindBugs2.execute(FindBugs2.java:252)
At edu.umd.cs.findbugs.FindBugs.runMain(FindBugs.java:395)
At edu.umd.cs.findbugs.FindBugs2.main(FindBugs2.java:1231)
Couldn't get class info for java/lang/NoSuchFieldException
java.lang.IllegalArgumentException: Unsupported class file major version 66
At org.objectweb.asm.ClassReader.<init>(ClassReader.java:199)
At org.objectweb.asm.ClassReader.<init>(ClassReader.java:180)
At org.objectweb.asm.ClassReader.<init>(ClassReader.java:166)
At edu.umd.cs.findbugs.asm.FBClassReader.<init>(FBClassReader.java:35)
At edu.umd.cs.findbugs.classfile.engine.asm.ClassReaderAnalysisEngine.analyze(ClassReaderAnalysisEngine.java:48)
At edu.umd.cs.findbugs.classfile.engine.asm.ClassReaderAnalysisEngine.analyze(ClassReaderAnalysisEngine.java:34)
At edu.umd.cs.findbugs.classfile.impl.AnalysisCache.getClassAnalysis(AnalysisCache.java:261)
At edu.umd.cs.findbugs.classfile.engine.ClassInfoAnalysisEngine.analyze(ClassInfoAnalysisEngine.java:75)
At edu.umd.cs.findbugs.classfile.engine.ClassInfoAnalysisEngine.analyze(ClassInfoAnalysisEngine.java:38)
At edu.umd.cs.findbugs.classfile.impl.AnalysisCache.getClassAnalysis(AnalysisCache.java:261)
At edu.umd.cs.findbugs.ba.XFactory.getXClass(XFactory.java:693)
At edu.umd.cs.findbugs.ba.AnalysisContext.setAppClassList(AnalysisContext.java:975)
At edu.umd.cs.findbugs.FindBugs2.setAppClassList(FindBugs2.java:909)
At edu.umd.cs.findbugs.FindBugs2.execute(FindBugs2.java:252)
At edu.umd.cs.findbugs.FindBugs.runMain(FindBugs.java:395)
At edu.umd.cs.findbugs.FindBugs2.main(FindBugs2.java:1231)
Couldn't get class info for java/util/Set
java.lang.IllegalArgumentException: Unsupported class file major version 66
At org.objectweb.asm.ClassReader.<init>(ClassReader.java:199)
At org.objectweb.asm.ClassReader.<init>(ClassReader.java:180)
At org.objectweb.asm.ClassReader.<init>(ClassReader.java:166)
At edu.umd.cs.findbugs.asm.FBClassReader.<init>(FBClassReader.java:35)
At edu.umd.cs.findbugs.classfile.engine.asm.ClassReaderAnalysisEngine.analyze(ClassReaderAnalysisEngine.java:48)
At edu.umd.cs.findbugs.classfile.engine.asm.ClassReaderAnalysisEngine.analyze(ClassReaderAnalysisEngine.java:34)
At edu.umd.cs.findbugs.classfile.impl.AnalysisCache.getClassAnalysis(AnalysisCache.java:261)
At edu.umd.cs.findbugs.classfile.engine.ClassInfoAnalysisEngine.analyze(ClassInfoAnalysisEngine.java:75)
At edu.umd.cs.findbugs.classfile.engine.ClassInfoAnalysisEngine.analyze(ClassInfoAnalysisEngine.java:38)
At edu.umd.cs.findbugs.classfile.impl.AnalysisCache.getClassAnalysis(AnalysisCache.java:261)
At edu.umd.cs.findbugs.ba.XFactory.getXClass(XFactory.java:693)
At edu.umd.cs.findbugs.ba.AnalysisContext.setAppClassList(AnalysisContext.java:975)
At edu.umd.cs.findbugs.FindBugs2.setAppClassList(FindBugs2.java:909)
At edu.umd.cs.findbugs.FindBugs2.execute(FindBugs2.java:252)
At edu.umd.cs.findbugs.FindBugs.runMain(FindBugs.java:395)
At edu.umd.cs.findbugs.FindBugs2.main(FindBugs2.java:1231)
Couldn't get class info for javax/xml/stream/util/StreamReaderDelegate
java.lang.IllegalArgumentException: Unsupported class file major version 66
At org.objectweb.asm.ClassReader.<init>(ClassReader.java:199)
At org.objectweb.asm.ClassReader.<init>(ClassReader.java:180)
At org.objectweb.asm.ClassReader.<init>(ClassReader.java:166)
At edu.umd.cs.findbugs.asm.FBClassReader.<init>(FBClassReader.java:35)
At edu.umd.cs.findbugs.classfile.engine.asm.ClassReaderAnalysisEngine.analyze(ClassReaderAnalysisEngine.java:48)
At edu.umd.cs.findbugs.classfile.engine.asm.ClassReaderAnalysisEngine.analyze(ClassReaderAnalysisEngine.java:34)
At edu.umd.cs.findbugs.classfile.impl.AnalysisCache.getClassAnalysis(AnalysisCache.java:261)
At edu.umd.cs.findbugs.classfile.engine.ClassInfoAnalysisEngine.analyze(ClassInfoAnalysisEngine.java:75)
At edu.umd.cs.findbugs.classfile.engine.ClassInfoAnalysisEngine.analyze(ClassInfoAnalysisEngine.java:38)
At edu.umd.cs.findbugs.classfile.impl.AnalysisCache.getClassAnalysis(AnalysisCache.java:261)
At edu.umd.cs.findbugs.FindBugs2.buildReferencedClassSet(FindBugs2.java:806)
At edu.umd.cs.findbugs.FindBugs2.execute(FindBugs2.java:249)
At edu.umd.cs.findbugs.FindBugs.runMain(FindBugs.java:395)
At edu.umd.cs.findbugs.FindBugs2.main(FindBugs2.java:1231)
java.lang.IllegalArgumentException: Unsupported class file major version 66
at org.objectweb.asm.ClassReader.<init>(ClassReader.java:199)
at org.objectweb.asm.ClassReader.<init>(ClassReader.java:180)
at org.objectweb.asm.ClassReader.<init>(ClassReader.java:166)
at edu.umd.cs.findbugs.asm.FBClassReader.<init>(FBClassReader.java:35)
at edu.umd.cs.findbugs.classfile.engine.asm.ClassReaderAnalysisEngine.analyze(ClassReaderAnalysisEngine.java:48)
at edu.umd.cs.findbugs.classfile.engine.asm.ClassReaderAnalysisEngine.analyze(ClassReaderAnalysisEngine.java:34)
at edu.umd.cs.findbugs.classfile.impl.AnalysisCache.getClassAnalysis(AnalysisCache.java:261)
at edu.umd.cs.findbugs.classfile.engine.ClassInfoAnalysisEngine.analyze(ClassInfoAnalysisEngine.java:75)
at edu.umd.cs.findbugs.classfile.engine.ClassInfoAnalysisEngine.analyze(ClassInfoAnalysisEngine.java:38)
at edu.umd.cs.findbugs.classfile.impl.AnalysisCache.getClassAnalysis(AnalysisCache.java:261)
at edu.umd.cs.findbugs.ba.XFactory.getXClass(XFactory.java:693)
at edu.umd.cs.findbugs.ba.AnalysisContext.setAppClassList(AnalysisContext.java:975)
at edu.umd.cs.findbugs.FindBugs2.setAppClassList(FindBugs2.java:909)
at edu.umd.cs.findbugs.FindBugs2.execute(FindBugs2.java:252)
at edu.umd.cs.findbugs.FindBugs.runMain(FindBugs.java:395)
at edu.umd.cs.findbugs.FindBugs2.main(FindBugs2.java:1231)
SpotBugs ended with exit code 4
> Task :test
ParserTest > testXmlInputFactoryPropertyDefaults() FAILED
org.opentest4j.AssertionFailedError at ParserTest.java:70
ParserTest > testXmlInputFactoryPropertyOverrides() FAILED
org.opentest4j.AssertionFailedError at ParserTest.java:81
2964 tests completed, 2 failed, 170 skipped
> Task :test FAILED
FAILURE: Build failed with an exception.
* What went wrong:
Execution failed for task ':test'.
> There were failing tests. See the report at: file://<https://ci-builds.apache.org/job/POI/job/POI-XMLBeans-DSL-1.22/ws/build/reports/tests/test/index.html>
* Try:
> Run with --scan to get full insights.
Deprecated Gradle features were used in this build, making it incompatible with Gradle 9.0.
You can use '--warning-mode all' to show the individual deprecation warnings and determine if they come from your own scripts or plugins.
For more on this, please refer to https://docs.gradle.org/8.6/userguide/command_line_interface.html#sec:command_line_warnings in the Gradle documentation.
BUILD FAILED in 7m 21s
45 actionable tasks: 43 executed, 2 from cache
Build step 'Invoke Gradle script' changed build result to FAILURE
Build step 'Invoke Gradle script' marked build as failure
ERROR: Not all environment variables could be successfully injected. Check for similarly-named environment variables.
Archiving artifacts
ERROR: Not all environment variables could be successfully injected. Check for similarly-named environment variables.
Recording test results
ERROR: Not all environment variables could be successfully injected. Check for similarly-named environment variables.
[Checks API] No suitable checks publisher found.
[SpotBugs] Skipping execution of recorder since overall result is 'FAILURE'
ERROR: Not all environment variables could be successfully injected. Check for similarly-named environment variables.
---------------------------------------------------------------------
To unsubscribe, e-mail: dev-unsubscribe@poi.apache.org
For additional commands, e-mail: dev-help@poi.apache.org
Build failed in Jenkins: POI » POI-XMLBeans-DSL-1.22 #17
Posted by Apache Jenkins Server <je...@builds.apache.org>.
See <https://ci-builds.apache.org/job/POI/job/POI-XMLBeans-DSL-1.22/17/display/redirect?page=changes>
Changes:
[PJ Fanning] gradle upgrade
[PJ Fanning] log4j upgrade
[PJ Fanning] commons-io upgrade
------------------------------------------
[...truncated 169.08 KB...]
A test/perf/bin/run_jaxb2.bat
A test/perf/bin/run_all.bat
A test/perf/bin/run_all_nonmemory.bat
A test/perf/bin/jaxb2.bat
A test/perf/bin/xerces.sh
A test/perf/bin/castor.sh
A test/perf/bin/jaxb.bat
A test/perf/bin/run_xmlbeans_all.bat
A test/perf/bin/jaxb.sh
A test/perf/bin/xerces.bat
AU test/perf/bin/castor.bat
A test/perf/bin/run_xmlbeans_nonmemory.bat
A test/perf/bin/run_svn.bat
A test/perf/bin/run_svn_nonmemory.bat
A test/perf/bin/run_svn.sh
A test/perf/bin/run_v1_nonmemory.bat
A test/perf/bin/run_v2_nonmemory.bat
A test/perf/bin/run_xerces_nonmemory.bat
A test/perf/bin/run_all.sh
A test/perf/bin/run_v2.sh
A test/perf/bin/run_v1.bat
A test/perf/bin/run_v2.bat
A test/perf/bin/run_jaxb.sh
A test/perf/bin/run_xerces.bat
A test/perf/bin/run_v1.sh
A test/perf/bin/run_castor.bat
A test/perf/bin/run_xerces.sh
A test/perf/bin/run_castor.sh
A test/perf/bin/run_jaxb.bat
A test/perf/bin/v1.sh
A test/perf/bin/jibx.sh
A test/perf/bin/run_jibx.bat
AU test/perf/bin/v1.bat
AU test/perf/bin/jibx.bat
A test/perf/bin/castor.properties
A test/perf/bin/run_jibx.sh
A test/perf/download.properties
A test/perf/cases
AU test/perf/cases/parser_instances.zip
A test/perf/cases/xsd
A test/perf/cases/xsd/non-primitives.xsd
A test/perf/cases/xsd/purchase-order-1.xml
A test/perf/cases/xsd/purchase-order.xsd
A test/perf/cases/xsd/purchase-order-2.xml
A test/perf/cases/xsd/purchase-order-3.xml
A test/perf/cases/xsd/doc.xsd
A test/perf/cases/xsd/purchase-order-4.xml
A test/perf/cases/xsd/purchase-order-5.xml
A test/perf/cases/xsd/purchase-order-6.xml
A test/perf/cases/xsd/purchase-order-7.xml
A test/perf/cases/xsd/purchase-order-jibxbinding.xml
A test/perf/cases/xsd/perf-results.xsd
A test/perf/cases/xsd/primitives.xsd
A test/perf/results.xml
AU test/perf/env.sh
AU test/perf/env.bat
A test/docs
AU test/docs/BuildingAndRunningTests.txt
AU test/docs/TestOrganization.txt
AU test/readme.txt
AU STATUS
A release-guide.txt
AU LICENSE.txt
A .github
A .github/workflows
A .github/workflows/test-gradle.yml
A .github/workflows/codeql-analysis.yml
A wrapper.gradle
AU NOTICE.txt
AU NOTICE-binary.txt
A legal
A legal/HEADER
A KEYS
A settings.gradle
A SECURITY.md
A CHANGES.txt
A .gitignore
AU xbeanenv.sh
AU xbeanenv.cmd
U .
At revision 1916365
ERROR: Not all environment variables could be successfully injected. Check for similarly-named environment variables.
[POI-XMLBeans-DSL-1.22] $ /bin/sh -xe /tmp/jenkins9378919060198186764.sh
+ rm -rf examples excelant integrationtest main ooxml ooxml-schema scratchpad build.javacheck.xml
+ svn status
+ svn revert poi*/src/*/java9/module-info.*
svn: E155010: The node '<https://ci-builds.apache.org/job/POI/job/POI-XMLBeans-DSL-1.22/ws/poi*/src/*'> was not found.
+ true
+ svn revert src/resources/ooxml-lite-report.*
Skipped 'src/resources/ooxml-lite-report.*'
+ echo Java-Home: /home/jenkins/tools/java/latest22
Java-Home: /home/jenkins/tools/java/latest22
+ ls -al /home/jenkins/tools/java/latest22/
total 36
drwxr-xr-x 8 root root 4096 Nov 13 21:50 .
drwxrwxr-x 39 root root 4096 Feb 8 19:07 ..
drwxr-xr-x 2 root root 4096 Nov 13 21:50 bin
drwxr-xr-x 5 root root 4096 Nov 13 21:50 conf
drwxr-xr-x 3 root root 4096 Nov 13 21:50 include
drwxr-xr-x 2 root root 4096 Nov 13 21:50 jmods
drwxr-xr-x 71 root root 4096 Nov 13 21:50 legal
drwxr-xr-x 5 root root 4096 Nov 13 21:50 lib
-rw-r--r-- 1 root root 1220 Oct 18 14:34 release
+ ls -al /home/jenkins/tools/java/latest22/bin
total 472
drwxr-xr-x 2 root root 4096 Nov 13 21:50 .
drwxr-xr-x 8 root root 4096 Nov 13 21:50 ..
-rwxr-xr-x 1 root root 12384 Oct 18 14:34 jar
-rwxr-xr-x 1 root root 12392 Oct 18 14:34 jarsigner
-rwxr-xr-x 1 root root 12328 Oct 18 14:34 java
-rwxr-xr-x 1 root root 12416 Oct 18 14:34 javac
-rwxr-xr-x 1 root root 12424 Oct 18 14:34 javadoc
-rwxr-xr-x 1 root root 12384 Oct 18 14:34 javap
-rwxr-xr-x 1 root root 12384 Oct 18 14:34 jcmd
-rwxr-xr-x 1 root root 12456 Oct 18 14:34 jconsole
-rwxr-xr-x 1 root root 12384 Oct 18 14:34 jdb
-rwxr-xr-x 1 root root 12392 Oct 18 14:34 jdeprscan
-rwxr-xr-x 1 root root 12384 Oct 18 14:34 jdeps
-rwxr-xr-x 1 root root 12384 Oct 18 14:34 jfr
-rwxr-xr-x 1 root root 12384 Oct 18 14:34 jhsdb
-rwxr-xr-x 1 root root 12392 Oct 18 14:34 jimage
-rwxr-xr-x 1 root root 12416 Oct 18 14:34 jinfo
-rwxr-xr-x 1 root root 12416 Oct 18 14:34 jlink
-rwxr-xr-x 1 root root 12416 Oct 18 14:34 jmap
-rwxr-xr-x 1 root root 12384 Oct 18 14:34 jmod
-rwxr-xr-x 1 root root 12392 Oct 18 14:34 jpackage
-rwxr-xr-x 1 root root 12384 Oct 18 14:34 jps
-rwxr-xr-x 1 root root 12424 Oct 18 14:34 jrunscript
-rwxr-xr-x 1 root root 12392 Oct 18 14:34 jshell
-rwxr-xr-x 1 root root 12424 Oct 18 14:34 jstack
-rwxr-xr-x 1 root root 12384 Oct 18 14:34 jstat
-rwxr-xr-x 1 root root 12392 Oct 18 14:34 jstatd
-rwxr-xr-x 1 root root 12392 Oct 18 14:34 jwebserver
-rwxr-xr-x 1 root root 12392 Oct 18 14:34 keytool
-rwxr-xr-x 1 root root 12416 Oct 18 14:34 rmiregistry
-rwxr-xr-x 1 root root 12392 Oct 18 14:34 serialver
+ /home/jenkins/tools/java/latest22/bin/java -version
openjdk version "22-ea" 2024-03-19
OpenJDK Runtime Environment (build 22-ea+20-1570)
OpenJDK 64-Bit Server VM (build 22-ea+20-1570, mixed mode, sharing)
+ echo which java
which java
+ which java
/home/jenkins/tools/java/latest22/bin/java
+ java -version
openjdk version "22-ea" 2024-03-19
OpenJDK Runtime Environment (build 22-ea+20-1570)
OpenJDK 64-Bit Server VM (build 22-ea+20-1570, mixed mode, sharing)
+ echo which javac
which javac
+ which javac
/home/jenkins/tools/java/latest22/bin/javac
+ javac -version
javac 22-ea
+ echo Ant-Home:
Ant-Home:
+ ls -al
total 412
drwxr-xr-x 10 jenkins jenkins 4096 Mar 17 11:52 .
drwxr-xr-x 5 jenkins jenkins 4096 Mar 17 11:52 ..
-rw-r--r-- 1 jenkins jenkins 29242 Mar 17 11:52 build.gradle
-rw-r--r-- 1 jenkins jenkins 54123 Mar 17 11:52 build.xml
-rw-r--r-- 1 jenkins jenkins 11963 Mar 17 11:52 CHANGES.txt
drwxr-xr-x 3 jenkins jenkins 4096 Mar 17 11:52 .github
-rw-r--r-- 1 jenkins jenkins 14 Mar 17 11:52 .gitignore
drwxr-xr-x 3 jenkins jenkins 4096 Mar 17 11:52 gradle
-rw-r--r-- 1 jenkins jenkins 1338 Mar 17 11:52 gradle.properties
-rwxr-xr-x 1 jenkins jenkins 9177 Mar 17 11:52 gradlew
-rw-r--r-- 1 jenkins jenkins 176157 Mar 17 11:52 KEYS
drwxr-xr-x 2 jenkins jenkins 4096 Mar 17 11:52 legal
-rwxr-xr-x 1 jenkins jenkins 12458 Mar 17 11:52 LICENSE-binary.txt
-rwxr-xr-x 1 jenkins jenkins 11884 Mar 17 11:52 LICENSE.txt
-rw-r--r-- 1 jenkins jenkins 2561 Mar 17 11:52 NOTICE-binary.txt
-rw-r--r-- 1 jenkins jenkins 1592 Mar 17 11:52 NOTICE.txt
-rw-r--r-- 1 jenkins jenkins 2227 Mar 17 11:52 README.txt
-rw-r--r-- 1 jenkins jenkins 10995 Mar 17 11:52 release-guide.txt
drwxr-xr-x 16 jenkins jenkins 4096 Mar 17 11:52 samples
-rw-r--r-- 1 jenkins jenkins 238 Mar 17 11:52 SECURITY.md
-rw-r--r-- 1 jenkins jenkins 661 Mar 17 11:52 settings.gradle
drwxr-xr-x 4 jenkins jenkins 4096 Mar 17 11:52 src
-rw-r--r-- 1 jenkins jenkins 359 Mar 17 11:52 STATUS
drwxr-xr-x 4 jenkins jenkins 4096 Mar 17 11:52 .svn
drwxr-xr-x 4 jenkins jenkins 4096 Mar 17 11:52 test
-rw-r--r-- 1 jenkins jenkins 3803 Mar 17 11:52 wrapper.gradle
-rw-r--r-- 1 jenkins jenkins 25 Mar 17 11:52 xbeanenv.cmd
-rwxr-xr-x 1 jenkins jenkins 27 Mar 17 11:52 xbeanenv.sh
drwxr-xr-x 2 jenkins jenkins 4096 Mar 17 11:52 xkit
+ echo which ant
which ant
+ which ant
/usr/bin/ant
+ ant -version
Apache Ant(TM) version 1.10.12 compiled on January 17 1970
+ echo <project default="test"><target name="test"><echo>Java ${ant.java.version}/${java.version}</echo><exec executable="javac"><arg value="-version"/></exec></target></project>
+ ant -f build.javacheck.xml -v
Apache Ant(TM) version 1.10.12 compiled on January 17 1970
Buildfile: <https://ci-builds.apache.org/job/POI/job/POI-XMLBeans-DSL-1.22/ws/build.javacheck.xml>
Detected Java version: 22 in: /usr/local/asfpackages/java/openjdk-22-ea+20
Detected OS: Linux
parsing buildfile <https://ci-builds.apache.org/job/POI/job/POI-XMLBeans-DSL-1.22/ws/build.javacheck.xml> with URI = <https://ci-builds.apache.org/job/POI/job/POI-XMLBeans-DSL-1.22/ws/build.javacheck.xml>
Project base dir set to: <https://ci-builds.apache.org/job/POI/job/POI-XMLBeans-DSL-1.22/ws/>
Build sequence for target(s) `test' is [test]
Complete build sequence is [test, ]
test:
parsing buildfile jar:file:/usr/share/ant/lib/ant.jar!/org/apache/tools/ant/antlib.xml with URI = jar:file:/usr/share/ant/lib/ant.jar!/org/apache/tools/ant/antlib.xml from a zip file
[echo] Java 22/22-ea
[exec] Current OS is Linux
[exec] Executing 'javac' with arguments:
[exec] '-version'
[exec]
[exec] The ' characters around the executable and arguments are
[exec] not part of the command.
[exec] javac 22-ea
BUILD SUCCESSFUL
Total time: 0 seconds
+ exit 0
[Gradle] - Launching build.
ERROR: Not all environment variables could be successfully injected. Check for similarly-named environment variables.
[POI-XMLBeans-DSL-1.22] $ <https://ci-builds.apache.org/job/POI/job/POI-XMLBeans-DSL-1.22/ws/gradlew> clean jenkins jacocoTestReport
To honour the JVM settings for this build a single-use Daemon process will be forked. For more on this, please refer to https://docs.gradle.org/8.6/userguide/gradle_daemon.html#sec:disabling_the_daemon in the Gradle documentation.
Daemon will be stopped at the end of the build
Configuration on demand is an incubating feature.
FAILURE: Build failed with an exception.
* What went wrong:
Could not open settings generic class cache for settings file '<https://ci-builds.apache.org/job/POI/job/POI-XMLBeans-DSL-1.22/ws/settings.gradle'> (/home/jenkins/.gradle/caches/8.6/scripts/f1vtb3f18o718s5f2prqhsmqz).
> BUG! exception in phase 'semantic analysis' in source unit '_BuildScript_' Unsupported class file major version 66
* Try:
> Run with --stacktrace option to get the stack trace.
> Run with --info or --debug option to get more log output.
> Run with --scan to get full insights.
> Get more help at https://help.gradle.org.
BUILD FAILED in 7s
Build step 'Invoke Gradle script' changed build result to FAILURE
Build step 'Invoke Gradle script' marked build as failure
ERROR: Not all environment variables could be successfully injected. Check for similarly-named environment variables.
Archiving artifacts
ERROR: Not all environment variables could be successfully injected. Check for similarly-named environment variables.
Recording test results
ERROR: Not all environment variables could be successfully injected. Check for similarly-named environment variables.
ERROR: Step ‘Publish JUnit test result report’ failed: No test report files were found. Configuration error?
[SpotBugs] Skipping execution of recorder since overall result is 'FAILURE'
ERROR: Not all environment variables could be successfully injected. Check for similarly-named environment variables.
---------------------------------------------------------------------
To unsubscribe, e-mail: dev-unsubscribe@poi.apache.org
For additional commands, e-mail: dev-help@poi.apache.org