You are viewing a plain text version of this content. The canonical link for it is here.
Posted to yarn-dev@hadoop.apache.org by Apache Jenkins Server <je...@builds.apache.org> on 2015/01/14 11:44:45 UTC
Hadoop-Yarn-trunk - Build # 807 - Failure
See https://builds.apache.org/job/Hadoop-Yarn-trunk/807/
###################################################################################
########################## LAST 60 LINES OF THE CONSOLE ###########################
[...truncated 7329 lines...]
Tests in error:
TestNodeManagerResync.testBlockNewContainerRequestsOnStartAndResync:179 » tes...
TestNodeManagerResync.testKillContainersOnResync:111 » Metrics Metrics source ...
TestNodeManagerResync.testNMSentContainerStatusOnResync:298 » YarnRuntime java...
Tests run: 279, Failures: 0, Errors: 3, Skipped: 5
[INFO] ------------------------------------------------------------------------
[INFO] Reactor Summary:
[INFO]
[INFO] hadoop-yarn ....................................... SUCCESS [ 3.127 s]
[INFO] hadoop-yarn-api ................................... SUCCESS [02:59 min]
[INFO] hadoop-yarn-common ................................ SUCCESS [02:43 min]
[INFO] hadoop-yarn-server ................................ SUCCESS [ 0.077 s]
[INFO] hadoop-yarn-server-common ......................... SUCCESS [ 39.850 s]
[INFO] hadoop-yarn-server-nodemanager .................... FAILURE [06:21 min]
[INFO] hadoop-yarn-server-web-proxy ...................... SKIPPED
[INFO] hadoop-yarn-server-applicationhistoryservice ...... SKIPPED
[INFO] hadoop-yarn-server-resourcemanager ................ SKIPPED
[INFO] hadoop-yarn-server-tests .......................... SKIPPED
[INFO] hadoop-yarn-client ................................ SKIPPED
[INFO] hadoop-yarn-server-sharedcachemanager ............. SKIPPED
[INFO] hadoop-yarn-applications .......................... SKIPPED
[INFO] hadoop-yarn-applications-distributedshell ......... SKIPPED
[INFO] hadoop-yarn-applications-unmanaged-am-launcher .... SKIPPED
[INFO] hadoop-yarn-site .................................. SKIPPED
[INFO] hadoop-yarn-registry .............................. SKIPPED
[INFO] hadoop-yarn-project ............................... SKIPPED
[INFO] ------------------------------------------------------------------------
[INFO] BUILD FAILURE
[INFO] ------------------------------------------------------------------------
[INFO] Total time: 12:48 min
[INFO] Finished at: 2015-01-14T10:44:35+00:00
[INFO] Final Memory: 73M/1161M
[INFO] ------------------------------------------------------------------------
[ERROR] Failed to execute goal org.apache.maven.plugins:maven-surefire-plugin:2.17:test (default-test) on project hadoop-yarn-server-nodemanager: There are test failures.
[ERROR]
[ERROR] Please refer to /home/jenkins/jenkins-slave/workspace/Hadoop-Yarn-trunk/hadoop-yarn-project/hadoop-yarn/hadoop-yarn-server/hadoop-yarn-server-nodemanager/target/surefire-reports for the individual test results.
[ERROR] -> [Help 1]
[ERROR]
[ERROR] To see the full stack trace of the errors, re-run Maven with the -e switch.
[ERROR] Re-run Maven using the -X switch to enable full debug logging.
[ERROR]
[ERROR] For more information about the errors and possible solutions, please read the following articles:
[ERROR] [Help 1] http://cwiki.apache.org/confluence/display/MAVEN/MojoFailureException
[ERROR]
[ERROR] After correcting the problems, you can resume the build with the command
[ERROR] mvn <goals> -rf :hadoop-yarn-server-nodemanager
Build step 'Execute shell' marked build as failure
Archiving artifacts
Recording test results
Updating MAPREDUCE-6173
Updating MAPREDUCE-6210
Updating HDFS-7570
Updating YARN-3019
Updating YARN-2637
Sending e-mails to: yarn-dev@hadoop.apache.org
Email was triggered for: Failure
Sending email for trigger: Failure
###################################################################################
############################## FAILED TESTS (if any) ##############################
3 tests failed.
REGRESSION: org.apache.hadoop.yarn.server.nodemanager.TestNodeManagerResync.testBlockNewContainerRequestsOnStartAndResync
Error Message:
test timed out after 60000 milliseconds
Stack Trace:
java.lang.Exception: test timed out after 60000 milliseconds
at sun.misc.Unsafe.park(Native Method)
at java.util.concurrent.locks.LockSupport.park(LockSupport.java:186)
at java.util.concurrent.locks.AbstractQueuedSynchronizer$ConditionObject.await(AbstractQueuedSynchronizer.java:2043)
at java.util.concurrent.CyclicBarrier.dowait(CyclicBarrier.java:227)
at java.util.concurrent.CyclicBarrier.await(CyclicBarrier.java:355)
at org.apache.hadoop.yarn.server.nodemanager.TestNodeManagerResync.testBlockNewContainerRequestsOnStartAndResync(TestNodeManagerResync.java:179)
REGRESSION: org.apache.hadoop.yarn.server.nodemanager.TestNodeManagerResync.testKillContainersOnResync
Error Message:
Metrics source JvmMetrics already exists!
Stack Trace:
org.apache.hadoop.metrics2.MetricsException: Metrics source JvmMetrics already exists!
at org.apache.hadoop.metrics2.lib.DefaultMetricsSystem.newSourceName(DefaultMetricsSystem.java:143)
at org.apache.hadoop.metrics2.lib.DefaultMetricsSystem.sourceName(DefaultMetricsSystem.java:120)
at org.apache.hadoop.metrics2.impl.MetricsSystemImpl.register(MetricsSystemImpl.java:228)
at org.apache.hadoop.metrics2.source.JvmMetrics.create(JvmMetrics.java:84)
at org.apache.hadoop.yarn.server.nodemanager.metrics.NodeManagerMetrics.create(NodeManagerMetrics.java:60)
at org.apache.hadoop.yarn.server.nodemanager.metrics.NodeManagerMetrics.create(NodeManagerMetrics.java:56)
at org.apache.hadoop.yarn.server.nodemanager.NodeManager.<init>(NodeManager.java:78)
at org.apache.hadoop.yarn.server.nodemanager.TestNodeManagerResync$TestNodeManager1.<init>(TestNodeManagerResync.java:348)
at org.apache.hadoop.yarn.server.nodemanager.TestNodeManagerResync.testKillContainersOnResync(TestNodeManagerResync.java:111)
REGRESSION: org.apache.hadoop.yarn.server.nodemanager.TestNodeManagerResync.testNMSentContainerStatusOnResync
Error Message:
java.net.BindException: Problem binding to [localhost:12345] java.net.BindException: Address already in use; For more details see: http://wiki.apache.org/hadoop/BindException
Stack Trace:
org.apache.hadoop.yarn.exceptions.YarnRuntimeException: java.net.BindException: Problem binding to [localhost:12345] java.net.BindException: Address already in use; For more details see: http://wiki.apache.org/hadoop/BindException
at sun.nio.ch.Net.bind0(Native Method)
at sun.nio.ch.Net.bind(Net.java:444)
at sun.nio.ch.Net.bind(Net.java:436)
at sun.nio.ch.ServerSocketChannelImpl.bind(ServerSocketChannelImpl.java:214)
at sun.nio.ch.ServerSocketAdaptor.bind(ServerSocketAdaptor.java:74)
at org.apache.hadoop.ipc.Server.bind(Server.java:411)
at org.apache.hadoop.ipc.Server$Listener.<init>(Server.java:577)
at org.apache.hadoop.ipc.Server.<init>(Server.java:2293)
at org.apache.hadoop.ipc.RPC$Server.<init>(RPC.java:935)
at org.apache.hadoop.ipc.ProtobufRpcEngine$Server.<init>(ProtobufRpcEngine.java:535)
at org.apache.hadoop.ipc.ProtobufRpcEngine.getServer(ProtobufRpcEngine.java:510)
at org.apache.hadoop.ipc.RPC$Builder.build(RPC.java:780)
at org.apache.hadoop.yarn.factories.impl.pb.RpcServerFactoryPBImpl.createServer(RpcServerFactoryPBImpl.java:169)
at org.apache.hadoop.yarn.factories.impl.pb.RpcServerFactoryPBImpl.getServer(RpcServerFactoryPBImpl.java:132)
at org.apache.hadoop.yarn.ipc.HadoopYarnProtoRPC.getServer(HadoopYarnProtoRPC.java:65)
at org.apache.hadoop.yarn.ipc.YarnRPC.getServer(YarnRPC.java:54)
at org.apache.hadoop.yarn.server.nodemanager.containermanager.ContainerManagerImpl.serviceStart(ContainerManagerImpl.java:420)
at org.apache.hadoop.service.AbstractService.start(AbstractService.java:193)
at org.apache.hadoop.service.CompositeService.serviceStart(CompositeService.java:120)
at org.apache.hadoop.yarn.server.nodemanager.NodeManager.serviceStart(NodeManager.java:264)
at org.apache.hadoop.service.AbstractService.start(AbstractService.java:193)
at org.apache.hadoop.yarn.server.nodemanager.TestNodeManagerResync.testNMSentContainerStatusOnResync(TestNodeManagerResync.java:298)