You are viewing a plain text version of this content. The canonical link for it is here.
Posted to dev@jmeter.apache.org by Apache Jenkins Server <je...@builds.apache.org> on 2022/01/19 18:55:13 UTC
Build failed in Jenkins: JMeter » JMeter-trunk #380
See <https://ci-builds.apache.org/job/JMeter/job/JMeter-trunk/380/display/redirect?page=changes>
Changes:
[Felix Schumacher] Apply autostyle to imports changed with last commit
------------------------------------------
[...truncated 97.70 KB...]
> Task :src:testkit-wiremock:check
> Task :src:launcher:processTestResources NO-SOURCE
> Task :src:testkit-wiremock:assemble UP-TO-DATE
> Task :src:launcher:testClasses UP-TO-DATE
> Task :src:launcher:spotbugsTest NO-SOURCE
> Task :src:launcher:test NO-SOURCE
> Task :src:launcher:check
> Task :src:launcher:assemble UP-TO-DATE
> Task :src:protocol:http:autostyleJavaCheck
> Task :src:protocol:http:autostyleKotlinGradleCheck NO-SOURCE
> Task :src:release:autostyleKotlinGradleCheck
> Task :src:release:autostyleMarkdownCheck NO-SOURCE
> Task :src:release:autostyleCheck
> Task :src:protocol:http:autostyleMarkdownCheck NO-SOURCE
> Task :src:release:checkstyleMain NO-SOURCE
> Task :src:protocol:http:autostyleCheck
> Task :src:release:checkstyleTest NO-SOURCE
> Task :src:release:compileJava NO-SOURCE
> Task :src:release:processResources NO-SOURCE
> Task :src:release:classes UP-TO-DATE
> Task :src:release:spotbugsMain NO-SOURCE
> Task :src:config:autostyleKotlinGradleCheck
> Task :src:release:compileTestJava NO-SOURCE
> Task :src:config:autostyleMarkdownCheck NO-SOURCE
> Task :src:config:autostyleCheck
> Task :src:config:checkstyleMain NO-SOURCE
> Task :src:components:autostyleJavaCheck
> Task :src:config:checkstyleTest NO-SOURCE
> Task :src:config:spotbugsMain NO-SOURCE
> Task :src:config:compileTestJava NO-SOURCE
> Task :src:config:processTestResources NO-SOURCE
> Task :src:config:testClasses UP-TO-DATE
> Task :src:release:processTestResources NO-SOURCE
> Task :src:release:testClasses UP-TO-DATE
> Task :src:config:spotbugsTest NO-SOURCE
> Task :src:protocol:http:checkstyleMain UP-TO-DATE
> Task :src:config:test NO-SOURCE
> Task :src:config:check
> Task :src:config:assemble UP-TO-DATE
> Task :src:release:spotbugsTest NO-SOURCE
> Task :src:release:test NO-SOURCE
> Task :src:release:check
> Task :src:release:jar UP-TO-DATE
> Task :src:bom:autostyleKotlinGradleCheck
> Task :src:release:assemble UP-TO-DATE
> Task :src:bom:autostyleMarkdownCheck NO-SOURCE
> Task :src:bom:autostyleCheck
> Task :src:bom:check
> Task :src:bom:assemble UP-TO-DATE
> Task :src:protocol:http:checkstyleTest UP-TO-DATE
> Task :src:protocol:autostyleKotlinGradleCheck
> Task :src:protocol:autostyleMarkdownCheck NO-SOURCE
> Task :src:protocol:autostyleCheck
> Task :src:autostyleKotlinGradleCheck
> Task :src:jorphan:spotbugsMain UP-TO-DATE
> Task :src:protocol:checkstyleMain NO-SOURCE
> Task :src:autostyleMarkdownCheck NO-SOURCE
> Task :src:autostyleCheck
> Task :src:check
> Task :src:assemble UP-TO-DATE
> Task :src:protocol:checkstyleTest NO-SOURCE
> Task :src:protocol:compileJava NO-SOURCE
> Task :src:protocol:processResources NO-SOURCE
> Task :src:protocol:classes UP-TO-DATE
> Task :src:protocol:spotbugsMain NO-SOURCE
> Task :src:protocol:compileTestJava NO-SOURCE
> Task :src:protocol:processTestResources NO-SOURCE
> Task :src:protocol:testClasses UP-TO-DATE
> Task :src:protocol:spotbugsTest NO-SOURCE
> Task :src:dist-check:autostyleKotlinGradleCheck
> Task :src:dist-check:autostyleMarkdownCheck NO-SOURCE
> Task :src:protocol:test NO-SOURCE
> Task :src:dist-check:autostyleCheck
> Task :src:protocol:check
> Task :src:licenses:autostyleKotlinGradleCheck
> Task :src:licenses:autostyleMarkdownCheck NO-SOURCE
> Task :src:licenses:autostyleCheck
> Task :src:protocol:jar UP-TO-DATE
> Task :src:protocol:assemble UP-TO-DATE
> Task :src:licenses:checkstyleMain NO-SOURCE
> Task :src:licenses:checkstyleTest NO-SOURCE
> Task :src:jorphan:spotbugsTest UP-TO-DATE
> Task :src:licenses:compileJava NO-SOURCE
> Task :src:licenses:processResources NO-SOURCE
> Task :src:licenses:classes UP-TO-DATE
> Task :src:licenses:spotbugsMain NO-SOURCE
> Task :src:licenses:compileTestJava NO-SOURCE
> Task :src:licenses:processTestResources NO-SOURCE
> Task :src:licenses:testClasses UP-TO-DATE
> Task :src:licenses:spotbugsTest NO-SOURCE
> Task :src:licenses:test NO-SOURCE
> Task :src:components:autostyleKotlinGradleCheck
> Task :src:licenses:check
> Task :src:licenses:jar UP-TO-DATE
> Task :src:components:autostyleMarkdownCheck NO-SOURCE
> Task :src:components:autostyleCheck
> Task :src:dist-check:populateLibs
> Task :src:dist-check:checkstyleMain NO-SOURCE
> Task :src:dist-check:checkstyleTest UP-TO-DATE
> Task :src:dist-check:processResources NO-SOURCE
> Task :src:dist-check:processTestResources UP-TO-DATE
> Task :src:dist:autostyleKotlinGradleCheck
> Task :src:dist:autostyleMarkdownCheck NO-SOURCE
> Task :src:dist:autostyleCheck
> Task :src:dist:checkstyleMain NO-SOURCE
> Task :src:dist:checkstyleTest NO-SOURCE
> Task :src:dist:processResources NO-SOURCE
> Task :src:dist:processTestResources NO-SOURCE
> Task :src:dist:preparePropertiesbuildPrintableDoc UP-TO-DATE
> Task :autostyleKotlinGradleCheck
> Task :autostyleMarkdownCheck
> Task :autostyleCheck
> Task :checkstyleMain NO-SOURCE
> Task :checkstyleTest NO-SOURCE
> Task :compileJava NO-SOURCE
> Task :processResources NO-SOURCE
> Task :classes UP-TO-DATE
> Task :spotbugsMain NO-SOURCE
> Task :compileTestJava NO-SOURCE
> Task :processTestResources NO-SOURCE
> Task :testClasses UP-TO-DATE
> Task :spotbugsTest NO-SOURCE
> Task :test NO-SOURCE
> Task :jar UP-TO-DATE
> Task :assemble UP-TO-DATE
> Task :rat
> Task :validateBeforeBuildingReleaseArtifacts
> Task :initializeNexusStagingRepository SKIPPED
> Task :src:config:initializeNexusStagingRepository SKIPPED
> Task :src:functions:initializeNexusStagingRepository SKIPPED
> Task :src:launcher:initializeNexusStagingRepository SKIPPED
> Task :src:protocol:bolt:initializeNexusStagingRepository SKIPPED
> Task :src:protocol:jms:initializeNexusStagingRepository SKIPPED
> Task :src:protocol:junit:initializeNexusStagingRepository SKIPPED
> Task :src:protocol:junit-sample:initializeNexusStagingRepository SKIPPED
> Task :src:protocol:ldap:initializeNexusStagingRepository SKIPPED
> Task :src:protocol:mail:initializeNexusStagingRepository SKIPPED
> Task :src:protocol:mongodb:initializeNexusStagingRepository SKIPPED
> Task :src:protocol:native:initializeNexusStagingRepository SKIPPED
> Task :src:protocol:tcp:initializeNexusStagingRepository SKIPPED
> Task :check
> Task :src:protocol:jdbc:initializeNexusStagingRepository SKIPPED
> Task :src:protocol:http:initializeNexusStagingRepository SKIPPED
> Task :src:protocol:java:initializeNexusStagingRepository SKIPPED
> Task :src:protocol:ftp:initializeNexusStagingRepository SKIPPED
> Task :src:core:autostyleJavaCheck
> Task :src:core:initializeNexusStagingRepository SKIPPED
> Task :src:dist:buildPrintableDoc
> Task :src:components:checkstyleMain
[ant:checkstyle] [ERROR] <https://ci-builds.apache.org/job/JMeter/job/JMeter-trunk/ws/src/components/src/main/java/org/apache/jmeter/assertions/JSONPathAssertion.java>:118: Line is longer than 160 characters (found 210). [LineLength]
> Task :src:core:autostyleKotlinCheck
> Task :src:core:autostyleKotlinGradleCheck
> Task :src:core:autostyleMarkdownCheck NO-SOURCE
> Task :src:core:autostyleCheck
> Task :src:components:checkstyleMain FAILED
> Task :src:jorphan:test
0.3sec, 37 completed, 0 failed, 0 skipped, org.apache.commons.cli.avalon.ClutilTestCase
PackageTest STANDARD_ERROR
SLF4J: Failed to load class "org.slf4j.impl.StaticLoggerBinder".
SLF4J: Defaulting to no-operation (NOP) logger implementation
SLF4J: See http://www.slf4j.org/codes.html#StaticLoggerBinder for further details.
0.0sec, 5 completed, 0 failed, 0 skipped, org.apache.jorphan.collections.PackageTest
> Task :src:core:checkstyleMain
> Task :src:dist:processSiteXslt
> Task :src:core:compileKotlin
> Task :src:launcher:publishLauncherPublicationToNexusRepository
> Task :src:config:publishConfigPublicationToNexusRepository
> Task :src:jorphan:test
6.3sec, 3 completed, 0 failed, 0 skipped, org.apache.jorphan.exec.TestKeyToolUtils
0.2sec, 5 completed, 0 failed, 0 skipped, testRendering(Object, String)
0.2sec, 5 completed, 0 failed, 0 skipped, org.apache.jorphan.gui.MinMaxLongRendererTest
0.0sec, 6 completed, 0 failed, 0 skipped, org.apache.jorphan.gui.ObjectTableModelTest
0.1sec, 26 completed, 0 failed, 0 skipped, org.apache.jorphan.gui.ObjectTableSorterTest
[0;34;1mWARNING[0m 0.0sec, 10 completed, 0 failed, [0;34;1m 2[0m skipped, org.apache.jorphan.math.[0;34;1mTestStatCalculator[0m
0.1sec, 4 completed, 0 failed, 0 skipped, org.apache.jorphan.reflect.TestClassTools
0.0sec, 5 completed, 0 failed, 0 skipped, testComparatorWithSameKeys(String)
0.1sec, 19 completed, 0 failed, 0 skipped, testComparatorDifferentKeys(String, String)
0.0sec, 4 completed, 0 failed, 0 skipped, testComparatorWithEquivalentKeys(String, String)
0.1sec, 28 completed, 0 failed, 0 skipped, org.apache.jorphan.util.TestAlphaNumericKeyComparator
0.0sec, 8 completed, 0 failed, 0 skipped, org.apache.jorphan.util.TestConverter
0.0sec, 50 completed, 0 failed, 0 skipped, org.apache.jorphan.util.TestJorphanUtils
0.1sec, 2 completed, 0 failed, 0 skipped, getText returns exact content of file
0.0sec, 4 completed, 0 failed, 0 skipped, getText returns exact content of file with specific charset
0.0sec, 2 completed, 0 failed, 0 skipped, setText sets exact content of file
0.0sec, 4 completed, 0 failed, 0 skipped, setText sets exact content of file other charset
0.0sec, 3 completed, 0 failed, 0 skipped, getText throws exception with invalid encoding
0.6sec, 16 completed, 0 failed, 0 skipped, org.apache.jorphan.io.TextFileSpec
0.0sec, 5 completed, 0 failed, 0 skipped, convert #value to #type should give "" when value or type is null
0.0sec, 2 completed, 0 failed, 0 skipped, convert #value to #type should downcast gracefully and give [#expected]
0.0sec, 4 completed, 0 failed, 0 skipped, convert #value to string should give [#expected]
0.0sec, 18 completed, 0 failed, 0 skipped, convert #value to number #type should give number [#expected]
0.0sec, 2 completed, 0 failed, 0 skipped, Convert #value to Class gives #expected
0.1sec, 18 completed, 0 failed, 0 skipped, Convert '#value' to #type
0.0sec, 3 completed, 0 failed, 0 skipped, Convert to date from '#value'
0.0sec, 3 completed, 0 failed, 0 skipped, Convert to Calendar from '#value'
0.0sec, 3 completed, 0 failed, 0 skipped, line breaks should be replaced in '#source' to '#expected'
0.2sec, 58 completed, 0 failed, 0 skipped, org.apache.jorphan.util.ConverterSpec
[0;34;1mWARNING[0m 12.1sec, 256 completed, 0 failed, [0;34;1m 2[0m skipped, [0;34;1mGradle Test Run :src:jorphan:test[0m
checksum-dependency elapsed time: 27345ms, configurations processed: 208
SHA-512 computation time: 810ms (goes in parallel, it might exceed wall-clock time), files processed: 90, processed: 26MiB, skipped: 2754MiB
PGP signature resolution time: 814ms (wall-clock), resolution requests: 131, signatures resolved: 324
PGP key resolution time: 20906ms (wall-clock), resolution requests: 131, download time: 0ms (goes in parallel, it might exceed wall-clock time), keys downloaded: 0
PGP signature verification time: 33436ms (goes in parallel, it might exceed wall-clock time), files processed: 1525, processed: 1037MiB, skipped: 1701MiB
FAILURE: Build failed with an exception.
* What went wrong:
Execution failed for task ':src:components:checkstyleMain'.
> Checkstyle rule violations were found. See the report at: file://<https://ci-builds.apache.org/job/JMeter/job/JMeter-trunk/ws/src/components/build/reports/checkstyle/main.html>
Checkstyle files with violations: 1
Checkstyle violations by severity: [error:1]
* Try:
> Run with --stacktrace option to get the stack trace.
> Run with --info or --debug option to get more log output.
> Run with --scan to get full insights.
* Get more help at https://help.gradle.org
Deprecated Gradle features were used in this build, making it incompatible with Gradle 8.0.
You can use '--warning-mode all' to show the individual deprecation warnings and determine if they come from your own scripts or plugins.
See https://docs.gradle.org/7.3/userguide/command_line_interface.html#sec:command_line_warnings
Execution optimizations have been disabled for 1 invalid unit(s) of work during this build to ensure correctness.
Please consult deprecation warnings for more details.
BUILD FAILED in 44s
250 actionable tasks: 104 executed, 146 up-to-date
See the profiling report at: file://<https://ci-builds.apache.org/job/JMeter/job/JMeter-trunk/ws/build/reports/profile/profile-2022-01-19-18-54-30.html>
A fine-grained performance profile is available: use the --scan option.
See the profiling report at: file://<https://ci-builds.apache.org/job/JMeter/job/JMeter-trunk/ws/buildSrc/build/reports/profile/profile-2022-01-19-18-54-32.html>
A fine-grained performance profile is available: use the --scan option.
Build step 'Invoke Gradle script' changed build result to FAILURE
Build step 'Invoke Gradle script' marked build as failure
Xvfb stopping
Archiving artifacts
Recording test results
[Checks API] No suitable checks publisher found.
Jenkins build is back to normal : JMeter » JMeter-trunk #381
Posted by Apache Jenkins Server <je...@builds.apache.org>.
See <https://ci-builds.apache.org/job/JMeter/job/JMeter-trunk/381/display/redirect?page=changes>