You are viewing a plain text version of this content. The canonical link for it is here.
Posted to commits@phoenix.apache.org by Apache Jenkins Server <je...@builds.apache.org> on 2018/08/20 09:16:56 UTC

Build failed in Jenkins: Phoenix Compile Compatibility with HBase #733

See <https://builds.apache.org/job/Phoenix_Compile_Compat_wHBase/733/display/redirect>

------------------------------------------
Started by timer
[EnvInject] - Loading node environment variables.
Building remotely on H35 (ubuntu xenial) in workspace <https://builds.apache.org/job/Phoenix_Compile_Compat_wHBase/ws/>
[Phoenix_Compile_Compat_wHBase] $ /bin/bash /tmp/jenkins5994825468417338519.sh
core file size          (blocks, -c) 0
data seg size           (kbytes, -d) unlimited
scheduling priority             (-e) 0
file size               (blocks, -f) unlimited
pending signals                 (-i) 386523
max locked memory       (kbytes, -l) 64
max memory size         (kbytes, -m) unlimited
open files                      (-n) 60000
pipe size            (512 bytes, -p) 8
POSIX message queues     (bytes, -q) 819200
real-time priority              (-r) 0
stack size              (kbytes, -s) 8192
cpu time               (seconds, -t) unlimited
max user processes              (-u) 10240
virtual memory          (kbytes, -v) unlimited
file locks                      (-x) unlimited
core id		: 0
core id		: 1
core id		: 2
core id		: 3
core id		: 4
core id		: 5
physical id	: 0
physical id	: 1
MemTotal:       98985932 kB
MemFree:        48181144 kB
Filesystem      Size  Used Avail Use% Mounted on
udev             48G     0   48G   0% /dev
tmpfs           9.5G  387M  9.1G   4% /run
/dev/sda1       364G  214G  133G  62% /
tmpfs            48G     0   48G   0% /dev/shm
tmpfs           5.0M     0  5.0M   0% /run/lock
tmpfs            48G     0   48G   0% /sys/fs/cgroup
tmpfs           9.5G     0  9.5G   0% /run/user/910
/dev/loop0       87M   87M     0 100% /snap/core/4917
/dev/loop1       32M   32M     0 100% /snap/snapcraft/1594
/dev/loop3       87M   87M     0 100% /snap/core/5145
/dev/loop5       55M   55M     0 100% /snap/lxd/8297
/dev/loop6       55M   55M     0 100% /snap/lxd/8358
/dev/loop2       55M   55M     0 100% /snap/lxd/8393
apache-maven-2.2.1
apache-maven-3.0.4
apache-maven-3.0.5
apache-maven-3.1.1
apache-maven-3.2.1
apache-maven-3.2.5
apache-maven-3.3.3
apache-maven-3.3.9
apache-maven-3.5.0
apache-maven-3.5.2
apache-maven-3.5.4
latest
latest2
latest3


===========================================================================================
Verifying compile level compatibility with HBase 0.98 with Phoenix 4.x-HBase-0.98
===========================================================================================

Cloning into 'hbase'...
Switched to a new branch '0.98'
Branch 0.98 set up to track remote branch 0.98 from origin.
[ERROR] Plugin org.codehaus.mojo:findbugs-maven-plugin:2.5.2 or one of its dependencies could not be resolved: Failed to read artifact descriptor for org.codehaus.mojo:findbugs-maven-plugin:jar:2.5.2: Could not transfer artifact org.codehaus.mojo:findbugs-maven-plugin:pom:2.5.2 from/to central (https://repo.maven.apache.org/maven2): Received fatal alert: protocol_version -> [Help 1]
[ERROR] 
[ERROR] To see the full stack trace of the errors, re-run Maven with the -e switch.
[ERROR] Re-run Maven using the -X switch to enable full debug logging.
[ERROR] 
[ERROR] For more information about the errors and possible solutions, please read the following articles:
[ERROR] [Help 1] http://cwiki.apache.org/confluence/display/MAVEN/PluginResolutionException
Build step 'Execute shell' marked build as failure

Build failed in Jenkins: Phoenix Compile Compatibility with HBase #741

Posted by Apache Jenkins Server <je...@builds.apache.org>.
See <https://builds.apache.org/job/Phoenix_Compile_Compat_wHBase/741/display/redirect>

------------------------------------------
Started by timer
[EnvInject] - Loading node environment variables.
Building remotely on ubuntu-4 (ubuntu trusty) in workspace <https://builds.apache.org/job/Phoenix_Compile_Compat_wHBase/ws/>
[Phoenix_Compile_Compat_wHBase] $ /bin/bash /tmp/jenkins47020449913884469.sh
core file size          (blocks, -c) 0
data seg size           (kbytes, -d) unlimited
scheduling priority             (-e) 0
file size               (blocks, -f) unlimited
pending signals                 (-i) 193065
max locked memory       (kbytes, -l) 64
max memory size         (kbytes, -m) unlimited
open files                      (-n) 60000
pipe size            (512 bytes, -p) 8
POSIX message queues     (bytes, -q) 819200
real-time priority              (-r) 0
stack size              (kbytes, -s) 8192
cpu time               (seconds, -t) unlimited
max user processes              (-u) 10240
virtual memory          (kbytes, -v) unlimited
file locks                      (-x) unlimited
core id		: 0
core id		: 1
core id		: 10
core id		: 9
physical id	: 0
physical id	: 1
MemTotal:       49451108 kB
MemFree:         1610740 kB
Filesystem      Size  Used Avail Use% Mounted on
udev             24G   12K   24G   1% /dev
tmpfs           4.8G  212M  4.6G   5% /run
/dev/dm-0       3.6T  324G  3.1T  10% /
none            4.0K     0  4.0K   0% /sys/fs/cgroup
none            5.0M     0  5.0M   0% /run/lock
none             24G     0   24G   0% /run/shm
none            100M     0  100M   0% /run/user
/dev/sda2       237M  116M  109M  52% /boot
apache-maven-2.2.1
apache-maven-3.0.4
apache-maven-3.0.5
apache-maven-3.1.1
apache-maven-3.2.1
apache-maven-3.2.5
apache-maven-3.3.3
apache-maven-3.3.9
apache-maven-3.5.0
apache-maven-3.5.2
apache-maven-3.5.4
latest
latest2
latest3


===========================================================================================
Verifying compile level compatibility with HBase 0.98 with Phoenix 4.x-HBase-0.98
===========================================================================================

Cloning into 'hbase'...
Switched to a new branch '0.98'
Branch 0.98 set up to track remote branch 0.98 from origin.
[ERROR] Plugin org.codehaus.mojo:findbugs-maven-plugin:2.5.2 or one of its dependencies could not be resolved: Failed to read artifact descriptor for org.codehaus.mojo:findbugs-maven-plugin:jar:2.5.2: Could not transfer artifact org.codehaus.mojo:findbugs-maven-plugin:pom:2.5.2 from/to central (https://repo.maven.apache.org/maven2): Received fatal alert: protocol_version -> [Help 1]
[ERROR] 
[ERROR] To see the full stack trace of the errors, re-run Maven with the -e switch.
[ERROR] Re-run Maven using the -X switch to enable full debug logging.
[ERROR] 
[ERROR] For more information about the errors and possible solutions, please read the following articles:
[ERROR] [Help 1] http://cwiki.apache.org/confluence/display/MAVEN/PluginResolutionException
Build step 'Execute shell' marked build as failure

Build failed in Jenkins: Phoenix Compile Compatibility with HBase #740

Posted by Apache Jenkins Server <je...@builds.apache.org>.
See <https://builds.apache.org/job/Phoenix_Compile_Compat_wHBase/740/display/redirect>

------------------------------------------
Started by timer
[EnvInject] - Loading node environment variables.
Building remotely on H25 (ubuntu xenial) in workspace <https://builds.apache.org/job/Phoenix_Compile_Compat_wHBase/ws/>
[Phoenix_Compile_Compat_wHBase] $ /bin/bash /tmp/jenkins9048321017524442037.sh
core file size          (blocks, -c) 0
data seg size           (kbytes, -d) unlimited
scheduling priority             (-e) 0
file size               (blocks, -f) unlimited
pending signals                 (-i) 386407
max locked memory       (kbytes, -l) 64
max memory size         (kbytes, -m) unlimited
open files                      (-n) 60000
pipe size            (512 bytes, -p) 8
POSIX message queues     (bytes, -q) 819200
real-time priority              (-r) 0
stack size              (kbytes, -s) 8192
cpu time               (seconds, -t) unlimited
max user processes              (-u) 10240
virtual memory          (kbytes, -v) unlimited
file locks                      (-x) unlimited
core id		: 0
core id		: 1
core id		: 2
core id		: 3
core id		: 4
core id		: 5
physical id	: 0
physical id	: 1
MemTotal:       98957728 kB
MemFree:        40846836 kB
Filesystem      Size  Used Avail Use% Mounted on
udev             48G     0   48G   0% /dev
tmpfs           9.5G   26M  9.5G   1% /run
/dev/sda1       364G  266G   80G  77% /
tmpfs            48G  732K   48G   1% /dev/shm
tmpfs           5.0M     0  5.0M   0% /run/lock
tmpfs            48G     0   48G   0% /sys/fs/cgroup
/dev/loop0       55M   55M     0 100% /snap/lxd/8415
/dev/loop3       32M   32M     0 100% /snap/snapcraft/1594
/dev/loop2       55M   55M     0 100% /snap/lxd/8393
/dev/loop1       55M   55M     0 100% /snap/lxd/8339
/dev/loop4       87M   87M     0 100% /snap/core/5145
tmpfs           1.0M     0  1.0M   0% /var/snap/lxd/common/ns
tmpfs           9.5G     0  9.5G   0% /run/user/910
apache-maven-2.2.1
apache-maven-3.0.4
apache-maven-3.0.5
apache-maven-3.1.1
apache-maven-3.2.1
apache-maven-3.2.5
apache-maven-3.3.3
apache-maven-3.3.9
apache-maven-3.5.0
apache-maven-3.5.2
apache-maven-3.5.4
latest
latest2
latest3


===========================================================================================
Verifying compile level compatibility with HBase 0.98 with Phoenix 4.x-HBase-0.98
===========================================================================================

Cloning into 'hbase'...
Switched to a new branch '0.98'
Branch 0.98 set up to track remote branch 0.98 from origin.
[ERROR] Plugin org.codehaus.mojo:findbugs-maven-plugin:2.5.2 or one of its dependencies could not be resolved: Failed to read artifact descriptor for org.codehaus.mojo:findbugs-maven-plugin:jar:2.5.2: Could not transfer artifact org.codehaus.mojo:findbugs-maven-plugin:pom:2.5.2 from/to central (https://repo.maven.apache.org/maven2): Received fatal alert: protocol_version -> [Help 1]
[ERROR] 
[ERROR] To see the full stack trace of the errors, re-run Maven with the -e switch.
[ERROR] Re-run Maven using the -X switch to enable full debug logging.
[ERROR] 
[ERROR] For more information about the errors and possible solutions, please read the following articles:
[ERROR] [Help 1] http://cwiki.apache.org/confluence/display/MAVEN/PluginResolutionException
Build step 'Execute shell' marked build as failure

Build failed in Jenkins: Phoenix Compile Compatibility with HBase #739

Posted by Apache Jenkins Server <je...@builds.apache.org>.
See <https://builds.apache.org/job/Phoenix_Compile_Compat_wHBase/739/display/redirect>

------------------------------------------
Started by timer
[EnvInject] - Loading node environment variables.
Building remotely on H25 (ubuntu xenial) in workspace <https://builds.apache.org/job/Phoenix_Compile_Compat_wHBase/ws/>
[Phoenix_Compile_Compat_wHBase] $ /bin/bash /tmp/jenkins4488780872009677200.sh
core file size          (blocks, -c) 0
data seg size           (kbytes, -d) unlimited
scheduling priority             (-e) 0
file size               (blocks, -f) unlimited
pending signals                 (-i) 386407
max locked memory       (kbytes, -l) 64
max memory size         (kbytes, -m) unlimited
open files                      (-n) 60000
pipe size            (512 bytes, -p) 8
POSIX message queues     (bytes, -q) 819200
real-time priority              (-r) 0
stack size              (kbytes, -s) 8192
cpu time               (seconds, -t) unlimited
max user processes              (-u) 10240
virtual memory          (kbytes, -v) unlimited
file locks                      (-x) unlimited
core id		: 0
core id		: 1
core id		: 2
core id		: 3
core id		: 4
core id		: 5
physical id	: 0
physical id	: 1
MemTotal:       98957728 kB
MemFree:        42356164 kB
Filesystem      Size  Used Avail Use% Mounted on
udev             48G     0   48G   0% /dev
tmpfs           9.5G   26M  9.5G   1% /run
/dev/sda1       364G  261G   85G  76% /
tmpfs            48G     0   48G   0% /dev/shm
tmpfs           5.0M     0  5.0M   0% /run/lock
tmpfs            48G     0   48G   0% /sys/fs/cgroup
/dev/loop0       55M   55M     0 100% /snap/lxd/8415
/dev/loop3       32M   32M     0 100% /snap/snapcraft/1594
/dev/loop2       55M   55M     0 100% /snap/lxd/8393
/dev/loop1       55M   55M     0 100% /snap/lxd/8339
/dev/loop4       87M   87M     0 100% /snap/core/5145
tmpfs           1.0M     0  1.0M   0% /var/snap/lxd/common/ns
tmpfs           9.5G     0  9.5G   0% /run/user/910
apache-maven-2.2.1
apache-maven-3.0.4
apache-maven-3.0.5
apache-maven-3.1.1
apache-maven-3.2.1
apache-maven-3.2.5
apache-maven-3.3.3
apache-maven-3.3.9
apache-maven-3.5.0
apache-maven-3.5.2
apache-maven-3.5.4
latest
latest2
latest3


===========================================================================================
Verifying compile level compatibility with HBase 0.98 with Phoenix 4.x-HBase-0.98
===========================================================================================

Cloning into 'hbase'...
Switched to a new branch '0.98'
Branch 0.98 set up to track remote branch 0.98 from origin.
[ERROR] Plugin org.codehaus.mojo:findbugs-maven-plugin:2.5.2 or one of its dependencies could not be resolved: Failed to read artifact descriptor for org.codehaus.mojo:findbugs-maven-plugin:jar:2.5.2: Could not transfer artifact org.codehaus.mojo:findbugs-maven-plugin:pom:2.5.2 from/to central (https://repo.maven.apache.org/maven2): Received fatal alert: protocol_version -> [Help 1]
[ERROR] 
[ERROR] To see the full stack trace of the errors, re-run Maven with the -e switch.
[ERROR] Re-run Maven using the -X switch to enable full debug logging.
[ERROR] 
[ERROR] For more information about the errors and possible solutions, please read the following articles:
[ERROR] [Help 1] http://cwiki.apache.org/confluence/display/MAVEN/PluginResolutionException
Build step 'Execute shell' marked build as failure

Build failed in Jenkins: Phoenix Compile Compatibility with HBase #738

Posted by Apache Jenkins Server <je...@builds.apache.org>.
See <https://builds.apache.org/job/Phoenix_Compile_Compat_wHBase/738/display/redirect>

------------------------------------------
Started by timer
[EnvInject] - Loading node environment variables.
Building remotely on H27 (ubuntu xenial) in workspace <https://builds.apache.org/job/Phoenix_Compile_Compat_wHBase/ws/>
[Phoenix_Compile_Compat_wHBase] $ /bin/bash /tmp/jenkins3382299146410400018.sh
core file size          (blocks, -c) 0
data seg size           (kbytes, -d) unlimited
scheduling priority             (-e) 0
file size               (blocks, -f) unlimited
pending signals                 (-i) 386407
max locked memory       (kbytes, -l) 64
max memory size         (kbytes, -m) unlimited
open files                      (-n) 60000
pipe size            (512 bytes, -p) 8
POSIX message queues     (bytes, -q) 819200
real-time priority              (-r) 0
stack size              (kbytes, -s) 8192
cpu time               (seconds, -t) unlimited
max user processes              (-u) 10240
virtual memory          (kbytes, -v) unlimited
file locks                      (-x) unlimited
core id		: 0
core id		: 1
core id		: 2
core id		: 3
core id		: 4
core id		: 5
physical id	: 0
physical id	: 1
MemTotal:       98957728 kB
MemFree:        19780048 kB
Filesystem      Size  Used Avail Use% Mounted on
udev             48G     0   48G   0% /dev
tmpfs           9.5G   18M  9.5G   1% /run
/dev/sda1       364G  262G   85G  76% /
tmpfs            48G     0   48G   0% /dev/shm
tmpfs           5.0M     0  5.0M   0% /run/lock
tmpfs            48G     0   48G   0% /sys/fs/cgroup
/dev/loop0       55M   55M     0 100% /snap/lxd/8358
/dev/loop1       87M   87M     0 100% /snap/core/5145
/dev/loop2       55M   55M     0 100% /snap/lxd/8415
/dev/loop4       55M   55M     0 100% /snap/lxd/8393
/dev/loop3       32M   32M     0 100% /snap/snapcraft/1594
tmpfs           1.0M     0  1.0M   0% /var/snap/lxd/common/ns
tmpfs           9.5G     0  9.5G   0% /run/user/910
apache-maven-2.2.1
apache-maven-3.0.4
apache-maven-3.0.5
apache-maven-3.1.1
apache-maven-3.2.1
apache-maven-3.2.5
apache-maven-3.3.3
apache-maven-3.3.9
apache-maven-3.5.0
apache-maven-3.5.2
apache-maven-3.5.4
latest
latest2
latest3


===========================================================================================
Verifying compile level compatibility with HBase 0.98 with Phoenix 4.x-HBase-0.98
===========================================================================================

Cloning into 'hbase'...
Switched to a new branch '0.98'
Branch 0.98 set up to track remote branch 0.98 from origin.
[ERROR] Plugin org.codehaus.mojo:findbugs-maven-plugin:2.5.2 or one of its dependencies could not be resolved: Failed to read artifact descriptor for org.codehaus.mojo:findbugs-maven-plugin:jar:2.5.2: Could not transfer artifact org.codehaus.mojo:findbugs-maven-plugin:pom:2.5.2 from/to central (https://repo.maven.apache.org/maven2): Received fatal alert: protocol_version -> [Help 1]
[ERROR] 
[ERROR] To see the full stack trace of the errors, re-run Maven with the -e switch.
[ERROR] Re-run Maven using the -X switch to enable full debug logging.
[ERROR] 
[ERROR] For more information about the errors and possible solutions, please read the following articles:
[ERROR] [Help 1] http://cwiki.apache.org/confluence/display/MAVEN/PluginResolutionException
Build step 'Execute shell' marked build as failure

Build failed in Jenkins: Phoenix Compile Compatibility with HBase #737

Posted by Apache Jenkins Server <je...@builds.apache.org>.
See <https://builds.apache.org/job/Phoenix_Compile_Compat_wHBase/737/display/redirect>

------------------------------------------
Started by timer
[EnvInject] - Loading node environment variables.
Building remotely on H35 (ubuntu xenial) in workspace <https://builds.apache.org/job/Phoenix_Compile_Compat_wHBase/ws/>
[Phoenix_Compile_Compat_wHBase] $ /bin/bash /tmp/jenkins5205595708194018784.sh
core file size          (blocks, -c) 0
data seg size           (kbytes, -d) unlimited
scheduling priority             (-e) 0
file size               (blocks, -f) unlimited
pending signals                 (-i) 386517
max locked memory       (kbytes, -l) 64
max memory size         (kbytes, -m) unlimited
open files                      (-n) 60000
pipe size            (512 bytes, -p) 8
POSIX message queues     (bytes, -q) 819200
real-time priority              (-r) 0
stack size              (kbytes, -s) 8192
cpu time               (seconds, -t) unlimited
max user processes              (-u) 10240
virtual memory          (kbytes, -v) unlimited
file locks                      (-x) unlimited
core id		: 0
core id		: 1
core id		: 2
core id		: 3
core id		: 4
core id		: 5
physical id	: 0
physical id	: 1
MemTotal:       98985916 kB
MemFree:        56035764 kB
Filesystem      Size  Used Avail Use% Mounted on
udev             48G     0   48G   0% /dev
tmpfs           9.5G   18M  9.5G   1% /run
/dev/sda1       364G  198G  149G  58% /
tmpfs            48G     0   48G   0% /dev/shm
tmpfs           5.0M     0  5.0M   0% /run/lock
tmpfs            48G     0   48G   0% /sys/fs/cgroup
/dev/loop0       55M   55M     0 100% /snap/lxd/8393
/dev/loop1       55M   55M     0 100% /snap/lxd/8415
/dev/loop2       87M   87M     0 100% /snap/core/4917
/dev/loop4       87M   87M     0 100% /snap/core/5145
/dev/loop3       55M   55M     0 100% /snap/lxd/8358
/dev/loop5       32M   32M     0 100% /snap/snapcraft/1594
tmpfs           1.0M     0  1.0M   0% /var/snap/lxd/common/ns
tmpfs           9.5G     0  9.5G   0% /run/user/910
apache-maven-2.2.1
apache-maven-3.0.4
apache-maven-3.0.5
apache-maven-3.1.1
apache-maven-3.2.1
apache-maven-3.2.5
apache-maven-3.3.3
apache-maven-3.3.9
apache-maven-3.5.0
apache-maven-3.5.2
apache-maven-3.5.4
latest
latest2
latest3


===========================================================================================
Verifying compile level compatibility with HBase 0.98 with Phoenix 4.x-HBase-0.98
===========================================================================================

Cloning into 'hbase'...
Switched to a new branch '0.98'
Branch 0.98 set up to track remote branch 0.98 from origin.
[ERROR] Plugin org.codehaus.mojo:findbugs-maven-plugin:2.5.2 or one of its dependencies could not be resolved: Failed to read artifact descriptor for org.codehaus.mojo:findbugs-maven-plugin:jar:2.5.2: Could not transfer artifact org.codehaus.mojo:findbugs-maven-plugin:pom:2.5.2 from/to central (https://repo.maven.apache.org/maven2): Received fatal alert: protocol_version -> [Help 1]
[ERROR] 
[ERROR] To see the full stack trace of the errors, re-run Maven with the -e switch.
[ERROR] Re-run Maven using the -X switch to enable full debug logging.
[ERROR] 
[ERROR] For more information about the errors and possible solutions, please read the following articles:
[ERROR] [Help 1] http://cwiki.apache.org/confluence/display/MAVEN/PluginResolutionException
Build step 'Execute shell' marked build as failure

Build failed in Jenkins: Phoenix Compile Compatibility with HBase #736

Posted by Apache Jenkins Server <je...@builds.apache.org>.
See <https://builds.apache.org/job/Phoenix_Compile_Compat_wHBase/736/display/redirect>

------------------------------------------
Started by timer
[EnvInject] - Loading node environment variables.
Building remotely on H26 (ubuntu xenial) in workspace <https://builds.apache.org/job/Phoenix_Compile_Compat_wHBase/ws/>
[Phoenix_Compile_Compat_wHBase] $ /bin/bash /tmp/jenkins528573554267555492.sh
core file size          (blocks, -c) 0
data seg size           (kbytes, -d) unlimited
scheduling priority             (-e) 0
file size               (blocks, -f) unlimited
pending signals                 (-i) 386407
max locked memory       (kbytes, -l) 64
max memory size         (kbytes, -m) unlimited
open files                      (-n) 60000
pipe size            (512 bytes, -p) 8
POSIX message queues     (bytes, -q) 819200
real-time priority              (-r) 0
stack size              (kbytes, -s) 8192
cpu time               (seconds, -t) unlimited
max user processes              (-u) 10240
virtual memory          (kbytes, -v) unlimited
file locks                      (-x) unlimited
core id		: 0
core id		: 1
core id		: 2
core id		: 3
core id		: 4
core id		: 5
physical id	: 0
physical id	: 1
MemTotal:       98957728 kB
MemFree:        83251036 kB
Filesystem      Size  Used Avail Use% Mounted on
udev             48G     0   48G   0% /dev
tmpfs           9.5G  9.3M  9.5G   1% /run
/dev/sda1       364G  220G  126G  64% /
tmpfs            48G     0   48G   0% /dev/shm
tmpfs           5.0M     0  5.0M   0% /run/lock
tmpfs            48G     0   48G   0% /sys/fs/cgroup
/dev/loop0       32M   32M     0 100% /snap/snapcraft/1594
/dev/loop1       55M   55M     0 100% /snap/lxd/8415
/dev/loop2       55M   55M     0 100% /snap/lxd/8358
/dev/loop3       55M   55M     0 100% /snap/lxd/8393
/dev/loop4       87M   87M     0 100% /snap/core/5145
tmpfs           1.0M     0  1.0M   0% /var/snap/lxd/common/ns
tmpfs           9.5G     0  9.5G   0% /run/user/910
apache-maven-2.2.1
apache-maven-3.0.4
apache-maven-3.0.5
apache-maven-3.1.1
apache-maven-3.2.1
apache-maven-3.2.5
apache-maven-3.3.3
apache-maven-3.3.9
apache-maven-3.5.0
apache-maven-3.5.2
apache-maven-3.5.4
latest
latest2
latest3


===========================================================================================
Verifying compile level compatibility with HBase 0.98 with Phoenix 4.x-HBase-0.98
===========================================================================================

Cloning into 'hbase'...
Switched to a new branch '0.98'
Branch 0.98 set up to track remote branch 0.98 from origin.
[ERROR] Plugin org.codehaus.mojo:findbugs-maven-plugin:2.5.2 or one of its dependencies could not be resolved: Failed to read artifact descriptor for org.codehaus.mojo:findbugs-maven-plugin:jar:2.5.2: Could not transfer artifact org.codehaus.mojo:findbugs-maven-plugin:pom:2.5.2 from/to central (https://repo.maven.apache.org/maven2): Received fatal alert: protocol_version -> [Help 1]
[ERROR] 
[ERROR] To see the full stack trace of the errors, re-run Maven with the -e switch.
[ERROR] Re-run Maven using the -X switch to enable full debug logging.
[ERROR] 
[ERROR] For more information about the errors and possible solutions, please read the following articles:
[ERROR] [Help 1] http://cwiki.apache.org/confluence/display/MAVEN/PluginResolutionException
Build step 'Execute shell' marked build as failure

Build failed in Jenkins: Phoenix Compile Compatibility with HBase #735

Posted by Apache Jenkins Server <je...@builds.apache.org>.
See <https://builds.apache.org/job/Phoenix_Compile_Compat_wHBase/735/display/redirect>

------------------------------------------
Started by timer
[EnvInject] - Loading node environment variables.
Building remotely on H25 (ubuntu xenial) in workspace <https://builds.apache.org/job/Phoenix_Compile_Compat_wHBase/ws/>
[Phoenix_Compile_Compat_wHBase] $ /bin/bash /tmp/jenkins1096099193344335486.sh
core file size          (blocks, -c) 0
data seg size           (kbytes, -d) unlimited
scheduling priority             (-e) 0
file size               (blocks, -f) unlimited
pending signals                 (-i) 386413
max locked memory       (kbytes, -l) 64
max memory size         (kbytes, -m) unlimited
open files                      (-n) 60000
pipe size            (512 bytes, -p) 8
POSIX message queues     (bytes, -q) 819200
real-time priority              (-r) 0
stack size              (kbytes, -s) 8192
cpu time               (seconds, -t) unlimited
max user processes              (-u) 10240
virtual memory          (kbytes, -v) unlimited
file locks                      (-x) unlimited
core id		: 0
core id		: 1
core id		: 2
core id		: 3
core id		: 4
core id		: 5
physical id	: 0
physical id	: 1
MemTotal:       98957736 kB
MemFree:        39851848 kB
Filesystem      Size  Used Avail Use% Mounted on
udev             48G     0   48G   0% /dev
tmpfs           9.5G  404M  9.1G   5% /run
/dev/sda1       364G  245G  101G  71% /
tmpfs            48G     0   48G   0% /dev/shm
tmpfs           5.0M     0  5.0M   0% /run/lock
tmpfs            48G     0   48G   0% /sys/fs/cgroup
tmpfs           9.5G     0  9.5G   0% /run/user/910
/dev/loop0       87M   87M     0 100% /snap/core/5145
/dev/loop1       32M   32M     0 100% /snap/snapcraft/1594
tmpfs           1.0M     0  1.0M   0% /var/snap/lxd/common/ns
/dev/loop5       55M   55M     0 100% /snap/lxd/8339
/dev/loop6       55M   55M     0 100% /snap/lxd/8393
/dev/loop7       55M   55M     0 100% /snap/lxd/8415
apache-maven-2.2.1
apache-maven-3.0.4
apache-maven-3.0.5
apache-maven-3.1.1
apache-maven-3.2.1
apache-maven-3.2.5
apache-maven-3.3.3
apache-maven-3.3.9
apache-maven-3.5.0
apache-maven-3.5.2
apache-maven-3.5.4
latest
latest2
latest3


===========================================================================================
Verifying compile level compatibility with HBase 0.98 with Phoenix 4.x-HBase-0.98
===========================================================================================

Cloning into 'hbase'...
Switched to a new branch '0.98'
Branch 0.98 set up to track remote branch 0.98 from origin.
[ERROR] Plugin org.codehaus.mojo:findbugs-maven-plugin:2.5.2 or one of its dependencies could not be resolved: Failed to read artifact descriptor for org.codehaus.mojo:findbugs-maven-plugin:jar:2.5.2: Could not transfer artifact org.codehaus.mojo:findbugs-maven-plugin:pom:2.5.2 from/to central (https://repo.maven.apache.org/maven2): Received fatal alert: protocol_version -> [Help 1]
[ERROR] 
[ERROR] To see the full stack trace of the errors, re-run Maven with the -e switch.
[ERROR] Re-run Maven using the -X switch to enable full debug logging.
[ERROR] 
[ERROR] For more information about the errors and possible solutions, please read the following articles:
[ERROR] [Help 1] http://cwiki.apache.org/confluence/display/MAVEN/PluginResolutionException
Build step 'Execute shell' marked build as failure

Build failed in Jenkins: Phoenix Compile Compatibility with HBase #734

Posted by Apache Jenkins Server <je...@builds.apache.org>.
See <https://builds.apache.org/job/Phoenix_Compile_Compat_wHBase/734/display/redirect>

------------------------------------------
Started by timer
[EnvInject] - Loading node environment variables.
Building remotely on H23 (ubuntu xenial) in workspace <https://builds.apache.org/job/Phoenix_Compile_Compat_wHBase/ws/>
[Phoenix_Compile_Compat_wHBase] $ /bin/bash /tmp/jenkins6305338381374920986.sh
core file size          (blocks, -c) 0
data seg size           (kbytes, -d) unlimited
scheduling priority             (-e) 0
file size               (blocks, -f) unlimited
pending signals                 (-i) 386413
max locked memory       (kbytes, -l) 64
max memory size         (kbytes, -m) unlimited
open files                      (-n) 60000
pipe size            (512 bytes, -p) 8
POSIX message queues     (bytes, -q) 819200
real-time priority              (-r) 0
stack size              (kbytes, -s) 8192
cpu time               (seconds, -t) unlimited
max user processes              (-u) 10240
virtual memory          (kbytes, -v) unlimited
file locks                      (-x) unlimited
core id		: 0
core id		: 1
core id		: 2
core id		: 3
core id		: 4
core id		: 5
physical id	: 0
physical id	: 1
MemTotal:       98957736 kB
MemFree:        11683476 kB
Filesystem      Size  Used Avail Use% Mounted on
udev             48G     0   48G   0% /dev
tmpfs           9.5G  460M  9.0G   5% /run
/dev/sda1       364G  240G  106G  70% /
tmpfs            48G     0   48G   0% /dev/shm
tmpfs           5.0M     0  5.0M   0% /run/lock
tmpfs            48G     0   48G   0% /sys/fs/cgroup
tmpfs           9.5G     0  9.5G   0% /run/user/910
/dev/loop0       87M   87M     0 100% /snap/core/5145
/dev/loop1       32M   32M     0 100% /snap/snapcraft/1594
/dev/loop5       55M   55M     0 100% /snap/lxd/8339
/dev/loop6       55M   55M     0 100% /snap/lxd/8393
/dev/loop7       55M   55M     0 100% /snap/lxd/8415
apache-maven-2.2.1
apache-maven-3.0.4
apache-maven-3.0.5
apache-maven-3.1.1
apache-maven-3.2.1
apache-maven-3.2.5
apache-maven-3.3.3
apache-maven-3.3.9
apache-maven-3.5.0
apache-maven-3.5.2
apache-maven-3.5.4
latest
latest2
latest3


===========================================================================================
Verifying compile level compatibility with HBase 0.98 with Phoenix 4.x-HBase-0.98
===========================================================================================

Cloning into 'hbase'...
Switched to a new branch '0.98'
Branch 0.98 set up to track remote branch 0.98 from origin.
[ERROR] Plugin org.codehaus.mojo:findbugs-maven-plugin:2.5.2 or one of its dependencies could not be resolved: Failed to read artifact descriptor for org.codehaus.mojo:findbugs-maven-plugin:jar:2.5.2: Could not transfer artifact org.codehaus.mojo:findbugs-maven-plugin:pom:2.5.2 from/to central (https://repo.maven.apache.org/maven2): Received fatal alert: protocol_version -> [Help 1]
[ERROR] 
[ERROR] To see the full stack trace of the errors, re-run Maven with the -e switch.
[ERROR] Re-run Maven using the -X switch to enable full debug logging.
[ERROR] 
[ERROR] For more information about the errors and possible solutions, please read the following articles:
[ERROR] [Help 1] http://cwiki.apache.org/confluence/display/MAVEN/PluginResolutionException
Build step 'Execute shell' marked build as failure