You are viewing a plain text version of this content. The canonical link for it is here.
Posted to builds@cassandra.apache.org by Apache Jenkins Server <je...@builds.apache.org> on 2022/05/19 00:53:28 UTC
Build complete: Cassandra-4.1 #27 [FAILURE] c47dbf0a478c7a5a8e0dddc3291d9eee460d4b30
-------------------------------------------------------------------------------
Build Cassandra-4.1 #27 Still Failing
URL: https://ci-cassandra.apache.org/job/Cassandra-4.1/27/
-------------------------------------------------------------------------------
Changes:
No changes
-------------------------------------------------------------------------------
Failed Tests:
36 tests failed.
FAILED: dtest-novnode.cdc_test.TestCDC.test_insertion_and_commitlog_behavior_after_reaching_cdc_total_space
FAILED: dtest-offheap.bootstrap_test.TestBootstrap.test_simultaneous_bootstrap
FAILED: dtest-upgrade.upgrade_tests.cql_tests.TestCQLNodes2RF1_Upgrade_current_3_11_x_To_indev_4_1_x.test_conditional_update
FAILED: dtest-upgrade.upgrade_tests.cql_tests.TestCQLNodes3RF3_Upgrade_indev_3_11_x_To_indev_4_1_x.test_multi_collection
FAILED: dtest-upgrade.upgrade_tests.cql_tests.TestCQLNodes2RF1_Upgrade_indev_3_11_x_To_indev_4_1_x.test_date
FAILED: org.apache.cassandra.cql3.statements.DescribeStatementTest.testDescribeFunctionAndAggregate-cdc
FAILED: org.apache.cassandra.db.SinglePartitionSliceCommandTest.testPartitionDeletionRowDeletionTie-cdc
FAILED: org.apache.cassandra.db.SinglePartitionSliceCommandTest.testPartitionDeletionRowDeletionTie-cdc
FAILED: org.apache.cassandra.tools.TopPartitionsTest.testServiceTopPartitionsSingleTable-cdc
FAILED: org.apache.cassandra.cql3.ViewComplexTTLTest.terminated successfully
FAILED: org.apache.cassandra.transport.CQLConnectionTest.handleCorruptionOfLargeMessageFrame-cdc
FAILED: org.apache.cassandra.cql3.validation.entities.TupleTypeTest.testReversedTypeTuple
FAILED: org.apache.cassandra.cql3.ViewFilteringClustering1Test.testClusteringKeySliceRestrictions[3]
FAILED: org.apache.cassandra.cql3.validation.entities.SecondaryIndexTest.testIndexOnDurationColumn
FAILED: org.apache.cassandra.cql3.validation.entities.SecondaryIndexTest.prepareStatementsWithLIKEClauses
FAILED: org.apache.cassandra.cql3.ViewComplexTest.testMVWithDifferentColumnsWithoutFlush[3]
FAILED: org.apache.cassandra.cql3.ViewFilteringSimplePKTest.testPartitionKeyFilteringWithSlice[3]
FAILED: org.apache.cassandra.cql3.ViewComplexDeletionsPartialTest.testPartialDeleteSelectedColumnWithFlush[3]
FAILED: org.apache.cassandra.cql3.ViewComplexDeletionsTest.testCommutativeRowDeletionFlush[3]
FAILED: org.apache.cassandra.db.RangeTombstoneTest.overlappingRangeTest-compression
FAILED: org.apache.cassandra.tools.TopPartitionsTest.testServiceTopPartitionsSingleTable-compression
FAILED: org.apache.cassandra.cql3.validation.operations.CompactStorageTest.testUpdate
FAILED: org.apache.cassandra.cql3.validation.operations.SelectTest.filteringWithOrderClause
FAILED: org.apache.cassandra.cql3.validation.operations.SelectTest.filteringWithMultiColumnSlices
FAILED: org.apache.cassandra.db.context.CounterContextTest.unknown
FAILED: org.apache.cassandra.cql3.validation.entities.UFIdentificationTest.testModificationStatementWithConditions
FAILED: org.apache.cassandra.db.RepairedDataTombstonesTest.readTestRowTombstones
FAILED: org.apache.cassandra.db.RepairedDataTombstonesTest.readTestOldUnrepaired
FAILED: org.apache.cassandra.db.RepairedDataTombstonesTest.compactionTest
FAILED: org.apache.cassandra.db.RepairedDataTombstonesTest.readTestPartitionTombstones
FAILED: org.apache.cassandra.db.RepairedDataTombstonesTest.readTest
FAILED: org.apache.cassandra.db.RepairedDataTombstonesTest.compactionDropExpiredSSTableTest
FAILED: org.apache.cassandra.db.RepairedDataTombstonesTest.readOnlyUnrepairedTest
FAILED: org.apache.cassandra.db.commitlog.CommitLogSegmentManagerCDCTest.testSwitchingCDCWriteModes
FAILED: org.apache.cassandra.cql3.ViewComplexTTLTest.testUpdateColumnInViewPKWithTTLWithFlush[3]
FAILED: org.apache.cassandra.cql3.ViewFilteringClustering1Test.terminated successfully
-------------------------------------------------------------------------------
For complete test report and logs see https://nightlies.apache.org/cassandra/Cassandra-4.1/27/