You are viewing a plain text version of this content. The canonical link for it is here.
Posted to notifications@directory.apache.org by Apache Jenkins Server <je...@builds.apache.org> on 2013/04/08 07:16:16 UTC
Build failed in Jenkins: dir-apacheds-jdk16-win #373
See <https://builds.apache.org/job/dir-apacheds-jdk16-win/373/>
------------------------------------------
[...truncated 3354 lines...]
Completed so far :
(consumer1 completed)
NbAdded every 100ms :
0, 10
<-- Done
--->Running testInitialRefresh4Consumers
Completed so far :
(consumer2 completed)
(consumer4 completed)
(consumer1 completed)
(consumer3 completed)
<-- Done
---> Running testInitialRefreshLoad
NbAdded every 100ms :
0, 11
<-- Done
Tests run: 4, Failures: 0, Errors: 0, Skipped: 0, Time elapsed: 21.576 sec
Running org.apache.directory.server.replication.ClientServerReplicationIT
------------------------------------- Stop consumer
------------------------------------- Start consumer
------------------------------------- Stop consumer
------------------------------------- Start consumer
------------------------------------- Stop consumer
------------------------------------- Start consumer
------------------------------------- Stop consumer
------------------------------------- Start consumer
------------------------------------- Stop consumer
------------------------------------- Start consumer
------------------------------------- Stop consumer
------------------------------------- Start consumer
------------------------------------- Stop consumer
------------------------------------- Start consumer
------------------------------------- Stop consumer
------------------------------------- Start consumer
------------------------------------- Stop consumer
------------------------------------- Start consumer
------------------------------------- Stop consumer
------------------------------------- Start consumer
>--------------------------------------- Adding Entry
dn[n]: cn=user13,dc=example,dc=com
objectclass: person
cn: user13
sn: user13
>--------------------------------------- Added
>--------------------------------------- Modifying MessageType : MODIFY_REQUEST
Message ID : -1
Modify Request
Object : 'cn=user13,dc=example,dc=com'
Modification[0]
Operation : add
Modification
userPassword: secret
org.apache.directory.api.ldap.model.message.ModifyRequestImpl@6df30ed5
>--------------------------------------- Modified
Tests run: 5, Failures: 0, Errors: 0, Skipped: 2, Time elapsed: 46.166 sec
Running org.apache.directory.server.replication.StaleEventLogDetectionIT
---> Running testDeleteStaleEventLog
NbAdded every 100ms :
0, 11
<-- Done
Tests run: 1, Failures: 0, Errors: 0, Skipped: 0, Time elapsed: 26.662 sec
Running org.apache.directory.server.schema.SchemaIT
Tests run: 3, Failures: 0, Errors: 0, Skipped: 0, Time elapsed: 32.093 sec
Running org.apache.directory.server.ssl.LdapsIT
Tests run: 1, Failures: 0, Errors: 0, Skipped: 0, Time elapsed: 9.619 sec
Running org.apache.directory.server.ssl.LdapsUpdateCertificateIT
Tests run: 1, Failures: 0, Errors: 0, Skipped: 0, Time elapsed: 7.78 sec
Running org.apache.directory.server.ssl.StartTlsConfidentialityIT
Tests run: 1, Failures: 0, Errors: 0, Skipped: 0, Time elapsed: 10.785 sec
Running org.apache.directory.server.ssl.StartTlsIT
Tests run: 1, Failures: 0, Errors: 0, Skipped: 0, Time elapsed: 7.718 sec
Running org.apache.directory.server.ssl.StartTlsUpdateCertificateIT
Results :
Tests run: 412, Failures: 0, Errors: 0, Skipped: 14
[JENKINS] Recording test results
[INFO] ------------------------------------------------------------------------
[INFO] Reactor Summary:
[INFO]
[INFO] ApacheDS .......................................... SUCCESS [6.421s]
[INFO] ApacheDS I18n ..................................... SUCCESS [5.623s]
[INFO] ApacheDS Core Constants ........................... SUCCESS [1.267s]
[INFO] ApacheDS Core API ................................. SUCCESS [20.036s]
[INFO] ApacheDS Core Shared .............................. SUCCESS [3.549s]
[INFO] ApacheDS Interceptors ............................. SUCCESS [0.113s]
[INFO] ApacheDS AdministrativePoint Interceptor .......... SUCCESS [1.739s]
[INFO] ApacheDS Authentication Interceptor ............... SUCCESS [4.266s]
[INFO] ApacheDS Authorization Interceptor ................ SUCCESS [5.233s]
[INFO] ApacheDS ChangeLog Interceptor .................... SUCCESS [3.105s]
[INFO] ApacheDS Collective Attribute Interceptor ......... SUCCESS [1.397s]
[INFO] ApacheDS Event Interceptor ........................ SUCCESS [1.468s]
[INFO] ApacheDS Exception Interceptor .................... SUCCESS [1.519s]
[INFO] ApacheDS Journal Interceptor ...................... SUCCESS [1.316s]
[INFO] ApacheDS Normalization Interceptor ................ SUCCESS [3.388s]
[INFO] ApacheDS Operational Attribute Interceptor ........ SUCCESS [1.325s]
[INFO] ApacheDS Referral Interceptor ..................... SUCCESS [1.515s]
[INFO] ApacheDS Schema Interceptor ....................... SUCCESS [7.512s]
[INFO] ApacheDS Subtree Interceptor ...................... SUCCESS [11.162s]
[INFO] ApacheDS Triggers Interceptor ..................... SUCCESS [1.966s]
[INFO] ApacheDS Core ..................................... SUCCESS [5.418s]
[INFO] ApacheDS Core AVL ................................. SUCCESS [7.997s]
[INFO] ApacheDS Generalized (X) DBM Partition ............ SUCCESS [20.427s]
[INFO] ApacheDS LDIF Partition ........................... SUCCESS [17.818s]
[INFO] ApacheDS JDBM Partition ........................... SUCCESS [40.053s]
[INFO] ApacheDS Core Annotations ......................... SUCCESS [45.293s]
[INFO] ApacheDS Core JNDI ................................ SUCCESS [3.071s]
[INFO] ApacheDS Protocol Kerberos Codec .................. SUCCESS [16.797s]
[INFO] ApacheDS Interceptors for Kerberos ................ SUCCESS [1.883s]
[INFO] ApacheDS Protocol Dhcp ............................ SUCCESS [2.502s]
[INFO] ApacheDS Protocol Shared .......................... SUCCESS [1.878s]
[INFO] ApacheDS Protocol Dns ............................. SUCCESS [4.529s]
[INFO] ApacheDS Protocol Kerberos ........................ SUCCESS [5.297s]
[INFO] ApacheDS Protocol Ldap ............................ SUCCESS [57.700s]
[INFO] ApacheDS Protocol Ntp ............................. SUCCESS [2.621s]
[INFO] Apacheds Server Annotations ....................... SUCCESS [1:10.548s]
[INFO] ApacheDS Server Config ............................ SUCCESS [27.409s]
[INFO] ApacheDS Server JNDI .............................. SUCCESS [3.670s]
[INFO] ApacheDS Test Framework ........................... SUCCESS [1:58.916s]
[INFO] ApacheDS All ...................................... SUCCESS [9.798s]
[INFO] ApacheDS Logger Interceptor ....................... SUCCESS [1.666s]
[INFO] ApacheDS Password Hashing Interceptor ............. SUCCESS [1.496s]
[INFO] ApacheDS Core Integration ......................... SUCCESS [32:41.301s]
[INFO] ApacheDS Server Integration ....................... FAILURE [30:23.222s]
[INFO] ApacheDS DirectoryService-WebApp bridge ........... SKIPPED
[INFO] ApacheDS Jetty HTTP Server Integration ............ SKIPPED
[INFO] ApacheDS Service Builder .......................... SKIPPED
[INFO] ApacheDS Protocol Kerberos Test ................... SKIPPED
[INFO] Apache Directory LDAP Client API test ............. SKIPPED
[INFO] kerberos-client ................................... SKIPPED
[INFO] ApacheDS Service .................................. SKIPPED
[INFO] ApacheDS Wrapper .................................. SKIPPED
[INFO] ApacheDS Installers Maven Plugin .................. SKIPPED
[INFO] ApacheDS Installers ............................... SKIPPED
[INFO] ------------------------------------------------------------------------
[INFO] BUILD FAILURE
[INFO] ------------------------------------------------------------------------
[INFO] Total time: 1:12:20.756s
[INFO] Finished at: Mon Apr 08 06:15:41 BST 2013
[INFO] Final Memory: 53M/247M
[INFO] ------------------------------------------------------------------------
[JENKINS] Archiving disabled
[JENKINS] Archiving disabled
[JENKINS] Archiving disabled
[JENKINS] Archiving disabled
[JENKINS] Archiving disabled
[JENKINS] Archiving disabled
[JENKINS] Archiving disabled
[JENKINS] Archiving disabled
[JENKINS] Archiving disabled
[JENKINS] Archiving disabled
[JENKINS] Archiving disabled
[JENKINS] Archiving disabled
[JENKINS] Archiving disabled
[JENKINS] Archiving disabled
[JENKINS] Archiving disabled
[JENKINS] Archiving disabled
[JENKINS] Archiving disabled
[JENKINS] Archiving disabled
[JENKINS] Archiving disabled
[JENKINS] Archiving disabled
[JENKINS] Archiving disabled
[JENKINS] Archiving disabled
[JENKINS] Archiving disabled
[JENKINS] Archiving disabled
[JENKINS] Archiving disabled
[JENKINS] Archiving disabled
[JENKINS] Archiving disabled
[JENKINS] Archiving disabled
[JENKINS] Archiving disabled
[JENKINS] Archiving disabled
[JENKINS] Archiving disabled
[JENKINS] Archiving disabled
[JENKINS] Archiving disabled
[JENKINS] Archiving disabled
[JENKINS] Archiving disabled
[JENKINS] Archiving disabled
[JENKINS] Archiving disabled
[JENKINS] Archiving disabled
[JENKINS] Archiving disabled
[JENKINS] Archiving disabled
[JENKINS] Archiving disabled
[JENKINS] Archiving disabled
[JENKINS] Archiving disabled
[JENKINS] Archiving disabled
[JENKINS] Archiving disabled
[JENKINS] Archiving disabled
[JENKINS] Archiving disabled
[JENKINS] Archiving disabled
[JENKINS] Archiving disabled
[JENKINS] Archiving disabled
[JENKINS] Archiving disabled
[JENKINS] Archiving disabled
[JENKINS] Archiving disabled
[JENKINS] Archiving disabled
Waiting for Jenkins to finish collecting data
mavenExecutionResult exceptions not empty
message : Failed to execute goal org.apache.maven.plugins:maven-surefire-plugin:2.12.2:test (default-test) on project apacheds-server-integ: Failure or timeout
cause : Failure or timeout
Stack trace :
org.apache.maven.lifecycle.LifecycleExecutionException: Failed to execute goal org.apache.maven.plugins:maven-surefire-plugin:2.12.2:test (default-test) on project apacheds-server-integ: Failure or timeout
at org.apache.maven.lifecycle.internal.MojoExecutor.execute(MojoExecutor.java:217)
at org.apache.maven.lifecycle.internal.MojoExecutor.execute(MojoExecutor.java:153)
at org.apache.maven.lifecycle.internal.MojoExecutor.execute(MojoExecutor.java:145)
at org.apache.maven.lifecycle.internal.LifecycleModuleBuilder.buildProject(LifecycleModuleBuilder.java:84)
at org.apache.maven.lifecycle.internal.LifecycleModuleBuilder.buildProject(LifecycleModuleBuilder.java:59)
at org.apache.maven.lifecycle.internal.LifecycleStarter.singleThreadedBuild(LifecycleStarter.java:183)
at org.apache.maven.lifecycle.internal.LifecycleStarter.execute(LifecycleStarter.java:161)
at org.apache.maven.DefaultMaven.doExecute(DefaultMaven.java:319)
at org.apache.maven.DefaultMaven.execute(DefaultMaven.java:156)
at org.jvnet.hudson.maven3.launcher.Maven3Launcher.main(Maven3Launcher.java:79)
at sun.reflect.NativeMethodAccessorImpl.invoke0(Native Method)
at sun.reflect.NativeMethodAccessorImpl.invoke(NativeMethodAccessorImpl.java:39)
at sun.reflect.DelegatingMethodAccessorImpl.invoke(DelegatingMethodAccessorImpl.java:25)
at java.lang.reflect.Method.invoke(Method.java:597)
at org.codehaus.plexus.classworlds.launcher.Launcher.launchStandard(Launcher.java:329)
at org.codehaus.plexus.classworlds.launcher.Launcher.launch(Launcher.java:239)
at org.jvnet.hudson.maven3.agent.Maven3Main.launch(Maven3Main.java:158)
at hudson.maven.Maven3Builder.call(Maven3Builder.java:100)
at hudson.maven.Maven3Builder.call(Maven3Builder.java:66)
at hudson.remoting.UserRequest.perform(UserRequest.java:118)
at hudson.remoting.UserRequest.perform(UserRequest.java:48)
at hudson.remoting.Request$2.run(Request.java:326)
at hudson.remoting.InterceptingExecutorService$1.call(InterceptingExecutorService.java:72)
at java.util.concurrent.FutureTask$Sync.innerRun(FutureTask.java:303)
at java.util.concurrent.FutureTask.run(FutureTask.java:138)
at java.util.concurrent.ThreadPoolExecutor$Worker.runTask(ThreadPoolExecutor.java:886)
at java.util.concurrent.ThreadPoolExecutor$Worker.run(ThreadPoolExecutor.java:908)
at java.lang.Thread.run(Thread.java:662)
Caused by: org.apache.maven.plugin.MojoExecutionException: Failure or timeout
at org.apache.maven.plugin.surefire.SurefirePlugin.assertNoFailureOrTimeout(SurefirePlugin.java:177)
at org.apache.maven.plugin.surefire.SurefirePlugin.handleSummary(SurefirePlugin.java:158)
at org.apache.maven.plugin.surefire.AbstractSurefireMojo.executeAfterPreconditionsChecked(AbstractSurefireMojo.java:626)
at org.apache.maven.plugin.surefire.AbstractSurefireMojo.execute(AbstractSurefireMojo.java:587)
at org.apache.maven.plugin.DefaultBuildPluginManager.executeMojo(DefaultBuildPluginManager.java:107)
at org.apache.maven.lifecycle.internal.MojoExecutor.execute(MojoExecutor.java:209)
... 27 more
Sending e-mails to: notifications@directory.apache.org
channel stopped
Build failed in Jenkins: dir-apacheds-jdk16-win #375
Posted by Apache Jenkins Server <je...@builds.apache.org>.
See <https://builds.apache.org/job/dir-apacheds-jdk16-win/375/changes>
Changes:
[elecharny] [maven-release-plugin] prepare for next development iteration
[elecharny] [maven-release-plugin] prepare release 2.0.0-RC1
[elecharny] Bumped up the ldap-api revision to 1.0.0-RC1
[elecharny] removed EhCache warnings
[elecharny] The connection are set with no time limit, for debug purpose
[elecharny] One more SASL callBackHander with the wrong package...
[elecharny] The package has changed for the SASL mech handlers
[kayyagari] load the ppolicy attributes irrespective of the state of ppolicy configuration this should let an admin unlock users
even if ppolicy is disabled (DIRSERVER-1813)
------------------------------------------
[...truncated 193 lines...]
[INFO] Building ApacheDS Core Constants 2.0.0-RC2-SNAPSHOT
[INFO] ------------------------------------------------------------------------
[INFO]
[INFO] --- maven-clean-plugin:2.4.1:clean (default-clean) @ apacheds-core-constants ---[INFO] Deleting F:\hudson\hudson-slave\workspace\dir-apacheds-jdk16-win\trunk\core-constants\target
[INFO]
[INFO] --- maven-remote-resources-plugin:1.2.1:process (default) @ apacheds-core-constants ---
[INFO] [debug] execute contextualize
[INFO] Using 'UTF-8' encoding to copy filtered resources.
[INFO] --- maven-resources-plugin:2.5:resources (default-resources) @ apacheds-core-constants ---
[INFO] Copying 0 resource
[INFO] Copying 3 resources
[INFO]
[INFO] --- maven-compiler-plugin:2.5.1:compile (default-compile) @ apacheds-core-constants ---
[INFO] Compiling 4 source files to F:\hudson\hudson-slave\workspace\dir-apacheds-jdk16-win\trunk\core-constants\target\classes
[debug] execute contextualize
[INFO] Using 'UTF-8' encoding to copy filtered resources.
[INFO]
[INFO] --- maven-resources-plugin:2.5:testResources (default-testResources) @ apacheds-core-constants ---
[INFO] skip non existing resourceDirectory F:\hudson\hudson-slave\workspace\dir-apacheds-jdk16-win\trunk\core-constants\src\test\resources
[INFO] Copying 3 resources
[INFO] No sources to compile
[INFO]
[INFO] --- maven-compiler-plugin:2.5.1:testCompile (default-testCompile) @ apacheds-core-constants ---
[INFO]
[INFO] --- maven-surefire-plugin:2.12.2:test (default-test) @ apacheds-core-constants ---
[JENKINS] Recording test results
[INFO]
[INFO] --- maven-bundle-plugin:2.3.7:bundle (default-bundle) @ apacheds-core-constants ---
[INFO]
[INFO] --- maven-site-plugin:3.1:attach-descriptor (attach-descriptor) @ apacheds-core-constants ---
[INFO] Checking legal files in: apacheds-core-constants-2.0.0-RC2-SNAPSHOT.jar
[INFO]
[INFO] --- tools-maven-plugin:1.4:verify-legal-files (verify-legal-files) @ apacheds-core-constants ---
[INFO] [INFO] Installing F:\hudson\hudson-slave\workspace\dir-apacheds-jdk16-win\trunk\core-constants\target\apacheds-core-constants-2.0.0-RC2-SNAPSHOT.jar to f:\hudson\hudson-slave\maven-repositories\0\org\apache\directory\server\apacheds-core-constants\2.0.0-RC2-SNAPSHOT\apacheds-core-constants-2.0.0-RC2-SNAPSHOT.jar
[INFO] --- maven-install-plugin:2.3.1:install (default-install) @ apacheds-core-constants ---
[INFO] Installing F:\hudson\hudson-slave\workspace\dir-apacheds-jdk16-win\trunk\core-constants\pom.xml to f:\hudson\hudson-slave\maven-repositories\0\org\apache\directory\server\apacheds-core-constants\2.0.0-RC2-SNAPSHOT\apacheds-core-constants-2.0.0-RC2-SNAPSHOT.pom
[INFO] [INFO] Installing org/apache/directory/server/apacheds-core-constants/2.0.0-RC2-SNAPSHOT/apacheds-core-constants-2.0.0-RC2-SNAPSHOT.jar
[INFO] Writing OBR metadata
[INFO] --- maven-bundle-plugin:2.3.7:install (default-install) @ apacheds-core-constants ---
[INFO]
[INFO] ------------------------------------------------------------------------
[INFO] Building ApacheDS Core API 2.0.0-RC2-SNAPSHOT
[INFO] ------------------------------------------------------------------------
Downloading: http://repo1.maven.org/maven2/org/apache/directory/api/api-i18n/1.0.0-RC1/api-i18n-1.0.0-RC1.pom
[WARNING] The POM for org.apache.directory.api:api-i18n:jar:1.0.0-RC1 is missing, no dependency information available
Downloading: http://repo1.maven.org/maven2/org/apache/directory/api/api-asn1-api/1.0.0-RC1/api-asn1-api-1.0.0-RC1.pom
[WARNING] The POM for org.apache.directory.api:api-asn1-api:jar:1.0.0-RC1 is missing, no dependency information available
Downloading: http://repo1.maven.org/maven2/org/apache/directory/api/api-ldap-client-api/1.0.0-RC1/api-ldap-client-api-1.0.0-RC1.pom
[WARNING] The POM for org.apache.directory.api:api-ldap-client-api:jar:1.0.0-RC1 is missing, no dependency information available
Downloading: http://repo1.maven.org/maven2/org/apache/directory/api/api-ldap-codec-core/1.0.0-RC1/api-ldap-codec-core-1.0.0-RC1.pom
[WARNING] The POM for org.apache.directory.api:api-ldap-codec-core:jar:1.0.0-RC1 is missing, no dependency information available
Downloading: http://repo1.maven.org/maven2/org/apache/directory/api/api-ldap-extras-aci/1.0.0-RC1/api-ldap-extras-aci-1.0.0-RC1.pom
[WARNING] The POM for org.apache.directory.api:api-ldap-extras-aci:jar:1.0.0-RC1 is missing, no dependency information available
Downloading: http://repo1.maven.org/maven2/org/apache/directory/api/api-ldap-extras-util/1.0.0-RC1/api-ldap-extras-util-1.0.0-RC1.pom
[WARNING] The POM for org.apache.directory.api:api-ldap-extras-util:jar:1.0.0-RC1 is missing, no dependency information available
Downloading: http://repo1.maven.org/maven2/org/apache/directory/api/api-ldap-model/1.0.0-RC1/api-ldap-model-1.0.0-RC1.pom
[WARNING] The POM for org.apache.directory.api:api-ldap-model:jar:1.0.0-RC1 is missing, no dependency information available
Downloading: http://repo1.maven.org/maven2/org/apache/directory/api/api-ldap-schema-data/1.0.0-RC1/api-ldap-schema-data-1.0.0-RC1.pom
[WARNING] The POM for org.apache.directory.api:api-ldap-schema-data:jar:1.0.0-RC1 is missing, no dependency information available
Downloading: http://repo1.maven.org/maven2/org/apache/directory/api/api-util/1.0.0-RC1/api-util-1.0.0-RC1.pom
[WARNING] The POM for org.apache.directory.api:api-util:jar:1.0.0-RC1 is missing, no dependency information available
Downloading: http://repo1.maven.org/maven2/org/apache/directory/api/api-i18n/1.0.0-RC1/api-i18n-1.0.0-RC1.jar
Downloading: http://repo1.maven.org/maven2/org/apache/directory/api/api-asn1-api/1.0.0-RC1/api-asn1-api-1.0.0-RC1.jar
Downloading: http://repo1.maven.org/maven2/org/apache/directory/api/api-ldap-client-api/1.0.0-RC1/api-ldap-client-api-1.0.0-RC1.jar
Downloading: http://repo1.maven.org/maven2/org/apache/directory/api/api-ldap-codec-core/1.0.0-RC1/api-ldap-codec-core-1.0.0-RC1.jar
Downloading: http://repo1.maven.org/maven2/org/apache/directory/api/api-ldap-extras-aci/1.0.0-RC1/api-ldap-extras-aci-1.0.0-RC1.jar
Downloading: http://repo1.maven.org/maven2/org/apache/directory/api/api-ldap-extras-util/1.0.0-RC1/api-ldap-extras-util-1.0.0-RC1.jar
Downloading: http://repo1.maven.org/maven2/org/apache/directory/api/api-ldap-model/1.0.0-RC1/api-ldap-model-1.0.0-RC1.jar
Downloading: http://repo1.maven.org/maven2/org/apache/directory/api/api-ldap-schema-data/1.0.0-RC1/api-ldap-schema-data-1.0.0-RC1.jar
Downloading: http://repo1.maven.org/maven2/org/apache/directory/api/api-util/1.0.0-RC1/api-util-1.0.0-RC1.jar
[INFO] ------------------------------------------------------------------------
[INFO] Reactor Summary:
[INFO]
[INFO] ApacheDS .......................................... SUCCESS [5.849s]
[INFO] ApacheDS I18n ..................................... SUCCESS [31.234s]
[INFO] ApacheDS Core Constants ........................... SUCCESS [4.629s]
[INFO] ApacheDS Core API ................................. FAILURE [2.416s]
[INFO] ApacheDS Core Shared .............................. SKIPPED
[INFO] ApacheDS Interceptors ............................. SKIPPED
[INFO] ApacheDS AdministrativePoint Interceptor .......... SKIPPED
[INFO] ApacheDS Authentication Interceptor ............... SKIPPED
[INFO] ApacheDS Authorization Interceptor ................ SKIPPED
[INFO] ApacheDS ChangeLog Interceptor .................... SKIPPED
[INFO] ApacheDS Collective Attribute Interceptor ......... SKIPPED
[INFO] ApacheDS Event Interceptor ........................ SKIPPED
[INFO] ApacheDS Exception Interceptor .................... SKIPPED
[INFO] ApacheDS Journal Interceptor ...................... SKIPPED
[INFO] ApacheDS Normalization Interceptor ................ SKIPPED
[INFO] ApacheDS Operational Attribute Interceptor ........ SKIPPED
[INFO] ApacheDS Referral Interceptor ..................... SKIPPED
[INFO] ApacheDS Schema Interceptor ....................... SKIPPED
[INFO] ApacheDS Subtree Interceptor ...................... SKIPPED
[INFO] ApacheDS Triggers Interceptor ..................... SKIPPED
[INFO] ApacheDS Core ..................................... SKIPPED
[INFO] ApacheDS Core AVL ................................. SKIPPED
[INFO] ApacheDS Generalized (X) DBM Partition ............ SKIPPED
[INFO] ApacheDS LDIF Partition ........................... SKIPPED
[INFO] ApacheDS JDBM Partition ........................... SKIPPED
[INFO] ApacheDS Core Annotations ......................... SKIPPED
[INFO] ApacheDS Core JNDI ................................ SKIPPED
[INFO] ApacheDS Protocol Kerberos Codec .................. SKIPPED
[INFO] ApacheDS Interceptors for Kerberos ................ SKIPPED
[INFO] ApacheDS Protocol Dhcp ............................ SKIPPED
[INFO] ApacheDS Protocol Shared .......................... SKIPPED
[INFO] ApacheDS Protocol Dns ............................. SKIPPED
[INFO] ApacheDS Protocol Kerberos ........................ SKIPPED
[INFO] ApacheDS Protocol Ldap ............................ SKIPPED
[INFO] ApacheDS Protocol Ntp ............................. SKIPPED
[INFO] Apacheds Server Annotations ....................... SKIPPED
[INFO] ApacheDS Server Config ............................ SKIPPED
[INFO] ApacheDS Server JNDI .............................. SKIPPED
[INFO] ApacheDS Test Framework ........................... SKIPPED
[INFO] ApacheDS All ...................................... SKIPPED
[INFO] ApacheDS Logger Interceptor ....................... SKIPPED
[INFO] ApacheDS Password Hashing Interceptor ............. SKIPPED
[INFO] ApacheDS Core Integration ......................... SKIPPED
[INFO] ApacheDS Server Integration ....................... SKIPPED
[INFO] ApacheDS DirectoryService-WebApp bridge ........... SKIPPED
[INFO] ApacheDS Jetty HTTP Server Integration ............ SKIPPED
[INFO] ApacheDS Service Builder .......................... SKIPPED
[INFO] ApacheDS Protocol Kerberos Test ................... SKIPPED
[INFO] Apache Directory LDAP Client API test ............. SKIPPED
[INFO] kerberos-client ................................... SKIPPED
[INFO] ApacheDS Service .................................. SKIPPED
[INFO] ApacheDS Wrapper .................................. SKIPPED
[INFO] ApacheDS Installers Maven Plugin .................. SKIPPED
[INFO] ApacheDS Installers ............................... SKIPPED
[INFO] ------------------------------------------------------------------------
[INFO] BUILD FAILURE
[INFO] ------------------------------------------------------------------------
[INFO] Total time: 47.222s
[INFO] Finished at: Wed Apr 10 05:09:08 BST 2013
[INFO] Final Memory: 37M/231M
[INFO] ------------------------------------------------------------------------
[JENKINS] Archiving disabled
[JENKINS] Archiving disabled
[JENKINS] Archiving disabled
[JENKINS] Archiving disabled
[JENKINS] Archiving disabled
[JENKINS] Archiving disabled
[JENKINS] Archiving disabled
[JENKINS] Archiving disabled
[JENKINS] Archiving disabled
[JENKINS] Archiving disabled
[JENKINS] Archiving disabled
[JENKINS] Archiving disabled
[JENKINS] Archiving disabled
[JENKINS] Archiving disabled
[JENKINS] Archiving disabled
[JENKINS] Archiving disabled
[JENKINS] Archiving disabled
[JENKINS] Archiving disabled
[JENKINS] Archiving disabled
[JENKINS] Archiving disabled
[JENKINS] Archiving disabled
[JENKINS] Archiving disabled
[JENKINS] Archiving disabled
[JENKINS] Archiving disabled
[JENKINS] Archiving disabled
[JENKINS] Archiving disabled
[JENKINS] Archiving disabled
[JENKINS] Archiving disabled
[JENKINS] Archiving disabled
[JENKINS] Archiving disabled
[JENKINS] Archiving disabled
[JENKINS] Archiving disabled
[JENKINS] Archiving disabled
[JENKINS] Archiving disabled
[JENKINS] Archiving disabled
[JENKINS] Archiving disabled
[JENKINS] Archiving disabled
[JENKINS] Archiving disabled
[JENKINS] Archiving disabled
[JENKINS] Archiving disabled
[JENKINS] Archiving disabled
[JENKINS] Archiving disabled
[JENKINS] Archiving disabled
[JENKINS] Archiving disabled
[JENKINS] Archiving disabled
[JENKINS] Archiving disabled
[JENKINS] Archiving disabled
[JENKINS] Archiving disabled
[JENKINS] Archiving disabled
[JENKINS] Archiving disabled
[JENKINS] Archiving disabled
[JENKINS] Archiving disabled
[JENKINS] Archiving disabled
[JENKINS] Archiving disabled
Waiting for Jenkins to finish collecting data
mavenExecutionResult exceptions not empty
message : Failed to execute goal on project apacheds-core-api: Could not resolve dependencies for project org.apache.directory.server:apacheds-core-api:bundle:2.0.0-RC2-SNAPSHOT: The following artifacts could not be resolved: org.apache.directory.api:api-i18n:jar:1.0.0-RC1, org.apache.directory.api:api-asn1-api:jar:1.0.0-RC1, org.apache.directory.api:api-ldap-client-api:jar:1.0.0-RC1, org.apache.directory.api:api-ldap-codec-core:jar:1.0.0-RC1, org.apache.directory.api:api-ldap-extras-aci:jar:1.0.0-RC1, org.apache.directory.api:api-ldap-extras-util:jar:1.0.0-RC1, org.apache.directory.api:api-ldap-model:jar:1.0.0-RC1, org.apache.directory.api:api-ldap-schema-data:jar:1.0.0-RC1, org.apache.directory.api:api-util:jar:1.0.0-RC1: Could not find artifact org.apache.directory.api:api-i18n:jar:1.0.0-RC1 in central (http://repo1.maven.org/maven2)
cause : Could not resolve dependencies for project org.apache.directory.server:apacheds-core-api:bundle:2.0.0-RC2-SNAPSHOT: The following artifacts could not be resolved: org.apache.directory.api:api-i18n:jar:1.0.0-RC1, org.apache.directory.api:api-asn1-api:jar:1.0.0-RC1, org.apache.directory.api:api-ldap-client-api:jar:1.0.0-RC1, org.apache.directory.api:api-ldap-codec-core:jar:1.0.0-RC1, org.apache.directory.api:api-ldap-extras-aci:jar:1.0.0-RC1, org.apache.directory.api:api-ldap-extras-util:jar:1.0.0-RC1, org.apache.directory.api:api-ldap-model:jar:1.0.0-RC1, org.apache.directory.api:api-ldap-schema-data:jar:1.0.0-RC1, org.apache.directory.api:api-util:jar:1.0.0-RC1: Could not find artifact org.apache.directory.api:api-i18n:jar:1.0.0-RC1 in central (http://repo1.maven.org/maven2)
Stack trace :
org.apache.maven.lifecycle.LifecycleExecutionException: Failed to execute goal on project apacheds-core-api: Could not resolve dependencies for project org.apache.directory.server:apacheds-core-api:bundle:2.0.0-RC2-SNAPSHOT: The following artifacts could not be resolved: org.apache.directory.api:api-i18n:jar:1.0.0-RC1, org.apache.directory.api:api-asn1-api:jar:1.0.0-RC1, org.apache.directory.api:api-ldap-client-api:jar:1.0.0-RC1, org.apache.directory.api:api-ldap-codec-core:jar:1.0.0-RC1, org.apache.directory.api:api-ldap-extras-aci:jar:1.0.0-RC1, org.apache.directory.api:api-ldap-extras-util:jar:1.0.0-RC1, org.apache.directory.api:api-ldap-model:jar:1.0.0-RC1, org.apache.directory.api:api-ldap-schema-data:jar:1.0.0-RC1, org.apache.directory.api:api-util:jar:1.0.0-RC1: Could not find artifact org.apache.directory.api:api-i18n:jar:1.0.0-RC1 in central (http://repo1.maven.org/maven2)
at org.apache.maven.lifecycle.internal.LifecycleDependencyResolver.getDependencies(LifecycleDependencyResolver.java:190)
at org.apache.maven.lifecycle.internal.LifecycleDependencyResolver.resolveProjectDependencies(LifecycleDependencyResolver.java:104)
at org.apache.maven.lifecycle.internal.MojoExecutor.ensureDependenciesAreResolved(MojoExecutor.java:258)
at org.apache.maven.lifecycle.internal.MojoExecutor.execute(MojoExecutor.java:201)
at org.apache.maven.lifecycle.internal.MojoExecutor.execute(MojoExecutor.java:153)
at org.apache.maven.lifecycle.internal.MojoExecutor.execute(MojoExecutor.java:145)
at org.apache.maven.lifecycle.internal.LifecycleModuleBuilder.buildProject(LifecycleModuleBuilder.java:84)
at org.apache.maven.lifecycle.internal.LifecycleModuleBuilder.buildProject(LifecycleModuleBuilder.java:59)
at org.apache.maven.lifecycle.internal.LifecycleStarter.singleThreadedBuild(LifecycleStarter.java:183)
at org.apache.maven.lifecycle.internal.LifecycleStarter.execute(LifecycleStarter.java:161)
at org.apache.maven.DefaultMaven.doExecute(DefaultMaven.java:319)
at org.apache.maven.DefaultMaven.execute(DefaultMaven.java:156)
at org.jvnet.hudson.maven3.launcher.Maven3Launcher.main(Maven3Launcher.java:79)
at sun.reflect.NativeMethodAccessorImpl.invoke0(Native Method)
at sun.reflect.NativeMethodAccessorImpl.invoke(NativeMethodAccessorImpl.java:39)
at sun.reflect.DelegatingMethodAccessorImpl.invoke(DelegatingMethodAccessorImpl.java:25)
at java.lang.reflect.Method.invoke(Method.java:597)
at org.codehaus.plexus.classworlds.launcher.Launcher.launchStandard(Launcher.java:329)
at org.codehaus.plexus.classworlds.launcher.Launcher.launch(Launcher.java:239)
at org.jvnet.hudson.maven3.agent.Maven3Main.launch(Maven3Main.java:158)
at hudson.maven.Maven3Builder.call(Maven3Builder.java:100)
at hudson.maven.Maven3Builder.call(Maven3Builder.java:66)
at hudson.remoting.UserRequest.perform(UserRequest.java:118)
at hudson.remoting.UserRequest.perform(UserRequest.java:48)
at hudson.remoting.Request$2.run(Request.java:326)
at hudson.remoting.InterceptingExecutorService$1.call(InterceptingExecutorService.java:72)
at java.util.concurrent.FutureTask$Sync.innerRun(FutureTask.java:303)
at java.util.concurrent.FutureTask.run(FutureTask.java:138)
at java.util.concurrent.ThreadPoolExecutor$Worker.runTask(ThreadPoolExecutor.java:886)
at java.util.concurrent.ThreadPoolExecutor$Worker.run(ThreadPoolExecutor.java:908)
at java.lang.Thread.run(Thread.java:662)
Caused by: org.apache.maven.project.DependencyResolutionException: Could not resolve dependencies for project org.apache.directory.server:apacheds-core-api:bundle:2.0.0-RC2-SNAPSHOT: The following artifacts could not be resolved: org.apache.directory.api:api-i18n:jar:1.0.0-RC1, org.apache.directory.api:api-asn1-api:jar:1.0.0-RC1, org.apache.directory.api:api-ldap-client-api:jar:1.0.0-RC1, org.apache.directory.api:api-ldap-codec-core:jar:1.0.0-RC1, org.apache.directory.api:api-ldap-extras-aci:jar:1.0.0-RC1, org.apache.directory.api:api-ldap-extras-util:jar:1.0.0-RC1, org.apache.directory.api:api-ldap-model:jar:1.0.0-RC1, org.apache.directory.api:api-ldap-schema-data:jar:1.0.0-RC1, org.apache.directory.api:api-util:jar:1.0.0-RC1: Could not find artifact org.apache.directory.api:api-i18n:jar:1.0.0-RC1 in central (http://repo1.maven.org/maven2)
at org.apache.maven.project.DefaultProjectDependenciesResolver.resolve(DefaultProjectDependenciesResolver.java:156)
at org.apache.maven.lifecycle.internal.LifecycleDependencyResolver.getDependencies(LifecycleDependencyResolver.java:165)
... 30 more
Caused by: org.sonatype.aether.resolution.ArtifactResolutionException: The following artifacts could not be resolved: org.apache.directory.api:api-i18n:jar:1.0.0-RC1, org.apache.directory.api:api-asn1-api:jar:1.0.0-RC1, org.apache.directory.api:api-ldap-client-api:jar:1.0.0-RC1, org.apache.directory.api:api-ldap-codec-core:jar:1.0.0-RC1, org.apache.directory.api:api-ldap-extras-aci:jar:1.0.0-RC1, org.apache.directory.api:api-ldap-extras-util:jar:1.0.0-RC1, org.apache.directory.api:api-ldap-model:jar:1.0.0-RC1, org.apache.directory.api:api-ldap-schema-data:jar:1.0.0-RC1, org.apache.directory.api:api-util:jar:1.0.0-RC1: Could not find artifact org.apache.directory.api:api-i18n:jar:1.0.0-RC1 in central (http://repo1.maven.org/maven2)
at org.sonatype.aether.impl.internal.DefaultArtifactResolver.resolveArtifacts(DefaultArtifactResolver.java:526)
at org.sonatype.aether.impl.internal.DefaultRepositorySystem.resolveArtifacts(DefaultRepositorySystem.java:304)
at org.sonatype.aether.impl.internal.DefaultRepositorySystem.resolveDependencies(DefaultRepositorySystem.java:334)
at org.apache.maven.project.DefaultProjectDependenciesResolver.resolve(DefaultProjectDependenciesResolver.java:150)
... 31 more
Caused by: org.sonatype.aether.transfer.ArtifactNotFoundException: Could not find artifact org.apache.directory.api:api-i18n:jar:1.0.0-RC1 in central (http://repo1.maven.org/maven2)
at org.sonatype.aether.connector.wagon.WagonRepositoryConnector$4.wrap(WagonRepositoryConnector.java:945)
at org.sonatype.aether.connector.wagon.WagonRepositoryConnector$4.wrap(WagonRepositoryConnector.java:940)
at org.sonatype.aether.connector.wagon.WagonRepositoryConnector$GetTask.flush(WagonRepositoryConnector.java:696)
at org.sonatype.aether.connector.wagon.WagonRepositoryConnector$GetTask.flush(WagonRepositoryConnector.java:690)
at org.sonatype.aether.connector.wagon.WagonRepositoryConnector.get(WagonRepositoryConnector.java:435)
at org.sonatype.aether.impl.internal.DefaultArtifactResolver.resolveArtifacts(DefaultArtifactResolver.java:438)
... 34 more
Sending e-mails to: notifications@directory.apache.org
channel stopped
Build failed in Jenkins: dir-apacheds-jdk16-win #374
Posted by Apache Jenkins Server <je...@builds.apache.org>.
See <https://builds.apache.org/job/dir-apacheds-jdk16-win/374/>
------------------------------------------
[...truncated 3725 lines...]
[INFO] Installing F:\hudson\hudson-slave\workspace\dir-apacheds-jdk16-win\trunk\kerberos-client\pom.xml to f:\hudson\hudson-slave\maven-repositories\0\org\apache\directory\server\kerberos-client\2.0.0-M12-SNAPSHOT\kerberos-client-2.0.0-M12-SNAPSHOT.pom
[INFO]
[INFO] ------------------------------------------------------------------------
[INFO] Building ApacheDS Service 2.0.0-M12-SNAPSHOT
[INFO] ------------------------------------------------------------------------
[INFO] Deleting F:\hudson\hudson-slave\workspace\dir-apacheds-jdk16-win\trunk\service\target
[INFO]
[INFO] --- maven-clean-plugin:2.4.1:clean (default-clean) @ apacheds-service ---
[INFO]
[INFO] --- maven-remote-resources-plugin:1.2.1:process (default) @ apacheds-service ---
[debug] execute contextualize
[INFO] [INFO] Using 'UTF-8' encoding to copy filtered resources.
[INFO] skip non existing resourceDirectory F:\hudson\hudson-slave\workspace\dir-apacheds-jdk16-win\trunk\service\src\main\resources
[INFO] Copying 3 resources
[INFO] --- maven-resources-plugin:2.5:resources (default-resources) @ apacheds-service ---
[INFO]
[INFO] --- maven-compiler-plugin:2.5.1:compile (default-compile) @ apacheds-service ---
[INFO] Compiling 3 source files to F:\hudson\hudson-slave\workspace\dir-apacheds-jdk16-win\trunk\service\target\classes
[INFO] [debug] execute contextualize
[INFO] Using 'UTF-8' encoding to copy filtered resources.
[INFO] --- maven-resources-plugin:2.5:testResources (default-testResources) @ apacheds-service ---
[INFO] Copying 3 resources
[INFO] Copying 3 resources
[INFO]
[INFO] --- maven-compiler-plugin:2.5.1:testCompile (default-testCompile) @ apacheds-service ---
[INFO] Compiling 1 source file to F:\hudson\hudson-slave\workspace\dir-apacheds-jdk16-win\trunk\service\target\test-classes
[INFO]
[INFO] --- maven-surefire-plugin:2.12.2:test (default-test) @ apacheds-service ---
[INFO] Surefire report directory: F:\hudson\hudson-slave\workspace\dir-apacheds-jdk16-win\trunk\service\target\surefire-reports
-------------------------------------------------------
T E S T S
-------------------------------------------------------
Running org.apache.directory.server.UberJarMainTest
org.apache.directory.server.config.ConfigurationException: Cannot find the class org.apache.directory.server.ldap.handlers.bind.digestMD5.DigestMd5MechanismHandler
at org.apache.directory.server.config.builder.ServiceBuilder.createSaslMechHandler(ServiceBuilder.java:419)
at org.apache.directory.server.config.builder.ServiceBuilder.createLdapServer(ServiceBuilder.java:982)
at org.apache.directory.server.ApacheDsService.startLdap(ApacheDsService.java:380)
at org.apache.directory.server.ApacheDsService.start(ApacheDsService.java:182)
at org.apache.directory.server.UberjarMain.start(UberjarMain.java:76)
at org.apache.directory.server.UberJarMainTest.serviceInstanceTest(UberJarMainTest.java:98)
at sun.reflect.NativeMethodAccessorImpl.invoke0(Native Method)
at sun.reflect.NativeMethodAccessorImpl.invoke(NativeMethodAccessorImpl.java:39)
at sun.reflect.DelegatingMethodAccessorImpl.invoke(DelegatingMethodAccessorImpl.java:25)
at java.lang.reflect.Method.invoke(Method.java:597)
at org.junit.runners.model.FrameworkMethod$1.runReflectiveCall(FrameworkMethod.java:47)
at org.junit.internal.runners.model.ReflectiveCallable.run(ReflectiveCallable.java:12)
at org.junit.runners.model.FrameworkMethod.invokeExplosively(FrameworkMethod.java:44)
at org.junit.internal.runners.statements.InvokeMethod.evaluate(InvokeMethod.java:17)
at org.junit.internal.runners.statements.RunBefores.evaluate(RunBefores.java:26)
at org.junit.internal.runners.statements.RunAfters.evaluate(RunAfters.java:27)
at org.junit.runners.ParentRunner.runLeaf(ParentRunner.java:271)
at org.junit.runners.BlockJUnit4ClassRunner.runChild(BlockJUnit4ClassRunner.java:70)
at org.junit.runners.BlockJUnit4ClassRunner.runChild(BlockJUnit4ClassRunner.java:50)
at org.junit.runners.ParentRunner$3.run(ParentRunner.java:238)
at org.junit.runners.ParentRunner$1.schedule(ParentRunner.java:63)
at org.junit.runners.ParentRunner.runChildren(ParentRunner.java:236)
at org.junit.runners.ParentRunner.access$000(ParentRunner.java:53)
at org.junit.runners.ParentRunner$2.evaluate(ParentRunner.java:229)
at org.junit.runners.ParentRunner.run(ParentRunner.java:309)
at org.apache.maven.surefire.junit4.JUnit4Provider.execute(JUnit4Provider.java:252)
at org.apache.maven.surefire.junit4.JUnit4Provider.executeTestSet(JUnit4Provider.java:141)
at org.apache.maven.surefire.junit4.JUnit4Provider.invoke(JUnit4Provider.java:112)
at sun.reflect.NativeMethodAccessorImpl.invoke0(Native Method)
at sun.reflect.NativeMethodAccessorImpl.invoke(NativeMethodAccessorImpl.java:39)
at sun.reflect.DelegatingMethodAccessorImpl.invoke(DelegatingMethodAccessorImpl.java:25)
at java.lang.reflect.Method.invoke(Method.java:597)
at org.apache.maven.surefire.util.ReflectionUtils.invokeMethodWithArray(ReflectionUtils.java:189)
at org.apache.maven.surefire.booter.ProviderFactory$ProviderProxy.invoke(ProviderFactory.java:165)
at org.apache.maven.surefire.booter.ProviderFactory.invokeProvider(ProviderFactory.java:85)
at org.apache.maven.surefire.booter.ForkedBooter.runSuitesInProcess(ForkedBooter.java:113)
at org.apache.maven.surefire.booter.ForkedBooter.main(ForkedBooter.java:75)
Results :
Tests run: 0, Failures: 0, Errors: 0, Skipped: 0
[JENKINS] Recording test results
[INFO] ------------------------------------------------------------------------
[INFO] Reactor Summary:
[INFO]
[INFO] ApacheDS .......................................... SUCCESS [5.061s]
[INFO] ApacheDS I18n ..................................... SUCCESS [4.955s]
[INFO] ApacheDS Core Constants ........................... SUCCESS [2.137s]
[INFO] ApacheDS Core API ................................. SUCCESS [24.819s]
[INFO] ApacheDS Core Shared .............................. SUCCESS [3.654s]
[INFO] ApacheDS Interceptors ............................. SUCCESS [0.121s]
[INFO] ApacheDS AdministrativePoint Interceptor .......... SUCCESS [2.679s]
[INFO] ApacheDS Authentication Interceptor ............... SUCCESS [5.251s]
[INFO] ApacheDS Authorization Interceptor ................ SUCCESS [10.549s]
[INFO] ApacheDS ChangeLog Interceptor .................... SUCCESS [4.721s]
[INFO] ApacheDS Collective Attribute Interceptor ......... SUCCESS [1.610s]
[INFO] ApacheDS Event Interceptor ........................ SUCCESS [1.677s]
[INFO] ApacheDS Exception Interceptor .................... SUCCESS [1.283s]
[INFO] ApacheDS Journal Interceptor ...................... SUCCESS [1.454s]
[INFO] ApacheDS Normalization Interceptor ................ SUCCESS [3.521s]
[INFO] ApacheDS Operational Attribute Interceptor ........ SUCCESS [1.494s]
[INFO] ApacheDS Referral Interceptor ..................... SUCCESS [1.388s]
[INFO] ApacheDS Schema Interceptor ....................... SUCCESS [7.685s]
[INFO] ApacheDS Subtree Interceptor ...................... SUCCESS [14.251s]
[INFO] ApacheDS Triggers Interceptor ..................... SUCCESS [2.859s]
[INFO] ApacheDS Core ..................................... SUCCESS [6.947s]
[INFO] ApacheDS Core AVL ................................. SUCCESS [11.928s]
[INFO] ApacheDS Generalized (X) DBM Partition ............ SUCCESS [34.472s]
[INFO] ApacheDS LDIF Partition ........................... SUCCESS [18.578s]
[INFO] ApacheDS JDBM Partition ........................... SUCCESS [39.537s]
[INFO] ApacheDS Core Annotations ......................... SUCCESS [53.322s]
[INFO] ApacheDS Core JNDI ................................ SUCCESS [4.165s]
[INFO] ApacheDS Protocol Kerberos Codec .................. SUCCESS [23.750s]
[INFO] ApacheDS Interceptors for Kerberos ................ SUCCESS [2.060s]
[INFO] ApacheDS Protocol Dhcp ............................ SUCCESS [3.985s]
[INFO] ApacheDS Protocol Shared .......................... SUCCESS [2.103s]
[INFO] ApacheDS Protocol Dns ............................. SUCCESS [11.034s]
[INFO] ApacheDS Protocol Kerberos ........................ SUCCESS [5.137s]
[INFO] ApacheDS Protocol Ldap ............................ SUCCESS [1:06.401s]
[INFO] ApacheDS Protocol Ntp ............................. SUCCESS [15.730s]
[INFO] Apacheds Server Annotations ....................... SUCCESS [1:02.335s]
[INFO] ApacheDS Server Config ............................ SUCCESS [35.338s]
[INFO] ApacheDS Server JNDI .............................. SUCCESS [6.612s]
[INFO] ApacheDS Test Framework ........................... SUCCESS [1:44.561s]
[INFO] ApacheDS All ...................................... SUCCESS [5.706s]
[INFO] ApacheDS Logger Interceptor ....................... SUCCESS [3.697s]
[INFO] ApacheDS Password Hashing Interceptor ............. SUCCESS [2.085s]
[INFO] ApacheDS Core Integration ......................... SUCCESS [29:22.354s]
[INFO] ApacheDS Server Integration ....................... SUCCESS [26:38.225s]
[INFO] ApacheDS DirectoryService-WebApp bridge ........... SUCCESS [1.821s]
[INFO] ApacheDS Jetty HTTP Server Integration ............ SUCCESS [2.047s]
[INFO] ApacheDS Service Builder .......................... SUCCESS [3.300s]
[INFO] ApacheDS Protocol Kerberos Test ................... SUCCESS [43.381s]
[INFO] Apache Directory LDAP Client API test ............. SUCCESS [3:59.211s]
[INFO] kerberos-client ................................... SUCCESS [15.315s]
[INFO] ApacheDS Service .................................. FAILURE [15.271s]
[INFO] ApacheDS Wrapper .................................. SKIPPED
[INFO] ApacheDS Installers Maven Plugin .................. SKIPPED
[INFO] ApacheDS Installers ............................... SKIPPED
[INFO] ------------------------------------------------------------------------
[INFO] BUILD FAILURE
[INFO] ------------------------------------------------------------------------
[INFO] Total time: 1:11:47.867s
[INFO] Finished at: Tue Apr 09 06:14:54 BST 2013
[INFO] Final Memory: 57M/301M
[INFO] ------------------------------------------------------------------------
[JENKINS] Archiving disabled
[JENKINS] Archiving disabled
[JENKINS] Archiving disabled
[JENKINS] Archiving disabled
[JENKINS] Archiving disabled
[JENKINS] Archiving disabled
[JENKINS] Archiving disabled
[JENKINS] Archiving disabled
[JENKINS] Archiving disabled
[JENKINS] Archiving disabled
[JENKINS] Archiving disabled
[JENKINS] Archiving disabled
[JENKINS] Archiving disabled
[JENKINS] Archiving disabled
[JENKINS] Archiving disabled
[JENKINS] Archiving disabled
[JENKINS] Archiving disabled
[JENKINS] Archiving disabled
[JENKINS] Archiving disabled
[JENKINS] Archiving disabled
[JENKINS] Archiving disabled
[JENKINS] Archiving disabled
[JENKINS] Archiving disabled
[JENKINS] Archiving disabled
[JENKINS] Archiving disabled
[JENKINS] Archiving disabled
[JENKINS] Archiving disabled
[JENKINS] Archiving disabled
[JENKINS] Archiving disabled
[JENKINS] Archiving disabled
[JENKINS] Archiving disabled
[JENKINS] Archiving disabled
[JENKINS] Archiving disabled
[JENKINS] Archiving disabled
[JENKINS] Archiving disabled
[JENKINS] Archiving disabled
[JENKINS] Archiving disabled
[JENKINS] Archiving disabled
[JENKINS] Archiving disabled
[JENKINS] Archiving disabled
[JENKINS] Archiving disabled
[JENKINS] Archiving disabled
[JENKINS] Archiving disabled
[JENKINS] Archiving disabled
[JENKINS] Archiving disabled
[JENKINS] Archiving disabled
[JENKINS] Archiving disabled
[JENKINS] Archiving disabled
[JENKINS] Archiving disabled
[JENKINS] Archiving disabled
[JENKINS] Archiving disabled
[JENKINS] Archiving disabled
[JENKINS] Archiving disabled
[JENKINS] Archiving disabled
Waiting for Jenkins to finish collecting data
mavenExecutionResult exceptions not empty
message : Failed to execute goal org.apache.maven.plugins:maven-surefire-plugin:2.12.2:test (default-test) on project apacheds-service: Execution default-test of goal org.apache.maven.plugins:maven-surefire-plugin:2.12.2:test failed: The forked VM terminated without saying properly goodbye. VM crash or System.exit called ?
cause : Execution default-test of goal org.apache.maven.plugins:maven-surefire-plugin:2.12.2:test failed: The forked VM terminated without saying properly goodbye. VM crash or System.exit called ?
Stack trace :
org.apache.maven.lifecycle.LifecycleExecutionException: Failed to execute goal org.apache.maven.plugins:maven-surefire-plugin:2.12.2:test (default-test) on project apacheds-service: Execution default-test of goal org.apache.maven.plugins:maven-surefire-plugin:2.12.2:test failed: The forked VM terminated without saying properly goodbye. VM crash or System.exit called ?
at org.apache.maven.lifecycle.internal.MojoExecutor.execute(MojoExecutor.java:225)
at org.apache.maven.lifecycle.internal.MojoExecutor.execute(MojoExecutor.java:153)
at org.apache.maven.lifecycle.internal.MojoExecutor.execute(MojoExecutor.java:145)
at org.apache.maven.lifecycle.internal.LifecycleModuleBuilder.buildProject(LifecycleModuleBuilder.java:84)
at org.apache.maven.lifecycle.internal.LifecycleModuleBuilder.buildProject(LifecycleModuleBuilder.java:59)
at org.apache.maven.lifecycle.internal.LifecycleStarter.singleThreadedBuild(LifecycleStarter.java:183)
at org.apache.maven.lifecycle.internal.LifecycleStarter.execute(LifecycleStarter.java:161)
at org.apache.maven.DefaultMaven.doExecute(DefaultMaven.java:319)
at org.apache.maven.DefaultMaven.execute(DefaultMaven.java:156)
at org.jvnet.hudson.maven3.launcher.Maven3Launcher.main(Maven3Launcher.java:79)
at sun.reflect.NativeMethodAccessorImpl.invoke0(Native Method)
at sun.reflect.NativeMethodAccessorImpl.invoke(NativeMethodAccessorImpl.java:39)
at sun.reflect.DelegatingMethodAccessorImpl.invoke(DelegatingMethodAccessorImpl.java:25)
at java.lang.reflect.Method.invoke(Method.java:597)
at org.codehaus.plexus.classworlds.launcher.Launcher.launchStandard(Launcher.java:329)
at org.codehaus.plexus.classworlds.launcher.Launcher.launch(Launcher.java:239)
at org.jvnet.hudson.maven3.agent.Maven3Main.launch(Maven3Main.java:158)
at hudson.maven.Maven3Builder.call(Maven3Builder.java:100)
at hudson.maven.Maven3Builder.call(Maven3Builder.java:66)
at hudson.remoting.UserRequest.perform(UserRequest.java:118)
at hudson.remoting.UserRequest.perform(UserRequest.java:48)
at hudson.remoting.Request$2.run(Request.java:326)
at hudson.remoting.InterceptingExecutorService$1.call(InterceptingExecutorService.java:72)
at java.util.concurrent.FutureTask$Sync.innerRun(FutureTask.java:303)
at java.util.concurrent.FutureTask.run(FutureTask.java:138)
at java.util.concurrent.ThreadPoolExecutor$Worker.runTask(ThreadPoolExecutor.java:886)
at java.util.concurrent.ThreadPoolExecutor$Worker.run(ThreadPoolExecutor.java:908)
at java.lang.Thread.run(Thread.java:662)
Caused by: org.apache.maven.plugin.PluginExecutionException: Execution default-test of goal org.apache.maven.plugins:maven-surefire-plugin:2.12.2:test failed: The forked VM terminated without saying properly goodbye. VM crash or System.exit called ?
at org.apache.maven.plugin.DefaultBuildPluginManager.executeMojo(DefaultBuildPluginManager.java:116)
at org.apache.maven.lifecycle.internal.MojoExecutor.execute(MojoExecutor.java:209)
... 27 more
Caused by: java.lang.RuntimeException: The forked VM terminated without saying properly goodbye. VM crash or System.exit called ?
at org.apache.maven.plugin.surefire.booterclient.output.ForkClient.close(ForkClient.java:245)
at org.apache.maven.plugin.surefire.booterclient.ForkStarter.fork(ForkStarter.java:282)
at org.apache.maven.plugin.surefire.booterclient.ForkStarter.run(ForkStarter.java:116)
at org.apache.maven.plugin.surefire.AbstractSurefireMojo.executeProvider(AbstractSurefireMojo.java:695)
at org.apache.maven.plugin.surefire.AbstractSurefireMojo.executeAllProviders(AbstractSurefireMojo.java:666)
at org.apache.maven.plugin.surefire.AbstractSurefireMojo.executeAfterPreconditionsChecked(AbstractSurefireMojo.java:624)
at org.apache.maven.plugin.surefire.AbstractSurefireMojo.execute(AbstractSurefireMojo.java:587)
at org.apache.maven.plugin.DefaultBuildPluginManager.executeMojo(DefaultBuildPluginManager.java:107)
... 28 more
Sending e-mails to: notifications@directory.apache.org
Sending e-mails to: notifications@directory.apache.org
channel stopped