You are viewing a plain text version of this content. The canonical link for it is here.
Posted to builds@beam.apache.org by Apache Jenkins Server <je...@builds.apache.org> on 2022/12/02 18:31:24 UTC
Build failed in Jenkins: beam_PreCommit_Java_Kafka_IO_Direct_Cron #679
See <https://ci-beam.apache.org/job/beam_PreCommit_Java_Kafka_IO_Direct_Cron/679/display/redirect?page=changes>
Changes:
[Xinyu Liu] Disable flaky async tests in samza runner
[noreply] Bump cloud.google.com/go/spanner from 1.40.0 to 1.41.0 in /sdks (#24483)
[noreply] Revert "Support SqlTypes Date and Timestamp (MicrosInstant) in AvroUtils
[noreply] Bump actions/setup-java from 3.6.0 to 3.7.0 (#24484)
[noreply] Add GPU benchmark to RunInference Grafana dashboard (#24485)
[Yi Hu] Add back javadoc
[noreply] [CdapIO] Update read timeout for SparkReceiverIOIT job (#24428)
[noreply] Bump cloud.google.com/go/datastore from 1.9.0 to 1.10.0 in /sdks
[noreply] Reduce version matrix of build wheel on pull request event (#24448)
[noreply] [Spark dataset runner] Make sure PCollection views get only broadcasted
[noreply] Fix for #22951 w/ GroupIntoBatchesOverride fix (#24463)
------------------------------------------
[...truncated 8.61 KB...]
> Task :sdks:java:core:generateAvroProtocol NO-SOURCE
> Task :runners:core-java:processResources NO-SOURCE
> Task :runners:core-construction-java:processResources NO-SOURCE
> Task :runners:core-java:processTestResources NO-SOURCE
> Task :runners:direct-java:processResources NO-SOURCE
> Task :sdks:java:core:generateAvroJava NO-SOURCE
> Task :runners:direct-java:processTestResources NO-SOURCE
> Task :model:fn-execution:extractProto
> Task :model:job-management:extractProto
> Task :runners:java-fn-execution:createCheckerFrameworkManifest
> Task :runners:local-java:createCheckerFrameworkManifest
> Task :sdks:java:harness:createCheckerFrameworkManifest
> Task :sdks:java:expansion-service:createCheckerFrameworkManifest
> Task :runners:local-java:processResources NO-SOURCE
> Task :sdks:java:harness:processResources NO-SOURCE
> Task :sdks:java:expansion-service:processResources NO-SOURCE
> Task :runners:java-fn-execution:processResources NO-SOURCE
> Task :sdks:java:io:common:createCheckerFrameworkManifest
> Task :sdks:java:io:kafka:createCheckerFrameworkManifest
> Task :sdks:java:io:common:compileJava NO-SOURCE
> Task :sdks:java:io:kafka:processResources NO-SOURCE
> Task :model:job-management:processResources
> Task :sdks:java:core:generateGrammarSource FROM-CACHE
> Task :sdks:java:io:kafka:processTestResources NO-SOURCE
> Task :sdks:java:io:common:processResources NO-SOURCE
> Task :sdks:java:io:common:classes UP-TO-DATE
> Task :sdks:java:testing:test-utils:createCheckerFrameworkManifest
> Task :sdks:java:testing:test-utils:processResources NO-SOURCE
> Task :model:fn-execution:processResources
> Task :sdks:java:testing:test-utils:processTestResources NO-SOURCE
> Task :sdks:java:io:synthetic:createCheckerFrameworkManifest
> Task :sdks:java:io:common:jar
> Task :sdks:java:io:synthetic:processResources NO-SOURCE
> Task :sdks:java:io:common:processTestResources NO-SOURCE
> Task :sdks:java:core:processResources
> Task :sdks:java:core:generateTestAvroProtocol NO-SOURCE
> Task :sdks:java:core:generateTestAvroJava
> Task :sdks:java:core:generateTestGrammarSource NO-SOURCE
> Task :sdks:java:core:processTestResources
> Task :model:pipeline:extractIncludeProto
> Task :model:pipeline:extractProto
> Task :model:pipeline:generateProto FROM-CACHE
> Task :model:pipeline:compileJava FROM-CACHE
> Task :model:pipeline:processResources
> Task :model:pipeline:classes
> Task :model:pipeline:jar
> Task :model:pipeline:shadowJar FROM-CACHE
> Task :model:job-management:extractIncludeProto
> Task :model:job-management:generateProto FROM-CACHE
> Task :model:fn-execution:extractIncludeProto
> Task :model:fn-execution:generateProto FROM-CACHE
> Task :model:fn-execution:compileJava FROM-CACHE
> Task :model:fn-execution:classes
> Task :model:job-management:compileJava FROM-CACHE
> Task :model:job-management:classes
> Task :model:job-management:shadowJar FROM-CACHE
> Task :model:fn-execution:shadowJar FROM-CACHE
> Task :sdks:java:core:compileJava
Note: Some input files use or override a deprecated API.
Note: Recompile with -Xlint:deprecation for details.
Note: Some input files use unchecked or unsafe operations.
Note: Recompile with -Xlint:unchecked for details.
> Task :sdks:java:core:classes
> Task :sdks:java:core:shadowJar
> Task :sdks:java:io:common:compileTestJava
Note: Some input files use or override a deprecated API.
Note: Recompile with -Xlint:deprecation for details.
> Task :sdks:java:io:common:testClasses
> Task :sdks:java:io:common:testJar
> Task :runners:local-java:compileJava
> Task :runners:local-java:classes
> Task :runners:local-java:jar
> Task :sdks:java:io:synthetic:compileJava
Note: <https://ci-beam.apache.org/job/beam_PreCommit_Java_Kafka_IO_Direct_Cron/ws/src/sdks/java/io/synthetic/src/main/java/org/apache/beam/sdk/io/synthetic/SyntheticBoundedSource.java> uses or overrides a deprecated API.
Note: Recompile with -Xlint:deprecation for details.
> Task :sdks:java:io:synthetic:classes
> Task :sdks:java:io:synthetic:jar
> Task :sdks:java:testing:test-utils:compileJava
> Task :sdks:java:testing:test-utils:classes
> Task :sdks:java:testing:test-utils:jar
> Task :sdks:java:testing:test-utils:compileTestJava
Note: <https://ci-beam.apache.org/job/beam_PreCommit_Java_Kafka_IO_Direct_Cron/ws/src/sdks/java/testing/test-utils/src/test/java/org/apache/beam/sdk/testutils/publishing/InfluxDBPublisherTest.java> uses or overrides a deprecated API.
Note: Recompile with -Xlint:deprecation for details.
> Task :sdks:java:core:compileTestJava
> Task :sdks:java:fn-execution:compileJava
> Task :sdks:java:testing:test-utils:testClasses
> Task :sdks:java:testing:test-utils:testJar
> Task :sdks:java:fn-execution:compileJava
Note: Some input files use or override a deprecated API.
Note: Recompile with -Xlint:deprecation for details.
Note: Some input files use unchecked or unsafe operations.
Note: Recompile with -Xlint:unchecked for details.
> Task :sdks:java:fn-execution:classes
> Task :sdks:java:fn-execution:jar
> Task :sdks:java:core:compileTestJava
Note: Some input files use or override a deprecated API.
Note: Recompile with -Xlint:deprecation for details.
Note: Some input files use unchecked or unsafe operations.
Note: Recompile with -Xlint:unchecked for details.
> Task :sdks:java:core:testClasses
> Task :sdks:java:core:shadowTestJar
> Task :runners:core-construction-java:compileJava
Note: Some input files use or override a deprecated API.
Note: Recompile with -Xlint:deprecation for details.
Note: Some input files use unchecked or unsafe operations.
Note: Recompile with -Xlint:unchecked for details.
> Task :runners:core-construction-java:classes
> Task :runners:core-construction-java:jar
> Task :runners:core-java:compileJava
Note: Some input files use or override a deprecated API.
Note: Recompile with -Xlint:deprecation for details.
Note: Some input files use unchecked or unsafe operations.
Note: Recompile with -Xlint:unchecked for details.
> Task :runners:core-java:classes
> Task :runners:core-java:jar
> Task :runners:core-java:compileTestJava
Note: Some input files use or override a deprecated API.
Note: Recompile with -Xlint:deprecation for details.
Note: Some input files use unchecked or unsafe operations.
Note: Recompile with -Xlint:unchecked for details.
> Task :runners:core-java:testClasses
> Task :runners:core-java:testJar
> Task :sdks:java:harness:compileJava
Note: Some input files use or override a deprecated API.
Note: Recompile with -Xlint:deprecation for details.
Note: Some input files use unchecked or unsafe operations.
Note: Recompile with -Xlint:unchecked for details.
> Task :sdks:java:harness:classes
> Task :sdks:java:harness:jar
> Task :runners:java-fn-execution:compileJava
Note: Some input files use or override a deprecated API.
Note: Recompile with -Xlint:deprecation for details.
Note: Some input files use unchecked or unsafe operations.
Note: Recompile with -Xlint:unchecked for details.
> Task :runners:java-fn-execution:classes
> Task :runners:java-fn-execution:jar
> Task :sdks:java:expansion-service:compileJava
Note: Some input files use unchecked or unsafe operations.
Note: Recompile with -Xlint:unchecked for details.
> Task :sdks:java:expansion-service:classes
> Task :sdks:java:expansion-service:jar
> Task :runners:direct-java:compileJava
> Task :sdks:java:io:kafka:compileJava
Note: Some input files use or override a deprecated API.
Note: Recompile with -Xlint:deprecation for details.
Note: Some input files use unchecked or unsafe operations.
Note: Recompile with -Xlint:unchecked for details.
> Task :sdks:java:io:kafka:classes
> Task :runners:direct-java:compileJava
Note: Some input files use or override a deprecated API.
Note: Recompile with -Xlint:deprecation for details.
Note: Some input files use unchecked or unsafe operations.
Note: Recompile with -Xlint:unchecked for details.
> Task :runners:direct-java:classes
> Task :runners:direct-java:shadowJar
> Task :runners:direct-java:compileTestJava
Note: Some input files use or override a deprecated API.
Note: Recompile with -Xlint:deprecation for details.
Note: Some input files use unchecked or unsafe operations.
Note: Recompile with -Xlint:unchecked for details.
> Task :runners:direct-java:testClasses
> Task :runners:direct-java:shadowTestJar
> Task :sdks:java:io:kafka:compileTestJava
Note: Some input files use or override a deprecated API.
Note: Recompile with -Xlint:deprecation for details.
Note: Some input files use unchecked or unsafe operations.
Note: Recompile with -Xlint:unchecked for details.
> Task :sdks:java:io:kafka:testClasses
> Task :sdks:java:io:kafka:kafkaVersion01103BatchIT
> Task :sdks:java:io:kafka:kafkaVersion01103Test
> Task :sdks:java:io:kafka:kafkaVersion100BatchIT
> Task :sdks:java:io:kafka:kafkaVersion100Test
> Task :sdks:java:io:kafka:kafkaVersion111BatchIT
> Task :sdks:java:io:kafka:kafkaVersion111Test
> Task :sdks:java:io:kafka:kafkaVersion201BatchIT
> Task :sdks:java:io:kafka:kafkaVersion201Test
> Task :sdks:java:io:kafka:kafkaVersion211BatchIT
> Task :sdks:java:io:kafka:kafkaVersion211Test
> Task :sdks:java:io:kafka:kafkaVersion222BatchIT
> Task :sdks:java:io:kafka:kafkaVersion222Test
> Task :sdks:java:io:kafka:kafkaVersion231BatchIT
org.apache.beam.sdk.io.kafka.KafkaIOIT > testKafkaWithDelayedStopReadingFunction FAILED
java.lang.AssertionError at KafkaIOIT.java:500
6 tests completed, 1 failed
> Task :sdks:java:io:kafka:kafkaVersion231BatchIT FAILED
> Task :sdks:java:io:kafka:kafkaVersion231Test
> Task :sdks:java:io:kafka:kafkaVersion241BatchIT
> Task :sdks:java:io:kafka:kafkaVersion241Test
> Task :sdks:java:io:kafka:kafkaVersion251BatchIT
> Task :sdks:java:io:kafka:kafkaVersion251Test
FAILURE: Build failed with an exception.
* What went wrong:
Execution failed for task ':sdks:java:io:kafka:kafkaVersion231BatchIT'.
> There were failing tests. See the report at: file://<https://ci-beam.apache.org/job/beam_PreCommit_Java_Kafka_IO_Direct_Cron/ws/src/sdks/java/io/kafka/build/reports/tests/kafkaVersion231BatchIT/index.html>
* Try:
> Run with --stacktrace option to get the stack trace.
> Run with --info or --debug option to get more log output.
* Get more help at https://help.gradle.org
Deprecated Gradle features were used in this build, making it incompatible with Gradle 8.0.
You can use '--warning-mode all' to show the individual deprecation warnings and determine if they come from your own scripts or plugins.
See https://docs.gradle.org/7.5.1/userguide/command_line_interface.html#sec:command_line_warnings
BUILD FAILED in 54m 49s
98 actionable tasks: 86 executed, 12 from cache
Publishing build scan...
https://gradle.com/s/qyn5i5jw3ry3w
Build step 'Invoke Gradle script' changed build result to FAILURE
Build step 'Invoke Gradle script' marked build as failure
---------------------------------------------------------------------
To unsubscribe, e-mail: builds-unsubscribe@beam.apache.org
For additional commands, e-mail: builds-help@beam.apache.org
Jenkins build is back to normal : beam_PreCommit_Java_Kafka_IO_Direct_Cron #680
Posted by Apache Jenkins Server <je...@builds.apache.org>.
See <https://ci-beam.apache.org/job/beam_PreCommit_Java_Kafka_IO_Direct_Cron/680/display/redirect?page=changes>
---------------------------------------------------------------------
To unsubscribe, e-mail: builds-unsubscribe@beam.apache.org
For additional commands, e-mail: builds-help@beam.apache.org