You are viewing a plain text version of this content. The canonical link for it is here.
Posted to dev@jmeter.apache.org by Apache Jenkins Server <je...@builds.apache.org> on 2025/11/12 08:05:19 UTC
Build failed in Jenkins: JMeter » JMeter-trunk #997
See <https://ci-builds.apache.org/job/JMeter/job/JMeter-trunk/997/display/redirect?page=changes>
Changes:
[Vladimir Sitnikov] Fix Bug 6456: Handle malformed percent-encoded URLs gracefully
------------------------------------------
[...truncated 6.32 MiB...]
GRADLE_USER_HOME = /home/jenkins/.gradle
Open this report for more details: file://<https://ci-builds.apache.org/job/JMeter/job/JMeter-trunk/ws/build/reports/dependency-verification/at-1762934177597/dependency-verification-report.html>
* Try:
> Run with --stacktrace option to get the stack trace.
> Run with --info or --debug option to get more log output.
> Get more help at https://help.gradle.org.
==============================================================================
7: Task failed with an exception.
-----------
* What went wrong:
Execution failed for task ':src:protocol:ftp:spotbugsMain'.
> A failure occurred while executing com.github.spotbugs.snom.internal.SpotBugsRunnerForHybrid$SpotBugsExecutor
> Could not isolate value com.github.spotbugs.snom.internal.SpotBugsRunnerForHybrid$SpotBugsWorkParameters_Decorated@7ab61a78 of type SpotBugsRunnerForHybrid.SpotBugsWorkParameters
> Dependency verification failed for configuration ':src:protocol:ftp:spotbugs':
- On artifact bcel-6.8.0.pom (org.apache.bcel:bcel:6.8.0) in repository 'MavenRepo': Artifact was signed with key '2DB4F1EF0FA761ECC4EA935C86FDC7E2A11262CB' (Gary David Gregory (Code signing key) <gg...@apache.org>) and passed verification but the key isn't in your trusted keys list.
- On artifact dom4j-2.1.4.module (org.dom4j:dom4j:2.1.4) in repository 'MavenRepo': Artifact was signed with key '8F9A3C6D105B9F57844A721D79E193516BE7998F' (Filip Jirsák <fi...@jirsak.org>) and passed verification but the key isn't in your trusted keys list.
- On artifact groovy-bom-3.0.19.pom (org.codehaus.groovy:groovy-bom:3.0.19) in repository 'MavenRepo': Artifact was signed with key '34441E504A937F43EB0DAEF96A65176A0FB1CD0B' and passed verification but the key isn't in your trusted keys list.
- On artifact jaxen-2.0.0.pom (jaxen:jaxen:2.0.0) in repository 'MavenRepo': Artifact was signed with key 'CA491704D613780D2BEE00F2C6FC46EB51CF569C' and passed verification but the key isn't in your trusted keys list.
- On artifact jaxen-parent-2.0.0.pom (jaxen:jaxen-parent:2.0.0) in repository 'MavenRepo': Artifact was signed with key 'CA491704D613780D2BEE00F2C6FC46EB51CF569C' and passed verification but the key isn't in your trusted keys list.
- On artifact jcip-annotations-1.0-1.pom (com.github.stephenc.jcip:jcip-annotations:1.0-1) in repository 'MavenRepo': Artifact was signed with key '042B29E928995B9DB963C636C7CA19B7B620D787' (Stephen Connolly <st...@apache.org>) and passed verification but the key isn't in your trusted keys list.
- On artifact kubernetes-client-bom-5.12.4.pom (io.fabric8:kubernetes-client-bom:5.12.4) in repository 'MavenRepo': Artifact was signed with key 'A42FEF087AF29AE864684EAEE6039456D5BBD4F8' (FuseSource (CODE SIGNING KEY) <ad...@fusesource.com>) and passed verification but the key isn't in your trusted keys list.
- On artifact logging-parent-10.4.0.pom (org.apache.logging:logging-parent:10.4.0) in repository 'MavenRepo': Artifact was signed with key '077E8893A6DCC33DD4A4D5B256E73BA9A0B592D0' (ASF Logging Services RM <pr...@logging.apache.org>) and passed verification but the key isn't in your trusted keys list.
If the artifacts are trustworthy, you will need to update the gradle/verification-metadata.xml file. For more on how to do this, please refer to https://docs.gradle.org/8.14.3/userguide/dependency_verification.html#sec:troubleshooting-verification in the Gradle documentation.
These files failed verification:
- GRADLE_USER_HOME/caches/modules-2/files-2.1/com.github.stephenc.jcip/jcip-annotations/1.0-1/bdccebfbbbdd66fe56dcdf3bdee7b97a853cccc5/jcip-annotations-1.0-1.pom (signature: GRADLE_USER_HOME/caches/modules-2/files-2.1/com.github.stephenc.jcip/jcip-annotations/1.0-1/6384a3de49584e3859a4811ea1dd92a99eaf0b1b/jcip-annotations-1.0-1.pom.asc)
- GRADLE_USER_HOME/caches/modules-2/files-2.1/io.fabric8/kubernetes-client-bom/5.12.4/e79360b6c85f975006571e2251496c9677a15d19/kubernetes-client-bom-5.12.4.pom (signature: GRADLE_USER_HOME/caches/modules-2/files-2.1/io.fabric8/kubernetes-client-bom/5.12.4/992ad37c7d9bd1c0cc13de68418efd4a96d71fd9/kubernetes-client-bom-5.12.4.pom.asc)
- GRADLE_USER_HOME/caches/modules-2/files-2.1/jaxen/jaxen-parent/2.0.0/d311145c4f8835088b86fb8446d725816b03bcca/jaxen-parent-2.0.0.pom (signature: GRADLE_USER_HOME/caches/modules-2/files-2.1/jaxen/jaxen-parent/2.0.0/3e6599ad1b73a0c262eb74a726204b2c171fa767/jaxen-parent-2.0.0.pom.asc)
- GRADLE_USER_HOME/caches/modules-2/files-2.1/jaxen/jaxen/2.0.0/81346e6db971f2ce5e6eb994fd112b9f91986ee/jaxen-2.0.0.pom (signature: GRADLE_USER_HOME/caches/modules-2/files-2.1/jaxen/jaxen/2.0.0/e4a6c2fd9be9809402cba48b050976ceacd0b6c6/jaxen-2.0.0.pom.asc)
- GRADLE_USER_HOME/caches/modules-2/files-2.1/org.apache.bcel/bcel/6.8.0/a75edb8dd0a01412a5baf706eec0befe9079f64d/bcel-6.8.0.pom (signature: GRADLE_USER_HOME/caches/modules-2/files-2.1/org.apache.bcel/bcel/6.8.0/f5ee08bea2a4fb53ef8f8e864edb4e1464709a69/bcel-6.8.0.pom.asc)
- GRADLE_USER_HOME/caches/modules-2/files-2.1/org.apache.logging/logging-parent/10.4.0/9bf2a0e4e2fac63d939fd6e1db8e77263a89aecf/logging-parent-10.4.0.pom (signature: GRADLE_USER_HOME/caches/modules-2/files-2.1/org.apache.logging/logging-parent/10.4.0/e976b94d3bdd03b125b794b4f9cb622d15e97c22/logging-parent-10.4.0.pom.asc)
- GRADLE_USER_HOME/caches/modules-2/files-2.1/org.codehaus.groovy/groovy-bom/3.0.19/206e6428672da27eb124ec3bdd7920830b9f6e58/groovy-bom-3.0.19.pom (signature: GRADLE_USER_HOME/caches/modules-2/files-2.1/org.codehaus.groovy/groovy-bom/3.0.19/eb5eba73367a2773a796eee2ca1df4afd0e6a8c8/groovy-bom-3.0.19.pom.asc)
- GRADLE_USER_HOME/caches/modules-2/files-2.1/org.dom4j/dom4j/2.1.4/f3ea4c21f9b0e8357094a4804972aa33a62d6ef3/dom4j-2.1.4.module (signature: GRADLE_USER_HOME/caches/modules-2/files-2.1/org.dom4j/dom4j/2.1.4/4b29bab419201e02a37b21ad6e02a69600884f9f/dom4j-2.1.4.module.asc)
GRADLE_USER_HOME = /home/jenkins/.gradle
These files failed verification:
- GRADLE_USER_HOME/caches/modules-2/files-2.1/com.github.stephenc.jcip/jcip-annotations/1.0-1/bdccebfbbbdd66fe56dcdf3bdee7b97a853cccc5/jcip-annotations-1.0-1.pom (signature: GRADLE_USER_HOME/caches/modules-2/files-2.1/com.github.stephenc.jcip/jcip-annotations/1.0-1/6384a3de49584e3859a4811ea1dd92a99eaf0b1b/jcip-annotations-1.0-1.pom.asc)
- GRADLE_USER_HOME/caches/modules-2/files-2.1/io.fabric8/kubernetes-client-bom/5.12.4/e79360b6c85f975006571e2251496c9677a15d19/kubernetes-client-bom-5.12.4.pom (signature: GRADLE_USER_HOME/caches/modules-2/files-2.1/io.fabric8/kubernetes-client-bom/5.12.4/992ad37c7d9bd1c0cc13de68418efd4a96d71fd9/kubernetes-client-bom-5.12.4.pom.asc)
- GRADLE_USER_HOME/caches/modules-2/files-2.1/jaxen/jaxen-parent/2.0.0/d311145c4f8835088b86fb8446d725816b03bcca/jaxen-parent-2.0.0.pom (signature: GRADLE_USER_HOME/caches/modules-2/files-2.1/jaxen/jaxen-parent/2.0.0/3e6599ad1b73a0c262eb74a726204b2c171fa767/jaxen-parent-2.0.0.pom.asc)
- GRADLE_USER_HOME/caches/modules-2/files-2.1/jaxen/jaxen/2.0.0/81346e6db971f2ce5e6eb994fd112b9f91986ee/jaxen-2.0.0.pom (signature: GRADLE_USER_HOME/caches/modules-2/files-2.1/jaxen/jaxen/2.0.0/e4a6c2fd9be9809402cba48b050976ceacd0b6c6/jaxen-2.0.0.pom.asc)
- GRADLE_USER_HOME/caches/modules-2/files-2.1/org.apache.bcel/bcel/6.8.0/a75edb8dd0a01412a5baf706eec0befe9079f64d/bcel-6.8.0.pom (signature: GRADLE_USER_HOME/caches/modules-2/files-2.1/org.apache.bcel/bcel/6.8.0/f5ee08bea2a4fb53ef8f8e864edb4e1464709a69/bcel-6.8.0.pom.asc)
- GRADLE_USER_HOME/caches/modules-2/files-2.1/org.apache.logging/logging-parent/10.4.0/9bf2a0e4e2fac63d939fd6e1db8e77263a89aecf/logging-parent-10.4.0.pom (signature: GRADLE_USER_HOME/caches/modules-2/files-2.1/org.apache.logging/logging-parent/10.4.0/e976b94d3bdd03b125b794b4f9cb622d15e97c22/logging-parent-10.4.0.pom.asc)
- GRADLE_USER_HOME/caches/modules-2/files-2.1/org.codehaus.groovy/groovy-bom/3.0.19/206e6428672da27eb124ec3bdd7920830b9f6e58/groovy-bom-3.0.19.pom (signature: GRADLE_USER_HOME/caches/modules-2/files-2.1/org.codehaus.groovy/groovy-bom/3.0.19/eb5eba73367a2773a796eee2ca1df4afd0e6a8c8/groovy-bom-3.0.19.pom.asc)
- GRADLE_USER_HOME/caches/modules-2/files-2.1/org.dom4j/dom4j/2.1.4/f3ea4c21f9b0e8357094a4804972aa33a62d6ef3/dom4j-2.1.4.module (signature: GRADLE_USER_HOME/caches/modules-2/files-2.1/org.dom4j/dom4j/2.1.4/4b29bab419201e02a37b21ad6e02a69600884f9f/dom4j-2.1.4.module.asc)
GRADLE_USER_HOME = /home/jenkins/.gradle
Open this report for more details: file://<https://ci-builds.apache.org/job/JMeter/job/JMeter-trunk/ws/build/reports/dependency-verification/at-1762934177597/dependency-verification-report.html>
* Try:
> Run with --stacktrace option to get the stack trace.
> Run with --info or --debug option to get more log output.
> Get more help at https://help.gradle.org.
==============================================================================
8: Task failed with an exception.
-----------
* What went wrong:
Execution failed for task ':src:testkit:spotbugsMain'.
> A failure occurred while executing com.github.spotbugs.snom.internal.SpotBugsRunnerForHybrid$SpotBugsExecutor
> Could not isolate value com.github.spotbugs.snom.internal.SpotBugsRunnerForHybrid$SpotBugsWorkParameters_Decorated@63d7b836 of type SpotBugsRunnerForHybrid.SpotBugsWorkParameters
> Dependency verification failed for configuration ':src:testkit:spotbugs':
- On artifact bcel-6.8.0.pom (org.apache.bcel:bcel:6.8.0) in repository 'MavenRepo': Artifact was signed with key '2DB4F1EF0FA761ECC4EA935C86FDC7E2A11262CB' (Gary David Gregory (Code signing key) <gg...@apache.org>) and passed verification but the key isn't in your trusted keys list.
- On artifact dom4j-2.1.4.module (org.dom4j:dom4j:2.1.4) in repository 'MavenRepo': Artifact was signed with key '8F9A3C6D105B9F57844A721D79E193516BE7998F' (Filip Jirsák <fi...@jirsak.org>) and passed verification but the key isn't in your trusted keys list.
- On artifact groovy-bom-3.0.19.pom (org.codehaus.groovy:groovy-bom:3.0.19) in repository 'MavenRepo': Artifact was signed with key '34441E504A937F43EB0DAEF96A65176A0FB1CD0B' and passed verification but the key isn't in your trusted keys list.
- On artifact jaxen-2.0.0.pom (jaxen:jaxen:2.0.0) in repository 'MavenRepo': Artifact was signed with key 'CA491704D613780D2BEE00F2C6FC46EB51CF569C' and passed verification but the key isn't in your trusted keys list.
- On artifact jaxen-parent-2.0.0.pom (jaxen:jaxen-parent:2.0.0) in repository 'MavenRepo': Artifact was signed with key 'CA491704D613780D2BEE00F2C6FC46EB51CF569C' and passed verification but the key isn't in your trusted keys list.
- On artifact jcip-annotations-1.0-1.pom (com.github.stephenc.jcip:jcip-annotations:1.0-1) in repository 'MavenRepo': Artifact was signed with key '042B29E928995B9DB963C636C7CA19B7B620D787' (Stephen Connolly <st...@apache.org>) and passed verification but the key isn't in your trusted keys list.
- On artifact kubernetes-client-bom-5.12.4.pom (io.fabric8:kubernetes-client-bom:5.12.4) in repository 'MavenRepo': Artifact was signed with key 'A42FEF087AF29AE864684EAEE6039456D5BBD4F8' (FuseSource (CODE SIGNING KEY) <ad...@fusesource.com>) and passed verification but the key isn't in your trusted keys list.
- On artifact logging-parent-10.4.0.pom (org.apache.logging:logging-parent:10.4.0) in repository 'MavenRepo': Artifact was signed with key '077E8893A6DCC33DD4A4D5B256E73BA9A0B592D0' (ASF Logging Services RM <pr...@logging.apache.org>) and passed verification but the key isn't in your trusted keys list.
If the artifacts are trustworthy, you will need to update the gradle/verification-metadata.xml file. For more on how to do this, please refer to https://docs.gradle.org/8.14.3/userguide/dependency_verification.html#sec:troubleshooting-verification in the Gradle documentation.
These files failed verification:
- GRADLE_USER_HOME/caches/modules-2/files-2.1/com.github.stephenc.jcip/jcip-annotations/1.0-1/bdccebfbbbdd66fe56dcdf3bdee7b97a853cccc5/jcip-annotations-1.0-1.pom (signature: GRADLE_USER_HOME/caches/modules-2/files-2.1/com.github.stephenc.jcip/jcip-annotations/1.0-1/6384a3de49584e3859a4811ea1dd92a99eaf0b1b/jcip-annotations-1.0-1.pom.asc)
- GRADLE_USER_HOME/caches/modules-2/files-2.1/io.fabric8/kubernetes-client-bom/5.12.4/e79360b6c85f975006571e2251496c9677a15d19/kubernetes-client-bom-5.12.4.pom (signature: GRADLE_USER_HOME/caches/modules-2/files-2.1/io.fabric8/kubernetes-client-bom/5.12.4/992ad37c7d9bd1c0cc13de68418efd4a96d71fd9/kubernetes-client-bom-5.12.4.pom.asc)
- GRADLE_USER_HOME/caches/modules-2/files-2.1/jaxen/jaxen-parent/2.0.0/d311145c4f8835088b86fb8446d725816b03bcca/jaxen-parent-2.0.0.pom (signature: GRADLE_USER_HOME/caches/modules-2/files-2.1/jaxen/jaxen-parent/2.0.0/3e6599ad1b73a0c262eb74a726204b2c171fa767/jaxen-parent-2.0.0.pom.asc)
- GRADLE_USER_HOME/caches/modules-2/files-2.1/jaxen/jaxen/2.0.0/81346e6db971f2ce5e6eb994fd112b9f91986ee/jaxen-2.0.0.pom (signature: GRADLE_USER_HOME/caches/modules-2/files-2.1/jaxen/jaxen/2.0.0/e4a6c2fd9be9809402cba48b050976ceacd0b6c6/jaxen-2.0.0.pom.asc)
- GRADLE_USER_HOME/caches/modules-2/files-2.1/org.apache.bcel/bcel/6.8.0/a75edb8dd0a01412a5baf706eec0befe9079f64d/bcel-6.8.0.pom (signature: GRADLE_USER_HOME/caches/modules-2/files-2.1/org.apache.bcel/bcel/6.8.0/f5ee08bea2a4fb53ef8f8e864edb4e1464709a69/bcel-6.8.0.pom.asc)
- GRADLE_USER_HOME/caches/modules-2/files-2.1/org.apache.logging/logging-parent/10.4.0/9bf2a0e4e2fac63d939fd6e1db8e77263a89aecf/logging-parent-10.4.0.pom (signature: GRADLE_USER_HOME/caches/modules-2/files-2.1/org.apache.logging/logging-parent/10.4.0/e976b94d3bdd03b125b794b4f9cb622d15e97c22/logging-parent-10.4.0.pom.asc)
- GRADLE_USER_HOME/caches/modules-2/files-2.1/org.codehaus.groovy/groovy-bom/3.0.19/206e6428672da27eb124ec3bdd7920830b9f6e58/groovy-bom-3.0.19.pom (signature: GRADLE_USER_HOME/caches/modules-2/files-2.1/org.codehaus.groovy/groovy-bom/3.0.19/eb5eba73367a2773a796eee2ca1df4afd0e6a8c8/groovy-bom-3.0.19.pom.asc)
- GRADLE_USER_HOME/caches/modules-2/files-2.1/org.dom4j/dom4j/2.1.4/f3ea4c21f9b0e8357094a4804972aa33a62d6ef3/dom4j-2.1.4.module (signature: GRADLE_USER_HOME/caches/modules-2/files-2.1/org.dom4j/dom4j/2.1.4/4b29bab419201e02a37b21ad6e02a69600884f9f/dom4j-2.1.4.module.asc)
GRADLE_USER_HOME = /home/jenkins/.gradle
These files failed verification:
- GRADLE_USER_HOME/caches/modules-2/files-2.1/com.github.stephenc.jcip/jcip-annotations/1.0-1/bdccebfbbbdd66fe56dcdf3bdee7b97a853cccc5/jcip-annotations-1.0-1.pom (signature: GRADLE_USER_HOME/caches/modules-2/files-2.1/com.github.stephenc.jcip/jcip-annotations/1.0-1/6384a3de49584e3859a4811ea1dd92a99eaf0b1b/jcip-annotations-1.0-1.pom.asc)
- GRADLE_USER_HOME/caches/modules-2/files-2.1/io.fabric8/kubernetes-client-bom/5.12.4/e79360b6c85f975006571e2251496c9677a15d19/kubernetes-client-bom-5.12.4.pom (signature: GRADLE_USER_HOME/caches/modules-2/files-2.1/io.fabric8/kubernetes-client-bom/5.12.4/992ad37c7d9bd1c0cc13de68418efd4a96d71fd9/kubernetes-client-bom-5.12.4.pom.asc)
- GRADLE_USER_HOME/caches/modules-2/files-2.1/jaxen/jaxen-parent/2.0.0/d311145c4f8835088b86fb8446d725816b03bcca/jaxen-parent-2.0.0.pom (signature: GRADLE_USER_HOME/caches/modules-2/files-2.1/jaxen/jaxen-parent/2.0.0/3e6599ad1b73a0c262eb74a726204b2c171fa767/jaxen-parent-2.0.0.pom.asc)
- GRADLE_USER_HOME/caches/modules-2/files-2.1/jaxen/jaxen/2.0.0/81346e6db971f2ce5e6eb994fd112b9f91986ee/jaxen-2.0.0.pom (signature: GRADLE_USER_HOME/caches/modules-2/files-2.1/jaxen/jaxen/2.0.0/e4a6c2fd9be9809402cba48b050976ceacd0b6c6/jaxen-2.0.0.pom.asc)
- GRADLE_USER_HOME/caches/modules-2/files-2.1/org.apache.bcel/bcel/6.8.0/a75edb8dd0a01412a5baf706eec0befe9079f64d/bcel-6.8.0.pom (signature: GRADLE_USER_HOME/caches/modules-2/files-2.1/org.apache.bcel/bcel/6.8.0/f5ee08bea2a4fb53ef8f8e864edb4e1464709a69/bcel-6.8.0.pom.asc)
- GRADLE_USER_HOME/caches/modules-2/files-2.1/org.apache.logging/logging-parent/10.4.0/9bf2a0e4e2fac63d939fd6e1db8e77263a89aecf/logging-parent-10.4.0.pom (signature: GRADLE_USER_HOME/caches/modules-2/files-2.1/org.apache.logging/logging-parent/10.4.0/e976b94d3bdd03b125b794b4f9cb622d15e97c22/logging-parent-10.4.0.pom.asc)
- GRADLE_USER_HOME/caches/modules-2/files-2.1/org.codehaus.groovy/groovy-bom/3.0.19/206e6428672da27eb124ec3bdd7920830b9f6e58/groovy-bom-3.0.19.pom (signature: GRADLE_USER_HOME/caches/modules-2/files-2.1/org.codehaus.groovy/groovy-bom/3.0.19/eb5eba73367a2773a796eee2ca1df4afd0e6a8c8/groovy-bom-3.0.19.pom.asc)
- GRADLE_USER_HOME/caches/modules-2/files-2.1/org.dom4j/dom4j/2.1.4/f3ea4c21f9b0e8357094a4804972aa33a62d6ef3/dom4j-2.1.4.module (signature: GRADLE_USER_HOME/caches/modules-2/files-2.1/org.dom4j/dom4j/2.1.4/4b29bab419201e02a37b21ad6e02a69600884f9f/dom4j-2.1.4.module.asc)
GRADLE_USER_HOME = /home/jenkins/.gradle
Open this report for more details: file://<https://ci-builds.apache.org/job/JMeter/job/JMeter-trunk/ws/build/reports/dependency-verification/at-1762934177597/dependency-verification-report.html>
* Try:
> Run with --stacktrace option to get the stack trace.
> Run with --info or --debug option to get more log output.
> Get more help at https://help.gradle.org.
==============================================================================
9: Task failed with an exception.
-----------
* What went wrong:
Execution failed for task ':src:bshclient:spotbugsMain'.
> A failure occurred while executing com.github.spotbugs.snom.internal.SpotBugsRunnerForHybrid$SpotBugsExecutor
> Could not isolate value com.github.spotbugs.snom.internal.SpotBugsRunnerForHybrid$SpotBugsWorkParameters_Decorated@3463d900 of type SpotBugsRunnerForHybrid.SpotBugsWorkParameters
> Dependency verification failed for configuration ':src:bshclient:spotbugs':
- On artifact bcel-6.8.0.pom (org.apache.bcel:bcel:6.8.0) in repository 'MavenRepo': Artifact was signed with key '2DB4F1EF0FA761ECC4EA935C86FDC7E2A11262CB' (Gary David Gregory (Code signing key) <gg...@apache.org>) and passed verification but the key isn't in your trusted keys list.
- On artifact dom4j-2.1.4.module (org.dom4j:dom4j:2.1.4) in repository 'MavenRepo': Artifact was signed with key '8F9A3C6D105B9F57844A721D79E193516BE7998F' (Filip Jirsák <fi...@jirsak.org>) and passed verification but the key isn't in your trusted keys list.
- On artifact groovy-bom-3.0.19.pom (org.codehaus.groovy:groovy-bom:3.0.19) in repository 'MavenRepo': Artifact was signed with key '34441E504A937F43EB0DAEF96A65176A0FB1CD0B' and passed verification but the key isn't in your trusted keys list.
- On artifact jaxen-2.0.0.pom (jaxen:jaxen:2.0.0) in repository 'MavenRepo': Artifact was signed with key 'CA491704D613780D2BEE00F2C6FC46EB51CF569C' and passed verification but the key isn't in your trusted keys list.
- On artifact jaxen-parent-2.0.0.pom (jaxen:jaxen-parent:2.0.0) in repository 'MavenRepo': Artifact was signed with key 'CA491704D613780D2BEE00F2C6FC46EB51CF569C' and passed verification but the key isn't in your trusted keys list.
- On artifact jcip-annotations-1.0-1.pom (com.github.stephenc.jcip:jcip-annotations:1.0-1) in repository 'MavenRepo': Artifact was signed with key '042B29E928995B9DB963C636C7CA19B7B620D787' (Stephen Connolly <st...@apache.org>) and passed verification but the key isn't in your trusted keys list.
- On artifact kubernetes-client-bom-5.12.4.pom (io.fabric8:kubernetes-client-bom:5.12.4) in repository 'MavenRepo': Artifact was signed with key 'A42FEF087AF29AE864684EAEE6039456D5BBD4F8' (FuseSource (CODE SIGNING KEY) <ad...@fusesource.com>) and passed verification but the key isn't in your trusted keys list.
- On artifact logging-parent-10.4.0.pom (org.apache.logging:logging-parent:10.4.0) in repository 'MavenRepo': Artifact was signed with key '077E8893A6DCC33DD4A4D5B256E73BA9A0B592D0' (ASF Logging Services RM <pr...@logging.apache.org>) and passed verification but the key isn't in your trusted keys list.
If the artifacts are trustworthy, you will need to update the gradle/verification-metadata.xml file. For more on how to do this, please refer to https://docs.gradle.org/8.14.3/userguide/dependency_verification.html#sec:troubleshooting-verification in the Gradle documentation.
These files failed verification:
- GRADLE_USER_HOME/caches/modules-2/files-2.1/com.github.stephenc.jcip/jcip-annotations/1.0-1/bdccebfbbbdd66fe56dcdf3bdee7b97a853cccc5/jcip-annotations-1.0-1.pom (signature: GRADLE_USER_HOME/caches/modules-2/files-2.1/com.github.stephenc.jcip/jcip-annotations/1.0-1/6384a3de49584e3859a4811ea1dd92a99eaf0b1b/jcip-annotations-1.0-1.pom.asc)
- GRADLE_USER_HOME/caches/modules-2/files-2.1/io.fabric8/kubernetes-client-bom/5.12.4/e79360b6c85f975006571e2251496c9677a15d19/kubernetes-client-bom-5.12.4.pom (signature: GRADLE_USER_HOME/caches/modules-2/files-2.1/io.fabric8/kubernetes-client-bom/5.12.4/992ad37c7d9bd1c0cc13de68418efd4a96d71fd9/kubernetes-client-bom-5.12.4.pom.asc)
- GRADLE_USER_HOME/caches/modules-2/files-2.1/jaxen/jaxen-parent/2.0.0/d311145c4f8835088b86fb8446d725816b03bcca/jaxen-parent-2.0.0.pom (signature: GRADLE_USER_HOME/caches/modules-2/files-2.1/jaxen/jaxen-parent/2.0.0/3e6599ad1b73a0c262eb74a726204b2c171fa767/jaxen-parent-2.0.0.pom.asc)
- GRADLE_USER_HOME/caches/modules-2/files-2.1/jaxen/jaxen/2.0.0/81346e6db971f2ce5e6eb994fd112b9f91986ee/jaxen-2.0.0.pom (signature: GRADLE_USER_HOME/caches/modules-2/files-2.1/jaxen/jaxen/2.0.0/e4a6c2fd9be9809402cba48b050976ceacd0b6c6/jaxen-2.0.0.pom.asc)
- GRADLE_USER_HOME/caches/modules-2/files-2.1/org.apache.bcel/bcel/6.8.0/a75edb8dd0a01412a5baf706eec0befe9079f64d/bcel-6.8.0.pom (signature: GRADLE_USER_HOME/caches/modules-2/files-2.1/org.apache.bcel/bcel/6.8.0/f5ee08bea2a4fb53ef8f8e864edb4e1464709a69/bcel-6.8.0.pom.asc)
- GRADLE_USER_HOME/caches/modules-2/files-2.1/org.apache.logging/logging-parent/10.4.0/9bf2a0e4e2fac63d939fd6e1db8e77263a89aecf/logging-parent-10.4.0.pom (signature: GRADLE_USER_HOME/caches/modules-2/files-2.1/org.apache.logging/logging-parent/10.4.0/e976b94d3bdd03b125b794b4f9cb622d15e97c22/logging-parent-10.4.0.pom.asc)
- GRADLE_USER_HOME/caches/modules-2/files-2.1/org.codehaus.groovy/groovy-bom/3.0.19/206e6428672da27eb124ec3bdd7920830b9f6e58/groovy-bom-3.0.19.pom (signature: GRADLE_USER_HOME/caches/modules-2/files-2.1/org.codehaus.groovy/groovy-bom/3.0.19/eb5eba73367a2773a796eee2ca1df4afd0e6a8c8/groovy-bom-3.0.19.pom.asc)
- GRADLE_USER_HOME/caches/modules-2/files-2.1/org.dom4j/dom4j/2.1.4/f3ea4c21f9b0e8357094a4804972aa33a62d6ef3/dom4j-2.1.4.module (signature: GRADLE_USER_HOME/caches/modules-2/files-2.1/org.dom4j/dom4j/2.1.4/4b29bab419201e02a37b21ad6e02a69600884f9f/dom4j-2.1.4.module.asc)
GRADLE_USER_HOME = /home/jenkins/.gradle
These files failed verification:
- GRADLE_USER_HOME/caches/modules-2/files-2.1/com.github.stephenc.jcip/jcip-annotations/1.0-1/bdccebfbbbdd66fe56dcdf3bdee7b97a853cccc5/jcip-annotations-1.0-1.pom (signature: GRADLE_USER_HOME/caches/modules-2/files-2.1/com.github.stephenc.jcip/jcip-annotations/1.0-1/6384a3de49584e3859a4811ea1dd92a99eaf0b1b/jcip-annotations-1.0-1.pom.asc)
- GRADLE_USER_HOME/caches/modules-2/files-2.1/io.fabric8/kubernetes-client-bom/5.12.4/e79360b6c85f975006571e2251496c9677a15d19/kubernetes-client-bom-5.12.4.pom (signature: GRADLE_USER_HOME/caches/modules-2/files-2.1/io.fabric8/kubernetes-client-bom/5.12.4/992ad37c7d9bd1c0cc13de68418efd4a96d71fd9/kubernetes-client-bom-5.12.4.pom.asc)
- GRADLE_USER_HOME/caches/modules-2/files-2.1/jaxen/jaxen-parent/2.0.0/d311145c4f8835088b86fb8446d725816b03bcca/jaxen-parent-2.0.0.pom (signature: GRADLE_USER_HOME/caches/modules-2/files-2.1/jaxen/jaxen-parent/2.0.0/3e6599ad1b73a0c262eb74a726204b2c171fa767/jaxen-parent-2.0.0.pom.asc)
- GRADLE_USER_HOME/caches/modules-2/files-2.1/jaxen/jaxen/2.0.0/81346e6db971f2ce5e6eb994fd112b9f91986ee/jaxen-2.0.0.pom (signature: GRADLE_USER_HOME/caches/modules-2/files-2.1/jaxen/jaxen/2.0.0/e4a6c2fd9be9809402cba48b050976ceacd0b6c6/jaxen-2.0.0.pom.asc)
- GRADLE_USER_HOME/caches/modules-2/files-2.1/org.apache.bcel/bcel/6.8.0/a75edb8dd0a01412a5baf706eec0befe9079f64d/bcel-6.8.0.pom (signature: GRADLE_USER_HOME/caches/modules-2/files-2.1/org.apache.bcel/bcel/6.8.0/f5ee08bea2a4fb53ef8f8e864edb4e1464709a69/bcel-6.8.0.pom.asc)
- GRADLE_USER_HOME/caches/modules-2/files-2.1/org.apache.logging/logging-parent/10.4.0/9bf2a0e4e2fac63d939fd6e1db8e77263a89aecf/logging-parent-10.4.0.pom (signature: GRADLE_USER_HOME/caches/modules-2/files-2.1/org.apache.logging/logging-parent/10.4.0/e976b94d3bdd03b125b794b4f9cb622d15e97c22/logging-parent-10.4.0.pom.asc)
- GRADLE_USER_HOME/caches/modules-2/files-2.1/org.codehaus.groovy/groovy-bom/3.0.19/206e6428672da27eb124ec3bdd7920830b9f6e58/groovy-bom-3.0.19.pom (signature: GRADLE_USER_HOME/caches/modules-2/files-2.1/org.codehaus.groovy/groovy-bom/3.0.19/eb5eba73367a2773a796eee2ca1df4afd0e6a8c8/groovy-bom-3.0.19.pom.asc)
- GRADLE_USER_HOME/caches/modules-2/files-2.1/org.dom4j/dom4j/2.1.4/f3ea4c21f9b0e8357094a4804972aa33a62d6ef3/dom4j-2.1.4.module (signature: GRADLE_USER_HOME/caches/modules-2/files-2.1/org.dom4j/dom4j/2.1.4/4b29bab419201e02a37b21ad6e02a69600884f9f/dom4j-2.1.4.module.asc)
GRADLE_USER_HOME = /home/jenkins/.gradle
Open this report for more details: file://<https://ci-builds.apache.org/job/JMeter/job/JMeter-trunk/ws/build/reports/dependency-verification/at-1762934177597/dependency-verification-report.html>
* Try:
> Run with --stacktrace option to get the stack trace.
> Run with --info or --debug option to get more log output.
> Get more help at https://help.gradle.org.
==============================================================================
10: Task failed with an exception.
-----------
* What went wrong:
Execution failed for task ':src:launcher:spotbugsMain'.
> A failure occurred while executing com.github.spotbugs.snom.internal.SpotBugsRunnerForHybrid$SpotBugsExecutor
> Could not isolate value com.github.spotbugs.snom.internal.SpotBugsRunnerForHybrid$SpotBugsWorkParameters_Decorated@2c0ab604 of type SpotBugsRunnerForHybrid.SpotBugsWorkParameters
> Dependency verification failed for configuration ':src:launcher:spotbugs':
- On artifact bcel-6.8.0.jar (org.apache.bcel:bcel:6.8.0) in repository 'MavenRepo': Artifact was signed with key '2DB4F1EF0FA761ECC4EA935C86FDC7E2A11262CB' (Gary David Gregory (Code signing key) <gg...@apache.org>) and passed verification but the key isn't in your trusted keys list.
- On artifact bcel-6.8.0.pom (org.apache.bcel:bcel:6.8.0) in repository 'MavenRepo': Artifact was signed with key '2DB4F1EF0FA761ECC4EA935C86FDC7E2A11262CB' (Gary David Gregory (Code signing key) <gg...@apache.org>) and passed verification but the key isn't in your trusted keys list.
- On artifact commons-codec-1.15.jar (commons-codec:commons-codec:1.15) in repository 'MavenRepo': Artifact was signed with key 'BC87A3FD0A54480F0BADBEBD21939FF0CA2A6567' and passed verification but the key isn't in your trusted keys list.
- On artifact commons-codec-1.15.pom (commons-codec:commons-codec:1.15) in repository 'MavenRepo': Artifact was signed with key 'BC87A3FD0A54480F0BADBEBD21939FF0CA2A6567' and passed verification but the key isn't in your trusted keys list.
- On artifact dom4j-2.1.4.jar (org.dom4j:dom4j:2.1.4) in repository 'MavenRepo': Artifact was signed with key '8F9A3C6D105B9F57844A721D79E193516BE7998F' (Filip Jirsák <fi...@jirsak.org>) and passed verification but the key isn't in your trusted keys list.
- On artifact dom4j-2.1.4.module (org.dom4j:dom4j:2.1.4) in repository 'MavenRepo': Artifact was signed with key '8F9A3C6D105B9F57844A721D79E193516BE7998F' (Filip Jirsák <fi...@jirsak.org>) and passed verification but the key isn't in your trusted keys list.
- On artifact groovy-bom-3.0.19.pom (org.codehaus.groovy:groovy-bom:3.0.19) in repository 'MavenRepo': Artifact was signed with key '34441E504A937F43EB0DAEF96A65176A0FB1CD0B' and passed verification but the key isn't in your trusted keys list.
- On artifact httpcomponents-parent-12.pom (org.apache.httpcomponents:httpcomponents-parent:12) in repository 'MavenRepo': Artifact was signed with key '6A814B1F869C2BBEAB7CB7271A2A1C94BDE89688' (Michael Osipov <mi...@apache.org>) and passed verification but the key isn't in your trusted keys list.
- On artifact jaxen-2.0.0.jar (jaxen:jaxen:2.0.0) in repository 'MavenRepo': Artifact was signed with key 'CA491704D613780D2BEE00F2C6FC46EB51CF569C' and passed verification but the key isn't in your trusted keys list.
- On artifact jaxen-2.0.0.pom (jaxen:jaxen:2.0.0) in repository 'MavenRepo': Artifact was signed with key 'CA491704D613780D2BEE00F2C6FC46EB51CF569C' and passed verification but the key isn't in your trusted keys list.
- On artifact jaxen-parent-2.0.0.pom (jaxen:jaxen-parent:2.0.0) in repository 'MavenRepo': Artifact was signed with key 'CA491704D613780D2BEE00F2C6FC46EB51CF569C' and passed verification but the key isn't in your trusted keys list.
- On artifact jcip-annotations-1.0-1.jar (com.github.stephenc.jcip:jcip-annotations:1.0-1) in repository 'MavenRepo': Artifact was signed with key '042B29E928995B9DB963C636C7CA19B7B620D787' (Stephen Connolly <st...@apache.org>) and passed verification but the key isn't in your trusted keys list.
- On artifact jcip-annotations-1.0-1.pom (com.github.stephenc.jcip:jcip-annotations:1.0-1) in repository 'MavenRepo': Artifact was signed with key '042B29E928995B9DB963C636C7CA19B7B620D787' (Stephen Connolly <st...@apache.org>) and passed verification but the key isn't in your trusted keys list.
- On artifact kubernetes-client-bom-5.12.4.pom (io.fabric8:kubernetes-client-bom:5.12.4) in repository 'MavenRepo': Artifact was signed with key 'A42FEF087AF29AE864684EAEE6039456D5BBD4F8' (FuseSource (CODE SIGNING KEY) <ad...@fusesource.com>) and passed verification but the key isn't in your trusted keys list.
- On artifact logging-parent-10.4.0.pom (org.apache.logging:logging-parent:10.4.0) in repository 'MavenRepo': Artifact was signed with key '077E8893A6DCC33DD4A4D5B256E73BA9A0B592D0' (ASF Logging Services RM <pr...@logging.apache.org>) and passed verification but the key isn't in your trusted keys list.
If the artifacts are trustworthy, you will need to update the gradle/verification-metadata.xml file. For more on how to do this, please refer to https://docs.gradle.org/8.14.3/userguide/dependency_verification.html#sec:troubleshooting-verification in the Gradle documentation.
These files failed verification:
- GRADLE_USER_HOME/caches/modules-2/files-2.1/com.github.stephenc.jcip/jcip-annotations/1.0-1/bdccebfbbbdd66fe56dcdf3bdee7b97a853cccc5/jcip-annotations-1.0-1.pom (signature: GRADLE_USER_HOME/caches/modules-2/files-2.1/com.github.stephenc.jcip/jcip-annotations/1.0-1/6384a3de49584e3859a4811ea1dd92a99eaf0b1b/jcip-annotations-1.0-1.pom.asc)
- GRADLE_USER_HOME/caches/modules-2/files-2.1/com.github.stephenc.jcip/jcip-annotations/1.0-1/ef31541dd28ae2cefdd17c7ebf352d93e9058c63/jcip-annotations-1.0-1.jar (signature: GRADLE_USER_HOME/caches/modules-2/files-2.1/com.github.stephenc.jcip/jcip-annotations/1.0-1/bceb3fe8c5ac3e9d87d673f03fc38acbcf6ed817/jcip-annotations-1.0-1.jar.asc)
- GRADLE_USER_HOME/caches/modules-2/files-2.1/commons-codec/commons-codec/1.15/49d94806b6e3dc933dacbd8acb0fdbab8ebd1e5d/commons-codec-1.15.jar (signature: GRADLE_USER_HOME/caches/modules-2/files-2.1/commons-codec/commons-codec/1.15/63c917b34ccf7d195e49d76dd79979ffc844abe0/commons-codec-1.15.jar.asc)
- GRADLE_USER_HOME/caches/modules-2/files-2.1/commons-codec/commons-codec/1.15/c08f2dcdbba1a9466f3f9fa05e669fd61c3a47b7/commons-codec-1.15.pom (signature: GRADLE_USER_HOME/caches/modules-2/files-2.1/commons-codec/commons-codec/1.15/bd0cde8cc4990a9f54654ef5308bbb4741f9e702/commons-codec-1.15.pom.asc)
- GRADLE_USER_HOME/caches/modules-2/files-2.1/io.fabric8/kubernetes-client-bom/5.12.4/e79360b6c85f975006571e2251496c9677a15d19/kubernetes-client-bom-5.12.4.pom (signature: GRADLE_USER_HOME/caches/modules-2/files-2.1/io.fabric8/kubernetes-client-bom/5.12.4/992ad37c7d9bd1c0cc13de68418efd4a96d71fd9/kubernetes-client-bom-5.12.4.pom.asc)
- GRADLE_USER_HOME/caches/modules-2/files-2.1/jaxen/jaxen-parent/2.0.0/d311145c4f8835088b86fb8446d725816b03bcca/jaxen-parent-2.0.0.pom (signature: GRADLE_USER_HOME/caches/modules-2/files-2.1/jaxen/jaxen-parent/2.0.0/3e6599ad1b73a0c262eb74a726204b2c171fa767/jaxen-parent-2.0.0.pom.asc)
- GRADLE_USER_HOME/caches/modules-2/files-2.1/jaxen/jaxen/2.0.0/81346e6db971f2ce5e6eb994fd112b9f91986ee/jaxen-2.0.0.pom (signature: GRADLE_USER_HOME/caches/modules-2/files-2.1/jaxen/jaxen/2.0.0/e4a6c2fd9be9809402cba48b050976ceacd0b6c6/jaxen-2.0.0.pom.asc)
- GRADLE_USER_HOME/caches/modules-2/files-2.1/jaxen/jaxen/2.0.0/bd6a33b0fda054a5678010df843cc999f288dc6c/jaxen-2.0.0.jar (signature: GRADLE_USER_HOME/caches/modules-2/files-2.1/jaxen/jaxen/2.0.0/d0ee7d76fdacd99ec3a80f73765d67f0fda6b553/jaxen-2.0.0.jar.asc)
- GRADLE_USER_HOME/caches/modules-2/files-2.1/org.apache.bcel/bcel/6.8.0/5a6d9b91286e8d8279d4f31fbc9ff26e5944653a/bcel-6.8.0.jar (signature: GRADLE_USER_HOME/caches/modules-2/files-2.1/org.apache.bcel/bcel/6.8.0/d07d863f91b79ad85e97c2d51c66d3f8818f038a/bcel-6.8.0.jar.asc)
- GRADLE_USER_HOME/caches/modules-2/files-2.1/org.apache.bcel/bcel/6.8.0/a75edb8dd0a01412a5baf706eec0befe9079f64d/bcel-6.8.0.pom (signature: GRADLE_USER_HOME/caches/modules-2/files-2.1/org.apache.bcel/bcel/6.8.0/f5ee08bea2a4fb53ef8f8e864edb4e1464709a69/bcel-6.8.0.pom.asc)
- GRADLE_USER_HOME/caches/modules-2/files-2.1/org.apache.httpcomponents/httpcomponents-parent/12/9b1f18cae11ff90a33fe14fcfa8234b5d16e22f1/httpcomponents-parent-12.pom (signature: GRADLE_USER_HOME/caches/modules-2/files-2.1/org.apache.httpcomponents/httpcomponents-parent/12/121f5bacae4ff1ecaa7ba23a1a634feb9b276fb9/httpcomponents-parent-12.pom.asc)
- GRADLE_USER_HOME/caches/modules-2/files-2.1/org.apache.logging/logging-parent/10.4.0/9bf2a0e4e2fac63d939fd6e1db8e77263a89aecf/logging-parent-10.4.0.pom (signature: GRADLE_USER_HOME/caches/modules-2/files-2.1/org.apache.logging/logging-parent/10.4.0/e976b94d3bdd03b125b794b4f9cb622d15e97c22/logging-parent-10.4.0.pom.asc)
- GRADLE_USER_HOME/caches/modules-2/files-2.1/org.codehaus.groovy/groovy-bom/3.0.19/206e6428672da27eb124ec3bdd7920830b9f6e58/groovy-bom-3.0.19.pom (signature: GRADLE_USER_HOME/caches/modules-2/files-2.1/org.codehaus.groovy/groovy-bom/3.0.19/eb5eba73367a2773a796eee2ca1df4afd0e6a8c8/groovy-bom-3.0.19.pom.asc)
- GRADLE_USER_HOME/caches/modules-2/files-2.1/org.dom4j/dom4j/2.1.4/35c16721b88cf17b8279fcb134c0abb161cc0e9b/dom4j-2.1.4.jar (signature: GRADLE_USER_HOME/caches/modules-2/files-2.1/org.dom4j/dom4j/2.1.4/9623153e0cc5ecba3c84ace4785a7900464ee86c/dom4j-2.1.4.jar.asc)
- GRADLE_USER_HOME/caches/modules-2/files-2.1/org.dom4j/dom4j/2.1.4/f3ea4c21f9b0e8357094a4804972aa33a62d6ef3/dom4j-2.1.4.module (signature: GRADLE_USER_HOME/caches/modules-2/files-2.1/org.dom4j/dom4j/2.1.4/4b29bab419201e02a37b21ad6e02a69600884f9f/dom4j-2.1.4.module.asc)
GRADLE_USER_HOME = /home/jenkins/.gradle
These files failed verification:
- GRADLE_USER_HOME/caches/modules-2/files-2.1/com.github.stephenc.jcip/jcip-annotations/1.0-1/bdccebfbbbdd66fe56dcdf3bdee7b97a853cccc5/jcip-annotations-1.0-1.pom (signature: GRADLE_USER_HOME/caches/modules-2/files-2.1/com.github.stephenc.jcip/jcip-annotations/1.0-1/6384a3de49584e3859a4811ea1dd92a99eaf0b1b/jcip-annotations-1.0-1.pom.asc)
- GRADLE_USER_HOME/caches/modules-2/files-2.1/com.github.stephenc.jcip/jcip-annotations/1.0-1/ef31541dd28ae2cefdd17c7ebf352d93e9058c63/jcip-annotations-1.0-1.jar (signature: GRADLE_USER_HOME/caches/modules-2/files-2.1/com.github.stephenc.jcip/jcip-annotations/1.0-1/bceb3fe8c5ac3e9d87d673f03fc38acbcf6ed817/jcip-annotations-1.0-1.jar.asc)
- GRADLE_USER_HOME/caches/modules-2/files-2.1/commons-codec/commons-codec/1.15/49d94806b6e3dc933dacbd8acb0fdbab8ebd1e5d/commons-codec-1.15.jar (signature: GRADLE_USER_HOME/caches/modules-2/files-2.1/commons-codec/commons-codec/1.15/63c917b34ccf7d195e49d76dd79979ffc844abe0/commons-codec-1.15.jar.asc)
- GRADLE_USER_HOME/caches/modules-2/files-2.1/commons-codec/commons-codec/1.15/c08f2dcdbba1a9466f3f9fa05e669fd61c3a47b7/commons-codec-1.15.pom (signature: GRADLE_USER_HOME/caches/modules-2/files-2.1/commons-codec/commons-codec/1.15/bd0cde8cc4990a9f54654ef5308bbb4741f9e702/commons-codec-1.15.pom.asc)
- GRADLE_USER_HOME/caches/modules-2/files-2.1/io.fabric8/kubernetes-client-bom/5.12.4/e79360b6c85f975006571e2251496c9677a15d19/kubernetes-client-bom-5.12.4.pom (signature: GRADLE_USER_HOME/caches/modules-2/files-2.1/io.fabric8/kubernetes-client-bom/5.12.4/992ad37c7d9bd1c0cc13de68418efd4a96d71fd9/kubernetes-client-bom-5.12.4.pom.asc)
- GRADLE_USER_HOME/caches/modules-2/files-2.1/jaxen/jaxen-parent/2.0.0/d311145c4f8835088b86fb8446d725816b03bcca/jaxen-parent-2.0.0.pom (signature: GRADLE_USER_HOME/caches/modules-2/files-2.1/jaxen/jaxen-parent/2.0.0/3e6599ad1b73a0c262eb74a726204b2c171fa767/jaxen-parent-2.0.0.pom.asc)
- GRADLE_USER_HOME/caches/modules-2/files-2.1/jaxen/jaxen/2.0.0/81346e6db971f2ce5e6eb994fd112b9f91986ee/jaxen-2.0.0.pom (signature: GRADLE_USER_HOME/caches/modules-2/files-2.1/jaxen/jaxen/2.0.0/e4a6c2fd9be9809402cba48b050976ceacd0b6c6/jaxen-2.0.0.pom.asc)
- GRADLE_USER_HOME/caches/modules-2/files-2.1/jaxen/jaxen/2.0.0/bd6a33b0fda054a5678010df843cc999f288dc6c/jaxen-2.0.0.jar (signature: GRADLE_USER_HOME/caches/modules-2/files-2.1/jaxen/jaxen/2.0.0/d0ee7d76fdacd99ec3a80f73765d67f0fda6b553/jaxen-2.0.0.jar.asc)
- GRADLE_USER_HOME/caches/modules-2/files-2.1/org.apache.bcel/bcel/6.8.0/5a6d9b91286e8d8279d4f31fbc9ff26e5944653a/bcel-6.8.0.jar (signature: GRADLE_USER_HOME/caches/modules-2/files-2.1/org.apache.bcel/bcel/6.8.0/d07d863f91b79ad85e97c2d51c66d3f8818f038a/bcel-6.8.0.jar.asc)
- GRADLE_USER_HOME/caches/modules-2/files-2.1/org.apache.bcel/bcel/6.8.0/a75edb8dd0a01412a5baf706eec0befe9079f64d/bcel-6.8.0.pom (signature: GRADLE_USER_HOME/caches/modules-2/files-2.1/org.apache.bcel/bcel/6.8.0/f5ee08bea2a4fb53ef8f8e864edb4e1464709a69/bcel-6.8.0.pom.asc)
- GRADLE_USER_HOME/caches/modules-2/files-2.1/org.apache.httpcomponents/httpcomponents-parent/12/9b1f18cae11ff90a33fe14fcfa8234b5d16e22f1/httpcomponents-parent-12.pom (signature: GRADLE_USER_HOME/caches/modules-2/files-2.1/org.apache.httpcomponents/httpcomponents-parent/12/121f5bacae4ff1ecaa7ba23a1a634feb9b276fb9/httpcomponents-parent-12.pom.asc)
- GRADLE_USER_HOME/caches/modules-2/files-2.1/org.apache.logging/logging-parent/10.4.0/9bf2a0e4e2fac63d939fd6e1db8e77263a89aecf/logging-parent-10.4.0.pom (signature: GRADLE_USER_HOME/caches/modules-2/files-2.1/org.apache.logging/logging-parent/10.4.0/e976b94d3bdd03b125b794b4f9cb622d15e97c22/logging-parent-10.4.0.pom.asc)
- GRADLE_USER_HOME/caches/modules-2/files-2.1/org.codehaus.groovy/groovy-bom/3.0.19/206e6428672da27eb124ec3bdd7920830b9f6e58/groovy-bom-3.0.19.pom (signature: GRADLE_USER_HOME/caches/modules-2/files-2.1/org.codehaus.groovy/groovy-bom/3.0.19/eb5eba73367a2773a796eee2ca1df4afd0e6a8c8/groovy-bom-3.0.19.pom.asc)
- GRADLE_USER_HOME/caches/modules-2/files-2.1/org.dom4j/dom4j/2.1.4/35c16721b88cf17b8279fcb134c0abb161cc0e9b/dom4j-2.1.4.jar (signature: GRADLE_USER_HOME/caches/modules-2/files-2.1/org.dom4j/dom4j/2.1.4/9623153e0cc5ecba3c84ace4785a7900464ee86c/dom4j-2.1.4.jar.asc)
- GRADLE_USER_HOME/caches/modules-2/files-2.1/org.dom4j/dom4j/2.1.4/f3ea4c21f9b0e8357094a4804972aa33a62d6ef3/dom4j-2.1.4.module (signature: GRADLE_USER_HOME/caches/modules-2/files-2.1/org.dom4j/dom4j/2.1.4/4b29bab419201e02a37b21ad6e02a69600884f9f/dom4j-2.1.4.module.asc)
GRADLE_USER_HOME = /home/jenkins/.gradle
Open this report for more details: file://<https://ci-builds.apache.org/job/JMeter/job/JMeter-trunk/ws/build/reports/dependency-verification/at-1762934177597/dependency-verification-report.html>
* Try:
> Run with --stacktrace option to get the stack trace.
> Run with --info or --debug option to get more log output.
> Get more help at https://help.gradle.org.
==============================================================================
Deprecated Gradle features were used in this build, making it incompatible with Gradle 9.0.
You can use '--warning-mode all' to show the individual deprecation warnings and determine if they come from your own scripts or plugins.
For more on this, please refer to https://docs.gradle.org/8.14.3/userguide/command_line_interface.html#sec:command_line_warnings in the Gradle documentation.
BUILD FAILED in 9m 2s
393 actionable tasks: 238 executed, 155 up-to-date
See the profiling report at: file://<https://ci-builds.apache.org/job/JMeter/job/JMeter-trunk/ws/build/reports/profile/profile-2025-11-12-07-56-27.html>
A fine-grained performance profile is available: use the --scan option.
Build step 'Invoke Gradle script' changed build result to FAILURE
Build step 'Invoke Gradle script' marked build as failure
Xvfb stopping
Archiving artifacts
Recording test results
[Checks API] No suitable checks publisher found.
Build failed in Jenkins: JMeter » JMeter-trunk #1004
Posted by Apache Jenkins Server <je...@builds.apache.org>.
See <https://ci-builds.apache.org/job/JMeter/job/JMeter-trunk/1004/display/redirect>
Changes:
------------------------------------------
Started by an SCM change
Running as SYSTEM
[EnvInject] - Loading node environment variables.
Building remotely on builds59 (ubuntu ubuntu-avx) in workspace <https://ci-builds.apache.org/job/JMeter/job/JMeter-trunk/ws/>
[WS-CLEANUP] Deleting project workspace...
[WS-CLEANUP] Done
The recommended git tool is: NONE
No credentials specified
> git rev-parse --resolve-git-dir <https://ci-builds.apache.org/job/JMeter/job/JMeter-trunk/ws/.git> # timeout=10
Fetching changes from the remote Git repository
> git config remote.origin.url https://github.com/apache/jmeter.git # timeout=10
Fetching upstream changes from https://github.com/apache/jmeter.git
> git --version # timeout=10
> git --version # 'git version 2.34.1'
> git fetch --tags --force --progress -- https://github.com/apache/jmeter.git +refs/heads/*:refs/remotes/origin/* # timeout=10
ERROR: Error fetching remote repo 'origin'
hudson.plugins.git.GitException: Failed to fetch from https://github.com/apache/jmeter.git
at PluginClassLoader for git//hudson.plugins.git.GitSCM.fetchFrom(GitSCM.java:997)
at PluginClassLoader for git//hudson.plugins.git.GitSCM.retrieveChanges(GitSCM.java:1239)
at PluginClassLoader for git//hudson.plugins.git.GitSCM._checkout(GitSCM.java:1310)
at PluginClassLoader for git//hudson.plugins.git.GitSCM.checkout(GitSCM.java:1277)
at hudson.scm.SCM.checkout(SCM.java:540)
at hudson.model.AbstractProject.checkout(AbstractProject.java:1250)
at hudson.model.AbstractBuild$AbstractBuildExecution.defaultCheckout(AbstractBuild.java:649)
at jenkins.scm.SCMCheckoutStrategy.checkout(SCMCheckoutStrategy.java:85)
at hudson.model.AbstractBuild$AbstractBuildExecution.run(AbstractBuild.java:522)
at hudson.model.Run.execute(Run.java:1833)
at hudson.model.FreeStyleBuild.run(FreeStyleBuild.java:44)
at hudson.model.ResourceController.execute(ResourceController.java:101)
at hudson.model.Executor.run(Executor.java:446)
Caused by: hudson.plugins.git.GitException: Command "git fetch --tags --force --progress -- https://github.com/apache/jmeter.git +refs/heads/*:refs/remotes/origin/*" returned status code 128:
stdout:
stderr: remote: Enumerating objects: 68770, done.
remote: Counting objects: 0% (1/4339) remote: Counting objects: 1% (44/4339) remote: Counting objects: 2% (87/4339) remote: Counting objects: 3% (131/4339) remote: Counting objects: 4% (174/4339) remote: Counting objects: 5% (217/4339) remote: Counting objects: 6% (261/4339) remote: Counting objects: 7% (304/4339) remote: Counting objects: 8% (348/4339) remote: Counting objects: 9% (391/4339) remote: Counting objects: 10% (434/4339) remote: Counting objects: 11% (478/4339) remote: Counting objects: 12% (521/4339) remote: Counting objects: 13% (565/4339) remote: Counting objects: 14% (608/4339) remote: Counting objects: 15% (651/4339) remote: Counting objects: 16% (695/4339) remote: Counting objects: 17% (738/4339) remote: Counting objects: 18% (782/4339) remote: Counting objects: 19% (825/4339) remote: Counting objects: 20% (868/4339) remote: Counting objects: 21% (912/4339) remote: Counting objects: 22% (955/4339) remote: Counting objects: 23% (998/4339) remote: Counting objects: 24% (1042/4339) remote: Counting objects: 25% (1085/4339) remote: Counting objects: 26% (1129/4339) remote: Counting objects: 27% (1172/4339) remote: Counting objects: 28% (1215/4339) remote: Counting objects: 29% (1259/4339) remote: Counting objects: 30% (1302/4339) remote: Counting objects: 31% (1346/4339) remote: Counting objects: 32% (1389/4339) remote: Counting objects: 33% (1432/4339) remote: Counting objects: 34% (1476/4339) remote: Counting objects: 35% (1519/4339) remote: Counting objects: 36% (1563/4339) remote: Counting objects: 37% (1606/4339) remote: Counting objects: 38% (1649/4339) remote: Counting objects: 39% (1693/4339) remote: Counting objects: 40% (1736/4339) remote: Counting objects: 41% (1779/4339) remote: Counting objects: 42% (1823/4339) remote: Counting objects: 43% (1866/4339) remote: Counting objects: 44% (1910/4339) remote: Counting objects: 45% (1953/4339) remote: Counting objects: 46% (1996/4339) remote: Counting objects: 47% (2040/4339) remote: Counting objects: 48% (2083/4339) remote: Counting objects: 49% (2127/4339) remote: Counting objects: 50% (2170/4339) remote: Counting objects: 51% (2213/4339) remote: Counting objects: 52% (2257/4339) remote: Counting objects: 53% (2300/4339) remote: Counting objects: 54% (2344/4339) remote: Counting objects: 55% (2387/4339) remote: Counting objects: 56% (2430/4339) remote: Counting objects: 57% (2474/4339) remote: Counting objects: 58% (2517/4339) remote: Counting objects: 59% (2561/4339) remote: Counting objects: 60% (2604/4339) remote: Counting objects: 61% (2647/4339) remote: Counting objects: 62% (2691/4339) remote: Counting objects: 63% (2734/4339) remote: Counting objects: 64% (2777/4339) remote: Counting objects: 65% (2821/4339) remote: Counting objects: 66% (2864/4339) remote: Counting objects: 67% (2908/4339) remote: Counting objects: 68% (2951/4339) remote: Counting objects: 69% (2994/4339) remote: Counting objects: 70% (3038/4339) remote: Counting objects: 71% (3081/4339) remote: Counting objects: 72% (3125/4339) remote: Counting objects: 73% (3168/4339) remote: Counting objects: 74% (3211/4339) remote: Counting objects: 75% (3255/4339) remote: Counting objects: 76% (3298/4339) remote: Counting objects: 77% (3342/4339) remote: Counting objects: 78% (3385/4339) remote: Counting objects: 79% (3428/4339) remote: Counting objects: 80% (3472/4339) remote: Counting objects: 81% (3515/4339) remote: Counting objects: 82% (3558/4339) remote: Counting objects: 83% (3602/4339) remote: Counting objects: 84% (3645/4339) remote: Counting objects: 85% (3689/4339) remote: Counting objects: 86% (3732/4339) remote: Counting objects: 87% (3775/4339) remote: Counting objects: 88% (3819/4339) remote: Counting objects: 89% (3862/4339) remote: Counting objects: 90% (3906/4339) remote: Counting objects: 91% (3949/4339) remote: Counting objects: 92% (3992/4339) remote: Counting objects: 93% (4036/4339) remote: Counting objects: 94% (4079/4339) remote: Counting objects: 95% (4123/4339) remote: Counting objects: 96% (4166/4339) remote: Counting objects: 97% (4209/4339) remote: Counting objects: 98% (4253/4339) remote: Counting objects: 99% (4296/4339) remote: Counting objects: 100% (4339/4339) remote: Counting objects: 100% (4339/4339), done.
remote: Compressing objects: 0% (1/224) remote: Compressing objects: 1% (3/224) remote: Compressing objects: 2% (5/224) remote: Compressing objects: 3% (7/224) remote: Compressing objects: 4% (9/224) remote: Compressing objects: 5% (12/224) remote: Compressing objects: 6% (14/224) remote: Compressing objects: 7% (16/224) remote: Compressing objects: 8% (18/224) remote: Compressing objects: 9% (21/224) remote: Compressing objects: 10% (23/224) remote: Compressing objects: 11% (25/224) remote: Compressing objects: 12% (27/224) remote: Compressing objects: 13% (30/224) remote: Compressing objects: 14% (32/224) remote: Compressing objects: 15% (34/224) remote: Compressing objects: 16% (36/224) remote: Compressing objects: 17% (39/224) remote: Compressing objects: 18% (41/224) remote: Compressing objects: 19% (43/224) remote: Compressing objects: 20% (45/224) remote: Compressing objects: 21% (48/224) remote: Compressing objects: 22% (50/224) remote: Compressing objects: 23% (52/224) remote: Compressing objects: 24% (54/224) remote: Compressing objects: 25% (56/224) remote: Compressing objects: 26% (59/224) remote: Compressing objects: 27% (61/224) remote: Compressing objects: 28% (63/224) remote: Compressing objects: 29% (65/224) remote: Compressing objects: 30% (68/224) remote: Compressing objects: 31% (70/224) remote: Compressing objects: 32% (72/224) remote: Compressing objects: 33% (74/224) remote: Compressing objects: 34% (77/224) remote: Compressing objects: 35% (79/224) remote: Compressing objects: 36% (81/224) remote: Compressing objects: 37% (83/224) remote: Compressing objects: 38% (86/224) remote: Compressing objects: 39% (88/224) remote: Compressing objects: 40% (90/224) remote: Compressing objects: 41% (92/224) remote: Compressing objects: 42% (95/224) remote: Compressing objects: 43% (97/224) remote: Compressing objects: 44% (99/224) remote: Compressing objects: 45% (101/224) remote: Compressing objects: 46% (104/224) remote: Compressing objects: 47% (106/224) remote: Compressing objects: 48% (108/224) remote: Compressing objects: 49% (110/224) remote: Compressing objects: 50% (112/224) remote: Compressing objects: 51% (115/224) remote: Compressing objects: 52% (117/224) remote: Compressing objects: 53% (119/224) remote: Compressing objects: 54% (121/224) remote: Compressing objects: 55% (124/224) remote: Compressing objects: 56% (126/224) remote: Compressing objects: 57% (128/224) remote: Compressing objects: 58% (130/224) remote: Compressing objects: 59% (133/224) remote: Compressing objects: 60% (135/224) remote: Compressing objects: 61% (137/224) remote: Compressing objects: 62% (139/224) remote: Compressing objects: 63% (142/224) remote: Compressing objects: 64% (144/224) remote: Compressing objects: 65% (146/224) remote: Compressing objects: 66% (148/224) remote: Compressing objects: 67% (151/224) remote: Compressing objects: 68% (153/224) remote: Compressing objects: 69% (155/224) remote: Compressing objects: 70% (157/224) remote: Compressing objects: 71% (160/224) remote: Compressing objects: 72% (162/224) remote: Compressing objects: 73% (164/224) remote: Compressing objects: 74% (166/224) remote: Compressing objects: 75% (168/224) remote: Compressing objects: 76% (171/224) remote: Compressing objects: 77% (173/224) remote: Compressing objects: 78% (175/224) remote: Compressing objects: 79% (177/224) remote: Compressing objects: 80% (180/224) remote: Compressing objects: 81% (182/224) remote: Compressing objects: 82% (184/224) remote: Compressing objects: 83% (186/224) remote: Compressing objects: 84% (189/224) remote: Compressing objects: 85% (191/224) remote: Compressing objects: 86% (193/224) remote: Compressing objects: 87% (195/224) remote: Compressing objects: 88% (198/224) remote: Compressing objects: 89% (200/224) remote: Compressing objects: 90% (202/224) remote: Compressing objects: 91% (204/224) remote: Compressing objects: 92% (207/224) remote: Compressing objects: 93% (209/224) remote: Compressing objects: 94% (211/224) remote: Compressing objects: 95% (213/224) remote: Compressing objects: 96% (216/224) remote: Compressing objects: 97% (218/224) remote: Compressing objects: 98% (220/224) remote: Compressing objects: 99% (222/224) remote: Compressing objects: 100% (224/224) remote: Compressing objects: 100% (224/224), done.
Receiving objects: 0% (1/68770)Receiving objects: 1% (688/68770)Receiving objects: 2% (1376/68770)Receiving objects: 3% (2064/68770)Receiving objects: 4% (2751/68770)Receiving objects: 5% (3439/68770)Receiving objects: 6% (4127/68770)Receiving objects: 7% (4814/68770)Receiving objects: 8% (5502/68770)Receiving objects: 9% (6190/68770)Receiving objects: 10% (6877/68770)Receiving objects: 11% (7565/68770)Receiving objects: 12% (8253/68770)Receiving objects: 13% (8941/68770)Receiving objects: 14% (9628/68770)Receiving objects: 15% (10316/68770)Receiving objects: 16% (11004/68770)Receiving objects: 17% (11691/68770)Receiving objects: 18% (12379/68770), 16.09 MiB | 32.18 MiB/sReceiving objects: 19% (13067/68770), 16.09 MiB | 32.18 MiB/sReceiving objects: 20% (13754/68770), 16.09 MiB | 32.18 MiB/sReceiving objects: 21% (14442/68770), 16.09 MiB | 32.18 MiB/sReceiving objects: 21% (14758/68770), 36.55 MiB | 36.54 MiB/sReceiving objects: 22% (15130/68770), 36.55 MiB | 36.54 MiB/sReceiving objects: 23% (15818/68770), 36.55 MiB | 36.54 MiB/sReceiving objects: 24% (16505/68770), 36.55 MiB | 36.54 MiB/sReceiving objects: 25% (17193/68770), 36.55 MiB | 36.54 MiB/sReceiving objects: 26% (17881/68770), 36.55 MiB | 36.54 MiB/sReceiving objects: 27% (18568/68770), 36.55 MiB | 36.54 MiB/sReceiving objects: 28% (19256/68770), 36.55 MiB | 36.54 MiB/sReceiving objects: 29% (19944/68770), 36.55 MiB | 36.54 MiB/sReceiving objects: 30% (20631/68770), 36.55 MiB | 36.54 MiB/sReceiving objects: 31% (21319/68770), 36.55 MiB | 36.54 MiB/sReceiving objects: 32% (22007/68770), 36.55 MiB | 36.54 MiB/sReceiving objects: 33% (22695/68770), 36.55 MiB | 36.54 MiB/sReceiving objects: 34% (23382/68770), 36.55 MiB | 36.54 MiB/sReceiving objects: 35% (24070/68770), 36.55 MiB | 36.54 MiB/sReceiving objects: 36% (24758/68770), 36.55 MiB | 36.54 MiB/sReceiving objects: 37% (25445/68770), 36.55 MiB | 36.54 MiB/sReceiving objects: 38% (26133/68770), 36.55 MiB | 36.54 MiB/sReceiving objects: 39% (26821/68770), 36.55 MiB | 36.54 MiB/sReceiving objects: 40% (27508/68770), 36.55 MiB | 36.54 MiB/sReceiving objects: 41% (28196/68770), 36.55 MiB | 36.54 MiB/sReceiving objects: 42% (28884/68770), 36.55 MiB | 36.54 MiB/sReceiving objects: 43% (29572/68770), 36.55 MiB | 36.54 MiB/sReceiving objects: 44% (30259/68770), 36.55 MiB | 36.54 MiB/sReceiving objects: 45% (30947/68770), 36.55 MiB | 36.54 MiB/sReceiving objects: 46% (31635/68770), 36.55 MiB | 36.54 MiB/sReceiving objects: 47% (32322/68770), 36.55 MiB | 36.54 MiB/sReceiving objects: 48% (33010/68770), 36.55 MiB | 36.54 MiB/sReceiving objects: 49% (33698/68770), 36.55 MiB | 36.54 MiB/sReceiving objects: 50% (34385/68770), 36.55 MiB | 36.54 MiB/sReceiving objects: 51% (35073/68770), 36.55 MiB | 36.54 MiB/sReceiving objects: 52% (35761/68770), 36.55 MiB | 36.54 MiB/sReceiving objects: 53% (36449/68770), 36.55 MiB | 36.54 MiB/sReceiving objects: 54% (37136/68770), 36.55 MiB | 36.54 MiB/sReceiving objects: 55% (37824/68770), 36.55 MiB | 36.54 MiB/sReceiving objects: 56% (38512/68770), 36.55 MiB | 36.54 MiB/sReceiving objects: 57% (39199/68770), 36.55 MiB | 36.54 MiB/sReceiving objects: 58% (39887/68770), 36.55 MiB | 36.54 MiB/sReceiving objects: 59% (40575/68770), 36.55 MiB | 36.54 MiB/sReceiving objects: 60% (41262/68770), 36.55 MiB | 36.54 MiB/sReceiving objects: 61% (41950/68770), 36.55 MiB | 36.54 MiB/sReceiving objects: 62% (42638/68770), 36.55 MiB | 36.54 MiB/sReceiving objects: 63% (43326/68770), 36.55 MiB | 36.54 MiB/sReceiving objects: 64% (44013/68770), 36.55 MiB | 36.54 MiB/sReceiving objects: 65% (44701/68770), 36.55 MiB | 36.54 MiB/sReceiving objects: 66% (45389/68770), 36.55 MiB | 36.54 MiB/sReceiving objects: 67% (46076/68770), 36.55 MiB | 36.54 MiB/sReceiving objects: 68% (46764/68770), 36.55 MiB | 36.54 MiB/sReceiving objects: 69% (47452/68770), 36.55 MiB | 36.54 MiB/sReceiving objects: 70% (48139/68770), 36.55 MiB | 36.54 MiB/sReceiving objects: 71% (48827/68770), 36.55 MiB | 36.54 MiB/sReceiving objects: 72% (49515/68770), 36.55 MiB | 36.54 MiB/sReceiving objects: 73% (50203/68770), 36.55 MiB | 36.54 MiB/sReceiving objects: 74% (50890/68770), 36.55 MiB | 36.54 MiB/sReceiving objects: 75% (51578/68770), 36.55 MiB | 36.54 MiB/sReceiving objects: 76% (52266/68770), 36.55 MiB | 36.54 MiB/sReceiving objects: 77% (52953/68770), 36.55 MiB | 36.54 MiB/sReceiving objects: 78% (53641/68770), 36.55 MiB | 36.54 MiB/sReceiving objects: 79% (54329/68770), 36.55 MiB | 36.54 MiB/sReceiving objects: 80% (55016/68770), 36.55 MiB | 36.54 MiB/sReceiving objects: 81% (55704/68770), 36.55 MiB | 36.54 MiB/sReceiving objects: 82% (56392/68770), 36.55 MiB | 36.54 MiB/sReceiving objects: 83% (57080/68770), 36.55 MiB | 36.54 MiB/sReceiving objects: 84% (57767/68770), 36.55 MiB | 36.54 MiB/sReceiving objects: 85% (58455/68770), 36.55 MiB | 36.54 MiB/sReceiving objects: 86% (59143/68770), 36.55 MiB | 36.54 MiB/sReceiving objects: 87% (59830/68770), 36.55 MiB | 36.54 MiB/sReceiving objects: 88% (60518/68770), 36.55 MiB | 36.54 MiB/sReceiving objects: 89% (61206/68770), 36.55 MiB | 36.54 MiB/sReceiving objects: 90% (61893/68770), 36.55 MiB | 36.54 MiB/sReceiving objects: 91% (62581/68770), 65.16 MiB | 43.44 MiB/sReceiving objects: 92% (63269/68770), 65.16 MiB | 43.44 MiB/sReceiving objects: 93% (63957/68770), 65.16 MiB | 43.44 MiB/sReceiving objects: 94% (64644/68770), 65.16 MiB | 43.44 MiB/sReceiving objects: 95% (65332/68770), 65.16 MiB | 43.44 MiB/sReceiving objects: 96% (66020/68770), 65.16 MiB | 43.44 MiB/sReceiving objects: 97% (66707/68770), 65.16 MiB | 43.44 MiB/sReceiving objects: 98% (67395/68770), 65.16 MiB | 43.44 MiB/sReceiving objects: 99% (68083/68770), 65.16 MiB | 43.44 MiB/sremote: Total 68770 (delta 4155), reused 4115 (delta 4115), pack-reused 64431 (from 3)
Receiving objects: 100% (68770/68770), 65.16 MiB | 43.44 MiB/sReceiving objects: 100% (68770/68770), 68.87 MiB | 43.11 MiB/s, done.
Resolving deltas: 0% (0/40449)Resolving deltas: 1% (405/40449)Resolving deltas: 2% (809/40449)Resolving deltas: 3% (1214/40449)Resolving deltas: 4% (1618/40449)Resolving deltas: 5% (2023/40449)Resolving deltas: 6% (2427/40449)Resolving deltas: 7% (2832/40449)Resolving deltas: 8% (3236/40449)Resolving deltas: 9% (3641/40449)Resolving deltas: 10% (4045/40449)Resolving deltas: 11% (4450/40449)Resolving deltas: 12% (4854/40449)Resolving deltas: 13% (5259/40449)Resolving deltas: 14% (5665/40449)Resolving deltas: 15% (6068/40449)Resolving deltas: 16% (6472/40449)Resolving deltas: 17% (6877/40449)Resolving deltas: 18% (7281/40449)Resolving deltas: 19% (7686/40449)Resolving deltas: 20% (8090/40449)Resolving deltas: 21% (8495/40449)Resolving deltas: 22% (8899/40449)Resolving deltas: 23% (9304/40449)Resolving deltas: 24% (9708/40449)Resolving deltas: 25% (10113/40449)Resolving deltas: 26% (10517/40449)Resolving deltas: 27% (10922/40449)Resolving deltas: 28% (11326/40449)Resolving deltas: 29% (11731/40449)Resolving deltas: 30% (12135/40449)Resolving deltas: 31% (12540/40449)Resolving deltas: 32% (12944/40449)Resolving deltas: 33% (13352/40449)Resolving deltas: 34% (13754/40449)Resolving deltas: 35% (14158/40449)Resolving deltas: 36% (14562/40449)Resolving deltas: 37% (14968/40449)Resolving deltas: 38% (15371/40449)Resolving deltas: 39% (15776/40449)Resolving deltas: 40% (16181/40449)Resolving deltas: 41% (16585/40449)Resolving deltas: 42% (16989/40449)Resolving deltas: 43% (17394/40449)Resolving deltas: 44% (17799/40449)Resolving deltas: 45% (18203/40449)Resolving deltas: 46% (18607/40449)Resolving deltas: 47% (19013/40449)Resolving deltas: 48% (19416/40449)Resolving deltas: 49% (19821/40449)Resolving deltas: 50% (20225/40449)Resolving deltas: 51% (20631/40449)Resolving deltas: 52% (21034/40449)Resolving deltas: 53% (21438/40449)Resolving deltas: 54% (21843/40449)Resolving deltas: 55% (22247/40449)Resolving deltas: 56% (22652/40449)Resolving deltas: 57% (23058/40449)Resolving deltas: 58% (23461/40449)Resolving deltas: 59% (23865/40449)Resolving deltas: 60% (24270/40449)Resolving deltas: 61% (24674/40449)Resolving deltas: 62% (25079/40449)Resolving deltas: 63% (25483/40449)Resolving deltas: 64% (25888/40449)Resolving deltas: 65% (26292/40449)Resolving deltas: 66% (26697/40449)Resolving deltas: 67% (27101/40449)Resolving deltas: 68% (27506/40449)Resolving deltas: 69% (27910/40449)Resolving deltas: 70% (28315/40449)Resolving deltas: 71% (28719/40449)Resolving deltas: 72% (29124/40449)Resolving deltas: 73% (29528/40449)Resolving deltas: 74% (29933/40449)Resolving deltas: 75% (30341/40449)Resolving deltas: 76% (30743/40449)Resolving deltas: 77% (31146/40449)Resolving deltas: 78% (31553/40449)Resolving deltas: 79% (31955/40449)Resolving deltas: 80% (32361/40449)Resolving deltas: 81% (32766/40449)Resolving deltas: 82% (33169/40449)Resolving deltas: 83% (33574/40449)Resolving deltas: 84% (33978/40449)Resolving deltas: 85% (34385/40449)Resolving deltas: 86% (34787/40449)Resolving deltas: 87% (35192/40449)Resolving deltas: 88% (35597/40449)Resolving deltas: 89% (36000/40449)Resolving deltas: 90% (36405/40449)Resolving deltas: 90% (36644/40449), completed with 96 local objects.
fatal: pack has 3805 unresolved deltas
fatal: fetch-pack: invalid index-pack output
at PluginClassLoader for git-client//org.jenkinsci.plugins.gitclient.CliGitAPIImpl.launchCommandIn(CliGitAPIImpl.java:2848)
at PluginClassLoader for git-client//org.jenkinsci.plugins.gitclient.CliGitAPIImpl.launchCommandWithCredentials(CliGitAPIImpl.java:2184)
at PluginClassLoader for git-client//org.jenkinsci.plugins.gitclient.CliGitAPIImpl$1.execute(CliGitAPIImpl.java:635)
at PluginClassLoader for git-client//org.jenkinsci.plugins.gitclient.RemoteGitImpl$CommandInvocationHandler$GitCommandMasterToSlaveCallable.call(RemoteGitImpl.java:170)
at PluginClassLoader for git-client//org.jenkinsci.plugins.gitclient.RemoteGitImpl$CommandInvocationHandler$GitCommandMasterToSlaveCallable.call(RemoteGitImpl.java:161)
at hudson.remoting.UserRequest.perform(UserRequest.java:225)
at hudson.remoting.UserRequest.perform(UserRequest.java:50)
at hudson.remoting.Request$2.run(Request.java:391)
at hudson.remoting.InterceptingExecutorService.lambda$wrap$0(InterceptingExecutorService.java:81)
at java.base/java.util.concurrent.FutureTask.run(FutureTask.java:264)
at java.base/java.util.concurrent.ThreadPoolExecutor.runWorker(ThreadPoolExecutor.java:1136)
at java.base/java.util.concurrent.ThreadPoolExecutor$Worker.run(ThreadPoolExecutor.java:635)
at java.base/java.lang.Thread.run(Thread.java:840)
Suppressed: hudson.remoting.Channel$CallSiteStackTrace: Remote call to builds59
at hudson.remoting.Channel.attachCallSiteStackTrace(Channel.java:1923)
at hudson.remoting.UserRequest$ExceptionResponse.retrieve(UserRequest.java:384)
at hudson.remoting.Channel.call(Channel.java:1112)
at PluginClassLoader for git-client//org.jenkinsci.plugins.gitclient.RemoteGitImpl$CommandInvocationHandler.execute(RemoteGitImpl.java:153)
at jdk.internal.reflect.GeneratedMethodAccessor1122.invoke(Unknown Source)
at java.base/jdk.internal.reflect.DelegatingMethodAccessorImpl.invoke(DelegatingMethodAccessorImpl.java:43)
at java.base/java.lang.reflect.Method.invoke(Method.java:569)
at PluginClassLoader for git-client//org.jenkinsci.plugins.gitclient.RemoteGitImpl$CommandInvocationHandler.invoke(RemoteGitImpl.java:138)
at PluginClassLoader for git-client/jdk.proxy119/jdk.proxy119.$Proxy247.execute(Unknown Source)
at PluginClassLoader for git//hudson.plugins.git.GitSCM.fetchFrom(GitSCM.java:995)
at PluginClassLoader for git//hudson.plugins.git.GitSCM.retrieveChanges(GitSCM.java:1239)
at PluginClassLoader for git//hudson.plugins.git.GitSCM._checkout(GitSCM.java:1310)
at PluginClassLoader for git//hudson.plugins.git.GitSCM.checkout(GitSCM.java:1277)
at hudson.scm.SCM.checkout(SCM.java:540)
at hudson.model.AbstractProject.checkout(AbstractProject.java:1250)
at hudson.model.AbstractBuild$AbstractBuildExecution.defaultCheckout(AbstractBuild.java:649)
at jenkins.scm.SCMCheckoutStrategy.checkout(SCMCheckoutStrategy.java:85)
at hudson.model.AbstractBuild$AbstractBuildExecution.run(AbstractBuild.java:522)
at hudson.model.Run.execute(Run.java:1833)
at hudson.model.FreeStyleBuild.run(FreeStyleBuild.java:44)
at hudson.model.ResourceController.execute(ResourceController.java:101)
at hudson.model.Executor.run(Executor.java:446)
ERROR: Error fetching remote repo 'origin'
Archiving artifacts
Recording test results
[Checks API] No suitable checks publisher found.
Build failed in Jenkins: JMeter » JMeter-trunk #1003
Posted by Apache Jenkins Server <je...@builds.apache.org>.
See <https://ci-builds.apache.org/job/JMeter/job/JMeter-trunk/1003/display/redirect>
Changes:
------------------------------------------
Started by GitHub push by vlsi
Started by GitHub push by vlsi
Running as SYSTEM
[EnvInject] - Loading node environment variables.
Building remotely on builds59 (ubuntu ubuntu-avx) in workspace <https://ci-builds.apache.org/job/JMeter/job/JMeter-trunk/ws/>
[WS-CLEANUP] Deleting project workspace...
[WS-CLEANUP] Done
The recommended git tool is: NONE
No credentials specified
> git rev-parse --resolve-git-dir <https://ci-builds.apache.org/job/JMeter/job/JMeter-trunk/ws/.git> # timeout=10
Fetching changes from the remote Git repository
> git config remote.origin.url https://github.com/apache/jmeter.git # timeout=10
Fetching upstream changes from https://github.com/apache/jmeter.git
> git --version # timeout=10
> git --version # 'git version 2.34.1'
> git fetch --tags --force --progress -- https://github.com/apache/jmeter.git +refs/heads/*:refs/remotes/origin/* # timeout=10
ERROR: Error fetching remote repo 'origin'
hudson.plugins.git.GitException: Failed to fetch from https://github.com/apache/jmeter.git
at PluginClassLoader for git//hudson.plugins.git.GitSCM.fetchFrom(GitSCM.java:997)
at PluginClassLoader for git//hudson.plugins.git.GitSCM.retrieveChanges(GitSCM.java:1239)
at PluginClassLoader for git//hudson.plugins.git.GitSCM._checkout(GitSCM.java:1310)
at PluginClassLoader for git//hudson.plugins.git.GitSCM.checkout(GitSCM.java:1277)
at hudson.scm.SCM.checkout(SCM.java:540)
at hudson.model.AbstractProject.checkout(AbstractProject.java:1250)
at hudson.model.AbstractBuild$AbstractBuildExecution.defaultCheckout(AbstractBuild.java:649)
at jenkins.scm.SCMCheckoutStrategy.checkout(SCMCheckoutStrategy.java:85)
at hudson.model.AbstractBuild$AbstractBuildExecution.run(AbstractBuild.java:522)
at hudson.model.Run.execute(Run.java:1833)
at hudson.model.FreeStyleBuild.run(FreeStyleBuild.java:44)
at hudson.model.ResourceController.execute(ResourceController.java:101)
at hudson.model.Executor.run(Executor.java:446)
Caused by: hudson.plugins.git.GitException: Command "git fetch --tags --force --progress -- https://github.com/apache/jmeter.git +refs/heads/*:refs/remotes/origin/*" returned status code 128:
stdout:
stderr: remote: Enumerating objects: 68770, done.
remote: Counting objects: 0% (1/4443) remote: Counting objects: 1% (45/4443) remote: Counting objects: 2% (89/4443) remote: Counting objects: 3% (134/4443) remote: Counting objects: 4% (178/4443) remote: Counting objects: 5% (223/4443) remote: Counting objects: 6% (267/4443) remote: Counting objects: 7% (312/4443) remote: Counting objects: 8% (356/4443) remote: Counting objects: 9% (400/4443) remote: Counting objects: 10% (445/4443) remote: Counting objects: 11% (489/4443) remote: Counting objects: 12% (534/4443) remote: Counting objects: 13% (578/4443) remote: Counting objects: 14% (623/4443) remote: Counting objects: 15% (667/4443) remote: Counting objects: 16% (711/4443) remote: Counting objects: 17% (756/4443) remote: Counting objects: 18% (800/4443) remote: Counting objects: 19% (845/4443) remote: Counting objects: 20% (889/4443) remote: Counting objects: 21% (934/4443) remote: Counting objects: 22% (978/4443) remote: Counting objects: 23% (1022/4443) remote: Counting objects: 24% (1067/4443) remote: Counting objects: 25% (1111/4443) remote: Counting objects: 26% (1156/4443) remote: Counting objects: 27% (1200/4443) remote: Counting objects: 28% (1245/4443) remote: Counting objects: 29% (1289/4443) remote: Counting objects: 30% (1333/4443) remote: Counting objects: 31% (1378/4443) remote: Counting objects: 32% (1422/4443) remote: Counting objects: 33% (1467/4443) remote: Counting objects: 34% (1511/4443) remote: Counting objects: 35% (1556/4443) remote: Counting objects: 36% (1600/4443) remote: Counting objects: 37% (1644/4443) remote: Counting objects: 38% (1689/4443) remote: Counting objects: 39% (1733/4443) remote: Counting objects: 40% (1778/4443) remote: Counting objects: 41% (1822/4443) remote: Counting objects: 42% (1867/4443) remote: Counting objects: 43% (1911/4443) remote: Counting objects: 44% (1955/4443) remote: Counting objects: 45% (2000/4443) remote: Counting objects: 46% (2044/4443) remote: Counting objects: 47% (2089/4443) remote: Counting objects: 48% (2133/4443) remote: Counting objects: 49% (2178/4443) remote: Counting objects: 50% (2222/4443) remote: Counting objects: 51% (2266/4443) remote: Counting objects: 52% (2311/4443) remote: Counting objects: 53% (2355/4443) remote: Counting objects: 54% (2400/4443) remote: Counting objects: 55% (2444/4443) remote: Counting objects: 56% (2489/4443) remote: Counting objects: 57% (2533/4443) remote: Counting objects: 58% (2577/4443) remote: Counting objects: 59% (2622/4443) remote: Counting objects: 60% (2666/4443) remote: Counting objects: 61% (2711/4443) remote: Counting objects: 62% (2755/4443) remote: Counting objects: 63% (2800/4443) remote: Counting objects: 64% (2844/4443) remote: Counting objects: 65% (2888/4443) remote: Counting objects: 66% (2933/4443) remote: Counting objects: 67% (2977/4443) remote: Counting objects: 68% (3022/4443) remote: Counting objects: 69% (3066/4443) remote: Counting objects: 70% (3111/4443) remote: Counting objects: 71% (3155/4443) remote: Counting objects: 72% (3199/4443) remote: Counting objects: 73% (3244/4443) remote: Counting objects: 74% (3288/4443) remote: Counting objects: 75% (3333/4443) remote: Counting objects: 76% (3377/4443) remote: Counting objects: 77% (3422/4443) remote: Counting objects: 78% (3466/4443) remote: Counting objects: 79% (3510/4443) remote: Counting objects: 80% (3555/4443) remote: Counting objects: 81% (3599/4443) remote: Counting objects: 82% (3644/4443) remote: Counting objects: 83% (3688/4443) remote: Counting objects: 84% (3733/4443) remote: Counting objects: 85% (3777/4443) remote: Counting objects: 86% (3821/4443) remote: Counting objects: 87% (3866/4443) remote: Counting objects: 88% (3910/4443) remote: Counting objects: 89% (3955/4443) remote: Counting objects: 90% (3999/4443) remote: Counting objects: 91% (4044/4443) remote: Counting objects: 92% (4088/4443) remote: Counting objects: 93% (4132/4443) remote: Counting objects: 94% (4177/4443) remote: Counting objects: 95% (4221/4443) remote: Counting objects: 96% (4266/4443) remote: Counting objects: 97% (4310/4443) remote: Counting objects: 98% (4355/4443) remote: Counting objects: 99% (4399/4443) remote: Counting objects: 100% (4443/4443) remote: Counting objects: 100% (4443/4443), done.
remote: Compressing objects: 0% (1/271) remote: Compressing objects: 1% (3/271) remote: Compressing objects: 2% (6/271) remote: Compressing objects: 3% (9/271) remote: Compressing objects: 4% (11/271) remote: Compressing objects: 5% (14/271) remote: Compressing objects: 6% (17/271) remote: Compressing objects: 7% (19/271) remote: Compressing objects: 8% (22/271) remote: Compressing objects: 9% (25/271) remote: Compressing objects: 10% (28/271) remote: Compressing objects: 11% (30/271) remote: Compressing objects: 12% (33/271) remote: Compressing objects: 13% (36/271) remote: Compressing objects: 14% (38/271) remote: Compressing objects: 15% (41/271) remote: Compressing objects: 16% (44/271) remote: Compressing objects: 17% (47/271) remote: Compressing objects: 18% (49/271) remote: Compressing objects: 19% (52/271) remote: Compressing objects: 20% (55/271) remote: Compressing objects: 21% (57/271) remote: Compressing objects: 22% (60/271) remote: Compressing objects: 23% (63/271) remote: Compressing objects: 24% (66/271) remote: Compressing objects: 25% (68/271) remote: Compressing objects: 26% (71/271) remote: Compressing objects: 27% (74/271) remote: Compressing objects: 28% (76/271) remote: Compressing objects: 29% (79/271) remote: Compressing objects: 30% (82/271) remote: Compressing objects: 31% (85/271) remote: Compressing objects: 32% (87/271) remote: Compressing objects: 33% (90/271) remote: Compressing objects: 34% (93/271) remote: Compressing objects: 35% (95/271) remote: Compressing objects: 36% (98/271) remote: Compressing objects: 37% (101/271) remote: Compressing objects: 38% (103/271) remote: Compressing objects: 39% (106/271) remote: Compressing objects: 40% (109/271) remote: Compressing objects: 41% (112/271) remote: Compressing objects: 42% (114/271) remote: Compressing objects: 43% (117/271) remote: Compressing objects: 44% (120/271) remote: Compressing objects: 45% (122/271) remote: Compressing objects: 46% (125/271) remote: Compressing objects: 47% (128/271) remote: Compressing objects: 48% (131/271) remote: Compressing objects: 49% (133/271) remote: Compressing objects: 50% (136/271) remote: Compressing objects: 51% (139/271) remote: Compressing objects: 52% (141/271) remote: Compressing objects: 53% (144/271) remote: Compressing objects: 54% (147/271) remote: Compressing objects: 55% (150/271) remote: Compressing objects: 56% (152/271) remote: Compressing objects: 57% (155/271) remote: Compressing objects: 58% (158/271) remote: Compressing objects: 59% (160/271) remote: Compressing objects: 60% (163/271) remote: Compressing objects: 61% (166/271) remote: Compressing objects: 62% (169/271) remote: Compressing objects: 63% (171/271) remote: Compressing objects: 64% (174/271) remote: Compressing objects: 65% (177/271) remote: Compressing objects: 66% (179/271) remote: Compressing objects: 67% (182/271) remote: Compressing objects: 68% (185/271) remote: Compressing objects: 69% (187/271) remote: Compressing objects: 70% (190/271) remote: Compressing objects: 71% (193/271) remote: Compressing objects: 72% (196/271) remote: Compressing objects: 73% (198/271) remote: Compressing objects: 74% (201/271) remote: Compressing objects: 75% (204/271) remote: Compressing objects: 76% (206/271) remote: Compressing objects: 77% (209/271) remote: Compressing objects: 78% (212/271) remote: Compressing objects: 79% (215/271) remote: Compressing objects: 80% (217/271) remote: Compressing objects: 81% (220/271) remote: Compressing objects: 82% (223/271) remote: Compressing objects: 83% (225/271) remote: Compressing objects: 84% (228/271) remote: Compressing objects: 85% (231/271) remote: Compressing objects: 86% (234/271) remote: Compressing objects: 87% (236/271) remote: Compressing objects: 88% (239/271) remote: Compressing objects: 89% (242/271) remote: Compressing objects: 90% (244/271) remote: Compressing objects: 91% (247/271) remote: Compressing objects: 92% (250/271) remote: Compressing objects: 93% (253/271) remote: Compressing objects: 94% (255/271) remote: Compressing objects: 95% (258/271) remote: Compressing objects: 96% (261/271) remote: Compressing objects: 97% (263/271) remote: Compressing objects: 98% (266/271) remote: Compressing objects: 99% (269/271) remote: Compressing objects: 100% (271/271) remote: Compressing objects: 100% (271/271), done.
Receiving objects: 0% (1/68770)Receiving objects: 1% (688/68770)Receiving objects: 2% (1376/68770)Receiving objects: 3% (2064/68770)Receiving objects: 4% (2751/68770)Receiving objects: 5% (3439/68770)Receiving objects: 6% (4127/68770)Receiving objects: 7% (4814/68770)Receiving objects: 8% (5502/68770)Receiving objects: 9% (6190/68770)Receiving objects: 10% (6877/68770)Receiving objects: 11% (7565/68770)Receiving objects: 12% (8253/68770)Receiving objects: 13% (8941/68770)Receiving objects: 14% (9628/68770)Receiving objects: 15% (10316/68770)Receiving objects: 16% (11004/68770)Receiving objects: 17% (11691/68770)Receiving objects: 18% (12379/68770)Receiving objects: 19% (13067/68770), 18.43 MiB | 36.85 MiB/sReceiving objects: 20% (13754/68770), 18.43 MiB | 36.85 MiB/sReceiving objects: 21% (14442/68770), 18.43 MiB | 36.85 MiB/sReceiving objects: 22% (15130/68770), 18.43 MiB | 36.85 MiB/sReceiving objects: 23% (15818/68770), 18.43 MiB | 36.85 MiB/sReceiving objects: 23% (16088/68770), 42.30 MiB | 42.30 MiB/sReceiving objects: 24% (16505/68770), 42.30 MiB | 42.30 MiB/sReceiving objects: 25% (17193/68770), 42.30 MiB | 42.30 MiB/sReceiving objects: 26% (17881/68770), 42.30 MiB | 42.30 MiB/sReceiving objects: 27% (18568/68770), 42.30 MiB | 42.30 MiB/sReceiving objects: 28% (19256/68770), 42.30 MiB | 42.30 MiB/sReceiving objects: 29% (19944/68770), 42.30 MiB | 42.30 MiB/sReceiving objects: 30% (20631/68770), 42.30 MiB | 42.30 MiB/sReceiving objects: 31% (21319/68770), 42.30 MiB | 42.30 MiB/sReceiving objects: 32% (22007/68770), 42.30 MiB | 42.30 MiB/sReceiving objects: 33% (22695/68770), 42.30 MiB | 42.30 MiB/sReceiving objects: 34% (23382/68770), 42.30 MiB | 42.30 MiB/sReceiving objects: 35% (24070/68770), 42.30 MiB | 42.30 MiB/sReceiving objects: 36% (24758/68770), 42.30 MiB | 42.30 MiB/sReceiving objects: 37% (25445/68770), 42.30 MiB | 42.30 MiB/sReceiving objects: 38% (26133/68770), 42.30 MiB | 42.30 MiB/sReceiving objects: 39% (26821/68770), 42.30 MiB | 42.30 MiB/sReceiving objects: 40% (27508/68770), 42.30 MiB | 42.30 MiB/sReceiving objects: 41% (28196/68770), 42.30 MiB | 42.30 MiB/sReceiving objects: 42% (28884/68770), 42.30 MiB | 42.30 MiB/sReceiving objects: 43% (29572/68770), 42.30 MiB | 42.30 MiB/sReceiving objects: 44% (30259/68770), 42.30 MiB | 42.30 MiB/sReceiving objects: 45% (30947/68770), 42.30 MiB | 42.30 MiB/sReceiving objects: 46% (31635/68770), 42.30 MiB | 42.30 MiB/sReceiving objects: 47% (32322/68770), 42.30 MiB | 42.30 MiB/sReceiving objects: 48% (33010/68770), 42.30 MiB | 42.30 MiB/sReceiving objects: 49% (33698/68770), 42.30 MiB | 42.30 MiB/sReceiving objects: 50% (34385/68770), 42.30 MiB | 42.30 MiB/sReceiving objects: 51% (35073/68770), 42.30 MiB | 42.30 MiB/sReceiving objects: 52% (35761/68770), 42.30 MiB | 42.30 MiB/sReceiving objects: 53% (36449/68770), 42.30 MiB | 42.30 MiB/sReceiving objects: 54% (37136/68770), 42.30 MiB | 42.30 MiB/sReceiving objects: 55% (37824/68770), 42.30 MiB | 42.30 MiB/sReceiving objects: 56% (38512/68770), 42.30 MiB | 42.30 MiB/sReceiving objects: 57% (39199/68770), 42.30 MiB | 42.30 MiB/sReceiving objects: 58% (39887/68770), 42.30 MiB | 42.30 MiB/sReceiving objects: 59% (40575/68770), 42.30 MiB | 42.30 MiB/sReceiving objects: 60% (41262/68770), 42.30 MiB | 42.30 MiB/sReceiving objects: 61% (41950/68770), 42.30 MiB | 42.30 MiB/sReceiving objects: 62% (42638/68770), 42.30 MiB | 42.30 MiB/sReceiving objects: 63% (43326/68770), 42.30 MiB | 42.30 MiB/sReceiving objects: 64% (44013/68770), 42.30 MiB | 42.30 MiB/sReceiving objects: 65% (44701/68770), 42.30 MiB | 42.30 MiB/sReceiving objects: 66% (45389/68770), 42.30 MiB | 42.30 MiB/sReceiving objects: 67% (46076/68770), 42.30 MiB | 42.30 MiB/sReceiving objects: 68% (46764/68770), 42.30 MiB | 42.30 MiB/sReceiving objects: 69% (47452/68770), 42.30 MiB | 42.30 MiB/sReceiving objects: 70% (48139/68770), 42.30 MiB | 42.30 MiB/sReceiving objects: 71% (48827/68770), 42.30 MiB | 42.30 MiB/sReceiving objects: 72% (49515/68770), 42.30 MiB | 42.30 MiB/sReceiving objects: 73% (50203/68770), 42.30 MiB | 42.30 MiB/sReceiving objects: 74% (50890/68770), 42.30 MiB | 42.30 MiB/sReceiving objects: 75% (51578/68770), 42.30 MiB | 42.30 MiB/sReceiving objects: 76% (52266/68770), 42.30 MiB | 42.30 MiB/sReceiving objects: 77% (52953/68770), 42.30 MiB | 42.30 MiB/sReceiving objects: 78% (53641/68770), 42.30 MiB | 42.30 MiB/sReceiving objects: 79% (54329/68770), 42.30 MiB | 42.30 MiB/sReceiving objects: 80% (55016/68770), 42.30 MiB | 42.30 MiB/sReceiving objects: 81% (55704/68770), 42.30 MiB | 42.30 MiB/sReceiving objects: 82% (56392/68770), 42.30 MiB | 42.30 MiB/sReceiving objects: 83% (57080/68770), 42.30 MiB | 42.30 MiB/sReceiving objects: 84% (57767/68770), 42.30 MiB | 42.30 MiB/sReceiving objects: 85% (58455/68770), 42.30 MiB | 42.30 MiB/sReceiving objects: 86% (59143/68770), 42.30 MiB | 42.30 MiB/sReceiving objects: 87% (59830/68770), 42.30 MiB | 42.30 MiB/sReceiving objects: 88% (60518/68770), 42.30 MiB | 42.30 MiB/sReceiving objects: 89% (61206/68770), 42.30 MiB | 42.30 MiB/sReceiving objects: 90% (61893/68770), 42.30 MiB | 42.30 MiB/sReceiving objects: 91% (62581/68770), 42.30 MiB | 42.30 MiB/sReceiving objects: 92% (63269/68770), 42.30 MiB | 42.30 MiB/sReceiving objects: 93% (63957/68770), 42.30 MiB | 42.30 MiB/sReceiving objects: 94% (64644/68770), 42.30 MiB | 42.30 MiB/sReceiving objects: 95% (65332/68770), 42.30 MiB | 42.30 MiB/sReceiving objects: 96% (66020/68770), 67.58 MiB | 45.05 MiB/sReceiving objects: 97% (66707/68770), 67.58 MiB | 45.05 MiB/sReceiving objects: 98% (67395/68770), 67.58 MiB | 45.05 MiB/sReceiving objects: 99% (68083/68770), 67.58 MiB | 45.05 MiB/sremote: Total 68770 (delta 4195), reused 4198 (delta 4150), pack-reused 64327 (from 3)
Receiving objects: 100% (68770/68770), 67.58 MiB | 45.05 MiB/sReceiving objects: 100% (68770/68770), 68.87 MiB | 44.92 MiB/s, done.
Resolving deltas: 0% (0/40472)Resolving deltas: 1% (405/40472)Resolving deltas: 2% (810/40472)Resolving deltas: 3% (1215/40472)Resolving deltas: 4% (1619/40472)Resolving deltas: 5% (2024/40472)Resolving deltas: 6% (2429/40472)Resolving deltas: 7% (2834/40472)Resolving deltas: 8% (3238/40472)Resolving deltas: 9% (3643/40472)Resolving deltas: 10% (4048/40472)Resolving deltas: 11% (4452/40472)Resolving deltas: 12% (4857/40472)Resolving deltas: 13% (5262/40472)Resolving deltas: 14% (5667/40472)Resolving deltas: 15% (6071/40472)Resolving deltas: 16% (6476/40472)Resolving deltas: 17% (6881/40472)Resolving deltas: 18% (7285/40472)Resolving deltas: 19% (7690/40472)Resolving deltas: 20% (8095/40472)Resolving deltas: 21% (8500/40472)Resolving deltas: 22% (8904/40472)Resolving deltas: 23% (9309/40472)Resolving deltas: 24% (9714/40472)Resolving deltas: 25% (10118/40472)Resolving deltas: 26% (10523/40472)Resolving deltas: 27% (10928/40472)Resolving deltas: 28% (11333/40472)Resolving deltas: 29% (11737/40472)Resolving deltas: 30% (12142/40472)Resolving deltas: 31% (12547/40472)Resolving deltas: 32% (12952/40472)Resolving deltas: 33% (13356/40472)Resolving deltas: 34% (13761/40472)Resolving deltas: 35% (14166/40472)Resolving deltas: 36% (14570/40472)Resolving deltas: 37% (14975/40472)Resolving deltas: 38% (15380/40472)Resolving deltas: 39% (15785/40472)Resolving deltas: 40% (16189/40472)Resolving deltas: 41% (16595/40472)Resolving deltas: 42% (16999/40472)Resolving deltas: 43% (17403/40472)Resolving deltas: 44% (17809/40472)Resolving deltas: 45% (18214/40472)Resolving deltas: 46% (18618/40472)Resolving deltas: 47% (19022/40472)Resolving deltas: 48% (19427/40472)Resolving deltas: 49% (19832/40472)Resolving deltas: 50% (20237/40472)Resolving deltas: 51% (20641/40472)Resolving deltas: 52% (21048/40472)Resolving deltas: 53% (21451/40472)Resolving deltas: 54% (21855/40472)Resolving deltas: 55% (22260/40472)Resolving deltas: 56% (22665/40472)Resolving deltas: 57% (23070/40472)Resolving deltas: 58% (23474/40472)Resolving deltas: 59% (23879/40472)Resolving deltas: 60% (24284/40472)Resolving deltas: 61% (24688/40472)Resolving deltas: 62% (25093/40472)Resolving deltas: 63% (25498/40472)Resolving deltas: 64% (25903/40472)Resolving deltas: 65% (26308/40472)Resolving deltas: 66% (26712/40472)Resolving deltas: 67% (27117/40472)Resolving deltas: 68% (27521/40472)Resolving deltas: 69% (27926/40472)Resolving deltas: 70% (28332/40472)Resolving deltas: 71% (28736/40472)Resolving deltas: 72% (29140/40472)Resolving deltas: 73% (29545/40472)Resolving deltas: 74% (29950/40472)Resolving deltas: 75% (30354/40472)Resolving deltas: 76% (30759/40472)Resolving deltas: 77% (31164/40472)Resolving deltas: 78% (31571/40472)Resolving deltas: 79% (31973/40472)Resolving deltas: 80% (32378/40472)Resolving deltas: 81% (32783/40472)Resolving deltas: 82% (33188/40472)Resolving deltas: 83% (33592/40472)Resolving deltas: 84% (33997/40472)Resolving deltas: 85% (34403/40472)Resolving deltas: 86% (34806/40472)Resolving deltas: 87% (35211/40472)Resolving deltas: 88% (35617/40472)Resolving deltas: 89% (36021/40472)Resolving deltas: 90% (36425/40472)Resolving deltas: 90% (36666/40472), completed with 124 local objects.
fatal: pack has 3806 unresolved deltas
fatal: fetch-pack: invalid index-pack output
at PluginClassLoader for git-client//org.jenkinsci.plugins.gitclient.CliGitAPIImpl.launchCommandIn(CliGitAPIImpl.java:2848)
at PluginClassLoader for git-client//org.jenkinsci.plugins.gitclient.CliGitAPIImpl.launchCommandWithCredentials(CliGitAPIImpl.java:2184)
at PluginClassLoader for git-client//org.jenkinsci.plugins.gitclient.CliGitAPIImpl$1.execute(CliGitAPIImpl.java:635)
at PluginClassLoader for git-client//org.jenkinsci.plugins.gitclient.RemoteGitImpl$CommandInvocationHandler$GitCommandMasterToSlaveCallable.call(RemoteGitImpl.java:170)
at PluginClassLoader for git-client//org.jenkinsci.plugins.gitclient.RemoteGitImpl$CommandInvocationHandler$GitCommandMasterToSlaveCallable.call(RemoteGitImpl.java:161)
at hudson.remoting.UserRequest.perform(UserRequest.java:225)
at hudson.remoting.UserRequest.perform(UserRequest.java:50)
at hudson.remoting.Request$2.run(Request.java:391)
at hudson.remoting.InterceptingExecutorService.lambda$wrap$0(InterceptingExecutorService.java:81)
at java.base/java.util.concurrent.FutureTask.run(FutureTask.java:264)
at java.base/java.util.concurrent.ThreadPoolExecutor.runWorker(ThreadPoolExecutor.java:1136)
at java.base/java.util.concurrent.ThreadPoolExecutor$Worker.run(ThreadPoolExecutor.java:635)
at java.base/java.lang.Thread.run(Thread.java:840)
Suppressed: hudson.remoting.Channel$CallSiteStackTrace: Remote call to builds59
at hudson.remoting.Channel.attachCallSiteStackTrace(Channel.java:1923)
at hudson.remoting.UserRequest$ExceptionResponse.retrieve(UserRequest.java:384)
at hudson.remoting.Channel.call(Channel.java:1112)
at PluginClassLoader for git-client//org.jenkinsci.plugins.gitclient.RemoteGitImpl$CommandInvocationHandler.execute(RemoteGitImpl.java:153)
at jdk.internal.reflect.GeneratedMethodAccessor1122.invoke(Unknown Source)
at java.base/jdk.internal.reflect.DelegatingMethodAccessorImpl.invoke(DelegatingMethodAccessorImpl.java:43)
at java.base/java.lang.reflect.Method.invoke(Method.java:569)
at PluginClassLoader for git-client//org.jenkinsci.plugins.gitclient.RemoteGitImpl$CommandInvocationHandler.invoke(RemoteGitImpl.java:138)
at PluginClassLoader for git-client/jdk.proxy119/jdk.proxy119.$Proxy247.execute(Unknown Source)
at PluginClassLoader for git//hudson.plugins.git.GitSCM.fetchFrom(GitSCM.java:995)
at PluginClassLoader for git//hudson.plugins.git.GitSCM.retrieveChanges(GitSCM.java:1239)
at PluginClassLoader for git//hudson.plugins.git.GitSCM._checkout(GitSCM.java:1310)
at PluginClassLoader for git//hudson.plugins.git.GitSCM.checkout(GitSCM.java:1277)
at hudson.scm.SCM.checkout(SCM.java:540)
at hudson.model.AbstractProject.checkout(AbstractProject.java:1250)
at hudson.model.AbstractBuild$AbstractBuildExecution.defaultCheckout(AbstractBuild.java:649)
at jenkins.scm.SCMCheckoutStrategy.checkout(SCMCheckoutStrategy.java:85)
at hudson.model.AbstractBuild$AbstractBuildExecution.run(AbstractBuild.java:522)
at hudson.model.Run.execute(Run.java:1833)
at hudson.model.FreeStyleBuild.run(FreeStyleBuild.java:44)
at hudson.model.ResourceController.execute(ResourceController.java:101)
at hudson.model.Executor.run(Executor.java:446)
ERROR: Error fetching remote repo 'origin'
Archiving artifacts
Recording test results
[Checks API] No suitable checks publisher found.
Build failed in Jenkins: JMeter » JMeter-trunk #1002
Posted by Apache Jenkins Server <je...@builds.apache.org>.
See <https://ci-builds.apache.org/job/JMeter/job/JMeter-trunk/1002/display/redirect>
Changes:
------------------------------------------
Started by an SCM change
Running as SYSTEM
[EnvInject] - Loading node environment variables.
Building remotely on builds59 (ubuntu ubuntu-avx) in workspace <https://ci-builds.apache.org/job/JMeter/job/JMeter-trunk/ws/>
[WS-CLEANUP] Deleting project workspace...
[WS-CLEANUP] Done
The recommended git tool is: NONE
No credentials specified
> git rev-parse --resolve-git-dir <https://ci-builds.apache.org/job/JMeter/job/JMeter-trunk/ws/.git> # timeout=10
Fetching changes from the remote Git repository
> git config remote.origin.url https://github.com/apache/jmeter.git # timeout=10
Fetching upstream changes from https://github.com/apache/jmeter.git
> git --version # timeout=10
> git --version # 'git version 2.34.1'
> git fetch --tags --force --progress -- https://github.com/apache/jmeter.git +refs/heads/*:refs/remotes/origin/* # timeout=10
ERROR: Error fetching remote repo 'origin'
hudson.plugins.git.GitException: Failed to fetch from https://github.com/apache/jmeter.git
at PluginClassLoader for git//hudson.plugins.git.GitSCM.fetchFrom(GitSCM.java:997)
at PluginClassLoader for git//hudson.plugins.git.GitSCM.retrieveChanges(GitSCM.java:1239)
at PluginClassLoader for git//hudson.plugins.git.GitSCM._checkout(GitSCM.java:1310)
at PluginClassLoader for git//hudson.plugins.git.GitSCM.checkout(GitSCM.java:1277)
at hudson.scm.SCM.checkout(SCM.java:540)
at hudson.model.AbstractProject.checkout(AbstractProject.java:1250)
at hudson.model.AbstractBuild$AbstractBuildExecution.defaultCheckout(AbstractBuild.java:649)
at jenkins.scm.SCMCheckoutStrategy.checkout(SCMCheckoutStrategy.java:85)
at hudson.model.AbstractBuild$AbstractBuildExecution.run(AbstractBuild.java:522)
at hudson.model.Run.execute(Run.java:1833)
at hudson.model.FreeStyleBuild.run(FreeStyleBuild.java:44)
at hudson.model.ResourceController.execute(ResourceController.java:101)
at hudson.model.Executor.run(Executor.java:446)
Caused by: hudson.plugins.git.GitException: Command "git fetch --tags --force --progress -- https://github.com/apache/jmeter.git +refs/heads/*:refs/remotes/origin/*" returned status code 128:
stdout:
stderr: remote: Enumerating objects: 68740, done.
remote: Counting objects: 0% (1/4481) remote: Counting objects: 1% (45/4481) remote: Counting objects: 2% (90/4481) remote: Counting objects: 3% (135/4481) remote: Counting objects: 4% (180/4481) remote: Counting objects: 5% (225/4481) remote: Counting objects: 6% (269/4481) remote: Counting objects: 7% (314/4481) remote: Counting objects: 8% (359/4481) remote: Counting objects: 9% (404/4481) remote: Counting objects: 10% (449/4481) remote: Counting objects: 11% (493/4481) remote: Counting objects: 12% (538/4481) remote: Counting objects: 13% (583/4481) remote: Counting objects: 14% (628/4481) remote: Counting objects: 15% (673/4481) remote: Counting objects: 16% (717/4481) remote: Counting objects: 17% (762/4481) remote: Counting objects: 18% (807/4481) remote: Counting objects: 19% (852/4481) remote: Counting objects: 20% (897/4481) remote: Counting objects: 21% (942/4481) remote: Counting objects: 22% (986/4481) remote: Counting objects: 23% (1031/4481) remote: Counting objects: 24% (1076/4481) remote: Counting objects: 25% (1121/4481) remote: Counting objects: 26% (1166/4481) remote: Counting objects: 27% (1210/4481) remote: Counting objects: 28% (1255/4481) remote: Counting objects: 29% (1300/4481) remote: Counting objects: 30% (1345/4481) remote: Counting objects: 31% (1390/4481) remote: Counting objects: 32% (1434/4481) remote: Counting objects: 33% (1479/4481) remote: Counting objects: 34% (1524/4481) remote: Counting objects: 35% (1569/4481) remote: Counting objects: 36% (1614/4481) remote: Counting objects: 37% (1658/4481) remote: Counting objects: 38% (1703/4481) remote: Counting objects: 39% (1748/4481) remote: Counting objects: 40% (1793/4481) remote: Counting objects: 41% (1838/4481) remote: Counting objects: 42% (1883/4481) remote: Counting objects: 43% (1927/4481) remote: Counting objects: 44% (1972/4481) remote: Counting objects: 45% (2017/4481) remote: Counting objects: 46% (2062/4481) remote: Counting objects: 47% (2107/4481) remote: Counting objects: 48% (2151/4481) remote: Counting objects: 49% (2196/4481) remote: Counting objects: 50% (2241/4481) remote: Counting objects: 51% (2286/4481) remote: Counting objects: 52% (2331/4481) remote: Counting objects: 53% (2375/4481) remote: Counting objects: 54% (2420/4481) remote: Counting objects: 55% (2465/4481) remote: Counting objects: 56% (2510/4481) remote: Counting objects: 57% (2555/4481) remote: Counting objects: 58% (2599/4481) remote: Counting objects: 59% (2644/4481) remote: Counting objects: 60% (2689/4481) remote: Counting objects: 61% (2734/4481) remote: Counting objects: 62% (2779/4481) remote: Counting objects: 63% (2824/4481) remote: Counting objects: 64% (2868/4481) remote: Counting objects: 65% (2913/4481) remote: Counting objects: 66% (2958/4481) remote: Counting objects: 67% (3003/4481) remote: Counting objects: 68% (3048/4481) remote: Counting objects: 69% (3092/4481) remote: Counting objects: 70% (3137/4481) remote: Counting objects: 71% (3182/4481) remote: Counting objects: 72% (3227/4481) remote: Counting objects: 73% (3272/4481) remote: Counting objects: 74% (3316/4481) remote: Counting objects: 75% (3361/4481) remote: Counting objects: 76% (3406/4481) remote: Counting objects: 77% (3451/4481) remote: Counting objects: 78% (3496/4481) remote: Counting objects: 79% (3540/4481) remote: Counting objects: 80% (3585/4481) remote: Counting objects: 81% (3630/4481) remote: Counting objects: 82% (3675/4481) remote: Counting objects: 83% (3720/4481) remote: Counting objects: 84% (3765/4481) remote: Counting objects: 85% (3809/4481) remote: Counting objects: 86% (3854/4481) remote: Counting objects: 87% (3899/4481) remote: Counting objects: 88% (3944/4481) remote: Counting objects: 89% (3989/4481) remote: Counting objects: 90% (4033/4481) remote: Counting objects: 91% (4078/4481) remote: Counting objects: 92% (4123/4481) remote: Counting objects: 93% (4168/4481) remote: Counting objects: 94% (4213/4481) remote: Counting objects: 95% (4257/4481) remote: Counting objects: 96% (4302/4481) remote: Counting objects: 97% (4347/4481) remote: Counting objects: 98% (4392/4481) remote: Counting objects: 99% (4437/4481) remote: Counting objects: 100% (4481/4481) remote: Counting objects: 100% (4481/4481), done.
remote: Compressing objects: 0% (1/254) remote: Compressing objects: 1% (3/254) remote: Compressing objects: 2% (6/254) remote: Compressing objects: 3% (8/254) remote: Compressing objects: 4% (11/254) remote: Compressing objects: 5% (13/254) remote: Compressing objects: 6% (16/254) remote: Compressing objects: 7% (18/254) remote: Compressing objects: 8% (21/254) remote: Compressing objects: 9% (23/254) remote: Compressing objects: 10% (26/254) remote: Compressing objects: 11% (28/254) remote: Compressing objects: 12% (31/254) remote: Compressing objects: 13% (34/254) remote: Compressing objects: 14% (36/254) remote: Compressing objects: 15% (39/254) remote: Compressing objects: 16% (41/254) remote: Compressing objects: 17% (44/254) remote: Compressing objects: 18% (46/254) remote: Compressing objects: 19% (49/254) remote: Compressing objects: 20% (51/254) remote: Compressing objects: 21% (54/254) remote: Compressing objects: 22% (56/254) remote: Compressing objects: 23% (59/254) remote: Compressing objects: 24% (61/254) remote: Compressing objects: 25% (64/254) remote: Compressing objects: 26% (67/254) remote: Compressing objects: 27% (69/254) remote: Compressing objects: 28% (72/254) remote: Compressing objects: 29% (74/254) remote: Compressing objects: 30% (77/254) remote: Compressing objects: 31% (79/254) remote: Compressing objects: 32% (82/254) remote: Compressing objects: 33% (84/254) remote: Compressing objects: 34% (87/254) remote: Compressing objects: 35% (89/254) remote: Compressing objects: 36% (92/254) remote: Compressing objects: 37% (94/254) remote: Compressing objects: 38% (97/254) remote: Compressing objects: 39% (100/254) remote: Compressing objects: 40% (102/254) remote: Compressing objects: 41% (105/254) remote: Compressing objects: 42% (107/254) remote: Compressing objects: 43% (110/254) remote: Compressing objects: 44% (112/254) remote: Compressing objects: 45% (115/254) remote: Compressing objects: 46% (117/254) remote: Compressing objects: 47% (120/254) remote: Compressing objects: 48% (122/254) remote: Compressing objects: 49% (125/254) remote: Compressing objects: 50% (127/254) remote: Compressing objects: 51% (130/254) remote: Compressing objects: 52% (133/254) remote: Compressing objects: 53% (135/254) remote: Compressing objects: 54% (138/254) remote: Compressing objects: 55% (140/254) remote: Compressing objects: 56% (143/254) remote: Compressing objects: 57% (145/254) remote: Compressing objects: 58% (148/254) remote: Compressing objects: 59% (150/254) remote: Compressing objects: 60% (153/254) remote: Compressing objects: 61% (155/254) remote: Compressing objects: 62% (158/254) remote: Compressing objects: 63% (161/254) remote: Compressing objects: 64% (163/254) remote: Compressing objects: 65% (166/254) remote: Compressing objects: 66% (168/254) remote: Compressing objects: 67% (171/254) remote: Compressing objects: 68% (173/254) remote: Compressing objects: 69% (176/254) remote: Compressing objects: 70% (178/254) remote: Compressing objects: 71% (181/254) remote: Compressing objects: 72% (183/254) remote: Compressing objects: 73% (186/254) remote: Compressing objects: 74% (188/254) remote: Compressing objects: 75% (191/254) remote: Compressing objects: 76% (194/254) remote: Compressing objects: 77% (196/254) remote: Compressing objects: 78% (199/254) remote: Compressing objects: 79% (201/254) remote: Compressing objects: 80% (204/254) remote: Compressing objects: 81% (206/254) remote: Compressing objects: 82% (209/254) remote: Compressing objects: 83% (211/254) remote: Compressing objects: 84% (214/254) remote: Compressing objects: 85% (216/254) remote: Compressing objects: 86% (219/254) remote: Compressing objects: 87% (221/254) remote: Compressing objects: 88% (224/254) remote: Compressing objects: 89% (227/254) remote: Compressing objects: 90% (229/254) remote: Compressing objects: 91% (232/254) remote: Compressing objects: 92% (234/254) remote: Compressing objects: 93% (237/254) remote: Compressing objects: 94% (239/254) remote: Compressing objects: 95% (242/254) remote: Compressing objects: 96% (244/254) remote: Compressing objects: 97% (247/254) remote: Compressing objects: 98% (249/254) remote: Compressing objects: 99% (252/254) remote: Compressing objects: 100% (254/254) remote: Compressing objects: 100% (254/254), done.
Receiving objects: 0% (1/68740)Receiving objects: 1% (688/68740)Receiving objects: 2% (1375/68740)Receiving objects: 3% (2063/68740)Receiving objects: 4% (2750/68740)Receiving objects: 5% (3437/68740)Receiving objects: 6% (4125/68740)Receiving objects: 7% (4812/68740)Receiving objects: 8% (5500/68740)Receiving objects: 9% (6187/68740)Receiving objects: 10% (6874/68740)Receiving objects: 11% (7562/68740)Receiving objects: 12% (8249/68740)Receiving objects: 13% (8937/68740)Receiving objects: 14% (9624/68740)Receiving objects: 15% (10311/68740)Receiving objects: 16% (10999/68740)Receiving objects: 17% (11686/68740)Receiving objects: 18% (12374/68740), 16.36 MiB | 32.70 MiB/sReceiving objects: 19% (13061/68740), 16.36 MiB | 32.70 MiB/sReceiving objects: 20% (13748/68740), 16.36 MiB | 32.70 MiB/sReceiving objects: 21% (14436/68740), 16.36 MiB | 32.70 MiB/sReceiving objects: 22% (15123/68740), 16.36 MiB | 32.70 MiB/sReceiving objects: 23% (15811/68740), 16.36 MiB | 32.70 MiB/sReceiving objects: 23% (16249/68740), 44.21 MiB | 44.20 MiB/sReceiving objects: 24% (16498/68740), 44.21 MiB | 44.20 MiB/sReceiving objects: 25% (17185/68740), 44.21 MiB | 44.20 MiB/sReceiving objects: 26% (17873/68740), 44.21 MiB | 44.20 MiB/sReceiving objects: 27% (18560/68740), 44.21 MiB | 44.20 MiB/sReceiving objects: 28% (19248/68740), 44.21 MiB | 44.20 MiB/sReceiving objects: 29% (19935/68740), 44.21 MiB | 44.20 MiB/sReceiving objects: 30% (20622/68740), 44.21 MiB | 44.20 MiB/sReceiving objects: 31% (21310/68740), 44.21 MiB | 44.20 MiB/sReceiving objects: 32% (21997/68740), 44.21 MiB | 44.20 MiB/sReceiving objects: 33% (22685/68740), 44.21 MiB | 44.20 MiB/sReceiving objects: 34% (23372/68740), 44.21 MiB | 44.20 MiB/sReceiving objects: 35% (24059/68740), 44.21 MiB | 44.20 MiB/sReceiving objects: 36% (24747/68740), 44.21 MiB | 44.20 MiB/sReceiving objects: 37% (25434/68740), 44.21 MiB | 44.20 MiB/sReceiving objects: 38% (26122/68740), 44.21 MiB | 44.20 MiB/sReceiving objects: 39% (26809/68740), 44.21 MiB | 44.20 MiB/sReceiving objects: 40% (27496/68740), 44.21 MiB | 44.20 MiB/sReceiving objects: 41% (28184/68740), 44.21 MiB | 44.20 MiB/sReceiving objects: 42% (28871/68740), 44.21 MiB | 44.20 MiB/sReceiving objects: 43% (29559/68740), 44.21 MiB | 44.20 MiB/sReceiving objects: 44% (30246/68740), 44.21 MiB | 44.20 MiB/sReceiving objects: 45% (30933/68740), 44.21 MiB | 44.20 MiB/sReceiving objects: 46% (31621/68740), 44.21 MiB | 44.20 MiB/sReceiving objects: 47% (32308/68740), 44.21 MiB | 44.20 MiB/sReceiving objects: 48% (32996/68740), 44.21 MiB | 44.20 MiB/sReceiving objects: 49% (33683/68740), 44.21 MiB | 44.20 MiB/sReceiving objects: 50% (34370/68740), 44.21 MiB | 44.20 MiB/sReceiving objects: 51% (35058/68740), 44.21 MiB | 44.20 MiB/sReceiving objects: 52% (35745/68740), 44.21 MiB | 44.20 MiB/sReceiving objects: 53% (36433/68740), 44.21 MiB | 44.20 MiB/sReceiving objects: 54% (37120/68740), 44.21 MiB | 44.20 MiB/sReceiving objects: 55% (37807/68740), 44.21 MiB | 44.20 MiB/sReceiving objects: 56% (38495/68740), 44.21 MiB | 44.20 MiB/sReceiving objects: 57% (39182/68740), 44.21 MiB | 44.20 MiB/sReceiving objects: 58% (39870/68740), 44.21 MiB | 44.20 MiB/sReceiving objects: 59% (40557/68740), 44.21 MiB | 44.20 MiB/sReceiving objects: 60% (41244/68740), 44.21 MiB | 44.20 MiB/sReceiving objects: 61% (41932/68740), 44.21 MiB | 44.20 MiB/sReceiving objects: 62% (42619/68740), 44.21 MiB | 44.20 MiB/sReceiving objects: 63% (43307/68740), 44.21 MiB | 44.20 MiB/sReceiving objects: 64% (43994/68740), 44.21 MiB | 44.20 MiB/sReceiving objects: 65% (44681/68740), 44.21 MiB | 44.20 MiB/sReceiving objects: 66% (45369/68740), 44.21 MiB | 44.20 MiB/sReceiving objects: 67% (46056/68740), 44.21 MiB | 44.20 MiB/sReceiving objects: 68% (46744/68740), 44.21 MiB | 44.20 MiB/sReceiving objects: 69% (47431/68740), 44.21 MiB | 44.20 MiB/sReceiving objects: 70% (48118/68740), 44.21 MiB | 44.20 MiB/sReceiving objects: 71% (48806/68740), 44.21 MiB | 44.20 MiB/sReceiving objects: 72% (49493/68740), 44.21 MiB | 44.20 MiB/sReceiving objects: 73% (50181/68740), 44.21 MiB | 44.20 MiB/sReceiving objects: 74% (50868/68740), 44.21 MiB | 44.20 MiB/sReceiving objects: 75% (51555/68740), 44.21 MiB | 44.20 MiB/sReceiving objects: 76% (52243/68740), 44.21 MiB | 44.20 MiB/sReceiving objects: 77% (52930/68740), 44.21 MiB | 44.20 MiB/sReceiving objects: 78% (53618/68740), 44.21 MiB | 44.20 MiB/sReceiving objects: 79% (54305/68740), 44.21 MiB | 44.20 MiB/sReceiving objects: 80% (54992/68740), 44.21 MiB | 44.20 MiB/sReceiving objects: 81% (55680/68740), 44.21 MiB | 44.20 MiB/sReceiving objects: 82% (56367/68740), 44.21 MiB | 44.20 MiB/sReceiving objects: 83% (57055/68740), 44.21 MiB | 44.20 MiB/sReceiving objects: 84% (57742/68740), 44.21 MiB | 44.20 MiB/sReceiving objects: 85% (58429/68740), 44.21 MiB | 44.20 MiB/sReceiving objects: 86% (59117/68740), 44.21 MiB | 44.20 MiB/sReceiving objects: 87% (59804/68740), 44.21 MiB | 44.20 MiB/sReceiving objects: 88% (60492/68740), 44.21 MiB | 44.20 MiB/sReceiving objects: 89% (61179/68740), 44.21 MiB | 44.20 MiB/sReceiving objects: 90% (61866/68740), 44.21 MiB | 44.20 MiB/sReceiving objects: 91% (62554/68740), 44.21 MiB | 44.20 MiB/sReceiving objects: 92% (63241/68740), 44.21 MiB | 44.20 MiB/sReceiving objects: 93% (63929/68740), 44.21 MiB | 44.20 MiB/sReceiving objects: 94% (64616/68740), 44.21 MiB | 44.20 MiB/sReceiving objects: 95% (65303/68740), 44.21 MiB | 44.20 MiB/sReceiving objects: 96% (65991/68740), 44.21 MiB | 44.20 MiB/sReceiving objects: 97% (66678/68740), 44.21 MiB | 44.20 MiB/sReceiving objects: 98% (67366/68740), 44.21 MiB | 44.20 MiB/sReceiving objects: 99% (68053/68740), 44.21 MiB | 44.20 MiB/sremote: Total 68740 (delta 4258), reused 4243 (delta 4214), pack-reused 64259 (from 3)
Receiving objects: 100% (68740/68740), 44.21 MiB | 44.20 MiB/sReceiving objects: 100% (68740/68740), 68.85 MiB | 47.99 MiB/s, done.
Resolving deltas: 0% (0/40484)Resolving deltas: 1% (405/40484)Resolving deltas: 2% (810/40484)Resolving deltas: 3% (1215/40484)Resolving deltas: 4% (1620/40484)Resolving deltas: 5% (2025/40484)Resolving deltas: 6% (2430/40484)Resolving deltas: 7% (2834/40484)Resolving deltas: 8% (3239/40484)Resolving deltas: 9% (3644/40484)Resolving deltas: 10% (4049/40484)Resolving deltas: 11% (4454/40484)Resolving deltas: 12% (4859/40484)Resolving deltas: 13% (5263/40484)Resolving deltas: 14% (5668/40484)Resolving deltas: 15% (6073/40484)Resolving deltas: 16% (6478/40484)Resolving deltas: 17% (6883/40484)Resolving deltas: 18% (7288/40484)Resolving deltas: 19% (7692/40484)Resolving deltas: 20% (8097/40484)Resolving deltas: 21% (8502/40484)Resolving deltas: 22% (8907/40484)Resolving deltas: 23% (9312/40484)Resolving deltas: 24% (9717/40484)Resolving deltas: 25% (10121/40484)Resolving deltas: 26% (10528/40484)Resolving deltas: 27% (10931/40484)Resolving deltas: 28% (11336/40484)Resolving deltas: 29% (11741/40484)Resolving deltas: 30% (12146/40484)Resolving deltas: 31% (12551/40484)Resolving deltas: 32% (12955/40484)Resolving deltas: 33% (13360/40484)Resolving deltas: 34% (13766/40484)Resolving deltas: 35% (14170/40484)Resolving deltas: 36% (14575/40484)Resolving deltas: 37% (14980/40484)Resolving deltas: 38% (15384/40484)Resolving deltas: 39% (15789/40484)Resolving deltas: 40% (16194/40484)Resolving deltas: 41% (16599/40484)Resolving deltas: 42% (17004/40484)Resolving deltas: 43% (17409/40484)Resolving deltas: 44% (17814/40484)Resolving deltas: 45% (18218/40484)Resolving deltas: 46% (18624/40484)Resolving deltas: 47% (19028/40484)Resolving deltas: 48% (19433/40484)Resolving deltas: 49% (19839/40484)Resolving deltas: 50% (20242/40484)Resolving deltas: 51% (20647/40484)Resolving deltas: 52% (21052/40484)Resolving deltas: 53% (21457/40484)Resolving deltas: 54% (21862/40484)Resolving deltas: 55% (22268/40484)Resolving deltas: 56% (22672/40484)Resolving deltas: 57% (23076/40484)Resolving deltas: 58% (23481/40484)Resolving deltas: 59% (23886/40484)Resolving deltas: 60% (24291/40484)Resolving deltas: 61% (24696/40484)Resolving deltas: 62% (25101/40484)Resolving deltas: 63% (25505/40484)Resolving deltas: 64% (25910/40484)Resolving deltas: 65% (26315/40484)Resolving deltas: 66% (26720/40484)Resolving deltas: 67% (27125/40484)Resolving deltas: 68% (27530/40484)Resolving deltas: 69% (27934/40484)Resolving deltas: 70% (28339/40484)Resolving deltas: 71% (28744/40484)Resolving deltas: 72% (29149/40484)Resolving deltas: 73% (29559/40484)Resolving deltas: 74% (29959/40484)Resolving deltas: 75% (30363/40484)Resolving deltas: 76% (30768/40484)Resolving deltas: 77% (31181/40484)Resolving deltas: 78% (31578/40484)Resolving deltas: 79% (31984/40484)Resolving deltas: 80% (32388/40484)Resolving deltas: 81% (32793/40484)Resolving deltas: 82% (33197/40484)Resolving deltas: 83% (33602/40484)Resolving deltas: 84% (34007/40484)Resolving deltas: 85% (34412/40484)Resolving deltas: 86% (34817/40484)Resolving deltas: 87% (35222/40484)Resolving deltas: 88% (35628/40484)Resolving deltas: 89% (36031/40484)Resolving deltas: 90% (36436/40484)Resolving deltas: 90% (36678/40484), completed with 147 local objects.
fatal: pack has 3806 unresolved deltas
fatal: fetch-pack: invalid index-pack output
at PluginClassLoader for git-client//org.jenkinsci.plugins.gitclient.CliGitAPIImpl.launchCommandIn(CliGitAPIImpl.java:2848)
at PluginClassLoader for git-client//org.jenkinsci.plugins.gitclient.CliGitAPIImpl.launchCommandWithCredentials(CliGitAPIImpl.java:2184)
at PluginClassLoader for git-client//org.jenkinsci.plugins.gitclient.CliGitAPIImpl$1.execute(CliGitAPIImpl.java:635)
at PluginClassLoader for git-client//org.jenkinsci.plugins.gitclient.RemoteGitImpl$CommandInvocationHandler$GitCommandMasterToSlaveCallable.call(RemoteGitImpl.java:170)
at PluginClassLoader for git-client//org.jenkinsci.plugins.gitclient.RemoteGitImpl$CommandInvocationHandler$GitCommandMasterToSlaveCallable.call(RemoteGitImpl.java:161)
at hudson.remoting.UserRequest.perform(UserRequest.java:225)
at hudson.remoting.UserRequest.perform(UserRequest.java:50)
at hudson.remoting.Request$2.run(Request.java:391)
at hudson.remoting.InterceptingExecutorService.lambda$wrap$0(InterceptingExecutorService.java:81)
at java.base/java.util.concurrent.FutureTask.run(FutureTask.java:264)
at java.base/java.util.concurrent.ThreadPoolExecutor.runWorker(ThreadPoolExecutor.java:1136)
at java.base/java.util.concurrent.ThreadPoolExecutor$Worker.run(ThreadPoolExecutor.java:635)
at java.base/java.lang.Thread.run(Thread.java:840)
Suppressed: hudson.remoting.Channel$CallSiteStackTrace: Remote call to builds59
at hudson.remoting.Channel.attachCallSiteStackTrace(Channel.java:1923)
at hudson.remoting.UserRequest$ExceptionResponse.retrieve(UserRequest.java:384)
at hudson.remoting.Channel.call(Channel.java:1112)
at PluginClassLoader for git-client//org.jenkinsci.plugins.gitclient.RemoteGitImpl$CommandInvocationHandler.execute(RemoteGitImpl.java:153)
at jdk.internal.reflect.GeneratedMethodAccessor1122.invoke(Unknown Source)
at java.base/jdk.internal.reflect.DelegatingMethodAccessorImpl.invoke(DelegatingMethodAccessorImpl.java:43)
at java.base/java.lang.reflect.Method.invoke(Method.java:569)
at PluginClassLoader for git-client//org.jenkinsci.plugins.gitclient.RemoteGitImpl$CommandInvocationHandler.invoke(RemoteGitImpl.java:138)
at PluginClassLoader for git-client/jdk.proxy119/jdk.proxy119.$Proxy247.execute(Unknown Source)
at PluginClassLoader for git//hudson.plugins.git.GitSCM.fetchFrom(GitSCM.java:995)
at PluginClassLoader for git//hudson.plugins.git.GitSCM.retrieveChanges(GitSCM.java:1239)
at PluginClassLoader for git//hudson.plugins.git.GitSCM._checkout(GitSCM.java:1310)
at PluginClassLoader for git//hudson.plugins.git.GitSCM.checkout(GitSCM.java:1277)
at hudson.scm.SCM.checkout(SCM.java:540)
at hudson.model.AbstractProject.checkout(AbstractProject.java:1250)
at hudson.model.AbstractBuild$AbstractBuildExecution.defaultCheckout(AbstractBuild.java:649)
at jenkins.scm.SCMCheckoutStrategy.checkout(SCMCheckoutStrategy.java:85)
at hudson.model.AbstractBuild$AbstractBuildExecution.run(AbstractBuild.java:522)
at hudson.model.Run.execute(Run.java:1833)
at hudson.model.FreeStyleBuild.run(FreeStyleBuild.java:44)
at hudson.model.ResourceController.execute(ResourceController.java:101)
at hudson.model.Executor.run(Executor.java:446)
ERROR: Error fetching remote repo 'origin'
Archiving artifacts
Recording test results
[Checks API] No suitable checks publisher found.
Build failed in Jenkins: JMeter » JMeter-trunk #1001
Posted by Apache Jenkins Server <je...@builds.apache.org>.
See <https://ci-builds.apache.org/job/JMeter/job/JMeter-trunk/1001/display/redirect>
Changes:
------------------------------------------
Started by GitHub push by vlsi
Started by GitHub push by vlsi
Running as SYSTEM
[EnvInject] - Loading node environment variables.
Building remotely on builds59 (ubuntu ubuntu-avx) in workspace <https://ci-builds.apache.org/job/JMeter/job/JMeter-trunk/ws/>
[WS-CLEANUP] Deleting project workspace...
[WS-CLEANUP] Done
The recommended git tool is: NONE
No credentials specified
> git rev-parse --resolve-git-dir <https://ci-builds.apache.org/job/JMeter/job/JMeter-trunk/ws/.git> # timeout=10
Fetching changes from the remote Git repository
> git config remote.origin.url https://github.com/apache/jmeter.git # timeout=10
Fetching upstream changes from https://github.com/apache/jmeter.git
> git --version # timeout=10
> git --version # 'git version 2.34.1'
> git fetch --tags --force --progress -- https://github.com/apache/jmeter.git +refs/heads/*:refs/remotes/origin/* # timeout=10
ERROR: Error fetching remote repo 'origin'
hudson.plugins.git.GitException: Failed to fetch from https://github.com/apache/jmeter.git
at PluginClassLoader for git//hudson.plugins.git.GitSCM.fetchFrom(GitSCM.java:997)
at PluginClassLoader for git//hudson.plugins.git.GitSCM.retrieveChanges(GitSCM.java:1239)
at PluginClassLoader for git//hudson.plugins.git.GitSCM._checkout(GitSCM.java:1310)
at PluginClassLoader for git//hudson.plugins.git.GitSCM.checkout(GitSCM.java:1277)
at hudson.scm.SCM.checkout(SCM.java:540)
at hudson.model.AbstractProject.checkout(AbstractProject.java:1250)
at hudson.model.AbstractBuild$AbstractBuildExecution.defaultCheckout(AbstractBuild.java:649)
at jenkins.scm.SCMCheckoutStrategy.checkout(SCMCheckoutStrategy.java:85)
at hudson.model.AbstractBuild$AbstractBuildExecution.run(AbstractBuild.java:522)
at hudson.model.Run.execute(Run.java:1833)
at hudson.model.FreeStyleBuild.run(FreeStyleBuild.java:44)
at hudson.model.ResourceController.execute(ResourceController.java:101)
at hudson.model.Executor.run(Executor.java:446)
Caused by: hudson.plugins.git.GitException: Command "git fetch --tags --force --progress -- https://github.com/apache/jmeter.git +refs/heads/*:refs/remotes/origin/*" returned status code 128:
stdout:
stderr: remote: Enumerating objects: 68740, done.
remote: Counting objects: 0% (1/4372) remote: Counting objects: 1% (44/4372) remote: Counting objects: 2% (88/4372) remote: Counting objects: 3% (132/4372) remote: Counting objects: 4% (175/4372) remote: Counting objects: 5% (219/4372) remote: Counting objects: 6% (263/4372) remote: Counting objects: 7% (307/4372) remote: Counting objects: 8% (350/4372) remote: Counting objects: 9% (394/4372) remote: Counting objects: 10% (438/4372) remote: Counting objects: 11% (481/4372) remote: Counting objects: 12% (525/4372) remote: Counting objects: 13% (569/4372) remote: Counting objects: 14% (613/4372) remote: Counting objects: 15% (656/4372) remote: Counting objects: 16% (700/4372) remote: Counting objects: 17% (744/4372) remote: Counting objects: 18% (787/4372) remote: Counting objects: 19% (831/4372) remote: Counting objects: 20% (875/4372) remote: Counting objects: 21% (919/4372) remote: Counting objects: 22% (962/4372) remote: Counting objects: 23% (1006/4372) remote: Counting objects: 24% (1050/4372) remote: Counting objects: 25% (1093/4372) remote: Counting objects: 26% (1137/4372) remote: Counting objects: 27% (1181/4372) remote: Counting objects: 28% (1225/4372) remote: Counting objects: 29% (1268/4372) remote: Counting objects: 30% (1312/4372) remote: Counting objects: 31% (1356/4372) remote: Counting objects: 32% (1400/4372) remote: Counting objects: 33% (1443/4372) remote: Counting objects: 34% (1487/4372) remote: Counting objects: 35% (1531/4372) remote: Counting objects: 36% (1574/4372) remote: Counting objects: 37% (1618/4372) remote: Counting objects: 38% (1662/4372) remote: Counting objects: 39% (1706/4372) remote: Counting objects: 40% (1749/4372) remote: Counting objects: 41% (1793/4372) remote: Counting objects: 42% (1837/4372) remote: Counting objects: 43% (1880/4372) remote: Counting objects: 44% (1924/4372) remote: Counting objects: 45% (1968/4372) remote: Counting objects: 46% (2012/4372) remote: Counting objects: 47% (2055/4372) remote: Counting objects: 48% (2099/4372) remote: Counting objects: 49% (2143/4372) remote: Counting objects: 50% (2186/4372) remote: Counting objects: 51% (2230/4372) remote: Counting objects: 52% (2274/4372) remote: Counting objects: 53% (2318/4372) remote: Counting objects: 54% (2361/4372) remote: Counting objects: 55% (2405/4372) remote: Counting objects: 56% (2449/4372) remote: Counting objects: 57% (2493/4372) remote: Counting objects: 58% (2536/4372) remote: Counting objects: 59% (2580/4372) remote: Counting objects: 60% (2624/4372) remote: Counting objects: 61% (2667/4372) remote: Counting objects: 62% (2711/4372) remote: Counting objects: 63% (2755/4372) remote: Counting objects: 64% (2799/4372) remote: Counting objects: 65% (2842/4372) remote: Counting objects: 66% (2886/4372) remote: Counting objects: 67% (2930/4372) remote: Counting objects: 68% (2973/4372) remote: Counting objects: 69% (3017/4372) remote: Counting objects: 70% (3061/4372) remote: Counting objects: 71% (3105/4372) remote: Counting objects: 72% (3148/4372) remote: Counting objects: 73% (3192/4372) remote: Counting objects: 74% (3236/4372) remote: Counting objects: 75% (3279/4372) remote: Counting objects: 76% (3323/4372) remote: Counting objects: 77% (3367/4372) remote: Counting objects: 78% (3411/4372) remote: Counting objects: 79% (3454/4372) remote: Counting objects: 80% (3498/4372) remote: Counting objects: 81% (3542/4372) remote: Counting objects: 82% (3586/4372) remote: Counting objects: 83% (3629/4372) remote: Counting objects: 84% (3673/4372) remote: Counting objects: 85% (3717/4372) remote: Counting objects: 86% (3760/4372) remote: Counting objects: 87% (3804/4372) remote: Counting objects: 88% (3848/4372) remote: Counting objects: 89% (3892/4372) remote: Counting objects: 90% (3935/4372) remote: Counting objects: 91% (3979/4372) remote: Counting objects: 92% (4023/4372) remote: Counting objects: 93% (4066/4372) remote: Counting objects: 94% (4110/4372) remote: Counting objects: 95% (4154/4372) remote: Counting objects: 96% (4198/4372) remote: Counting objects: 97% (4241/4372) remote: Counting objects: 98% (4285/4372) remote: Counting objects: 99% (4329/4372) remote: Counting objects: 100% (4372/4372) remote: Counting objects: 100% (4372/4372), done.
remote: Compressing objects: 0% (1/246) remote: Compressing objects: 1% (3/246) remote: Compressing objects: 2% (5/246) remote: Compressing objects: 3% (8/246) remote: Compressing objects: 4% (10/246) remote: Compressing objects: 5% (13/246) remote: Compressing objects: 6% (15/246) remote: Compressing objects: 7% (18/246) remote: Compressing objects: 8% (20/246) remote: Compressing objects: 9% (23/246) remote: Compressing objects: 10% (25/246) remote: Compressing objects: 11% (28/246) remote: Compressing objects: 12% (30/246) remote: Compressing objects: 13% (32/246) remote: Compressing objects: 14% (35/246) remote: Compressing objects: 15% (37/246) remote: Compressing objects: 16% (40/246) remote: Compressing objects: 17% (42/246) remote: Compressing objects: 18% (45/246) remote: Compressing objects: 19% (47/246) remote: Compressing objects: 20% (50/246) remote: Compressing objects: 21% (52/246) remote: Compressing objects: 22% (55/246) remote: Compressing objects: 23% (57/246) remote: Compressing objects: 24% (60/246) remote: Compressing objects: 25% (62/246) remote: Compressing objects: 26% (64/246) remote: Compressing objects: 27% (67/246) remote: Compressing objects: 28% (69/246) remote: Compressing objects: 29% (72/246) remote: Compressing objects: 30% (74/246) remote: Compressing objects: 31% (77/246) remote: Compressing objects: 32% (79/246) remote: Compressing objects: 33% (82/246) remote: Compressing objects: 34% (84/246) remote: Compressing objects: 35% (87/246) remote: Compressing objects: 36% (89/246) remote: Compressing objects: 37% (92/246) remote: Compressing objects: 38% (94/246) remote: Compressing objects: 39% (96/246) remote: Compressing objects: 40% (99/246) remote: Compressing objects: 41% (101/246) remote: Compressing objects: 42% (104/246) remote: Compressing objects: 43% (106/246) remote: Compressing objects: 44% (109/246) remote: Compressing objects: 45% (111/246) remote: Compressing objects: 46% (114/246) remote: Compressing objects: 47% (116/246) remote: Compressing objects: 48% (119/246) remote: Compressing objects: 49% (121/246) remote: Compressing objects: 50% (123/246) remote: Compressing objects: 51% (126/246) remote: Compressing objects: 52% (128/246) remote: Compressing objects: 53% (131/246) remote: Compressing objects: 54% (133/246) remote: Compressing objects: 55% (136/246) remote: Compressing objects: 56% (138/246) remote: Compressing objects: 57% (141/246) remote: Compressing objects: 58% (143/246) remote: Compressing objects: 59% (146/246) remote: Compressing objects: 60% (148/246) remote: Compressing objects: 61% (151/246) remote: Compressing objects: 62% (153/246) remote: Compressing objects: 63% (155/246) remote: Compressing objects: 64% (158/246) remote: Compressing objects: 65% (160/246) remote: Compressing objects: 66% (163/246) remote: Compressing objects: 67% (165/246) remote: Compressing objects: 68% (168/246) remote: Compressing objects: 69% (170/246) remote: Compressing objects: 70% (173/246) remote: Compressing objects: 71% (175/246) remote: Compressing objects: 72% (178/246) remote: Compressing objects: 73% (180/246) remote: Compressing objects: 74% (183/246) remote: Compressing objects: 75% (185/246) remote: Compressing objects: 76% (187/246) remote: Compressing objects: 77% (190/246) remote: Compressing objects: 78% (192/246) remote: Compressing objects: 79% (195/246) remote: Compressing objects: 80% (197/246) remote: Compressing objects: 81% (200/246) remote: Compressing objects: 82% (202/246) remote: Compressing objects: 83% (205/246) remote: Compressing objects: 84% (207/246) remote: Compressing objects: 85% (210/246) remote: Compressing objects: 86% (212/246) remote: Compressing objects: 87% (215/246) remote: Compressing objects: 88% (217/246) remote: Compressing objects: 89% (219/246) remote: Compressing objects: 90% (222/246) remote: Compressing objects: 91% (224/246) remote: Compressing objects: 92% (227/246) remote: Compressing objects: 93% (229/246) remote: Compressing objects: 94% (232/246) remote: Compressing objects: 95% (234/246) remote: Compressing objects: 96% (237/246) remote: Compressing objects: 97% (239/246) remote: Compressing objects: 98% (242/246) remote: Compressing objects: 99% (244/246) remote: Compressing objects: 100% (246/246) remote: Compressing objects: 100% (246/246), done.
Receiving objects: 0% (1/68740)Receiving objects: 1% (688/68740)Receiving objects: 2% (1375/68740)Receiving objects: 3% (2063/68740)Receiving objects: 4% (2750/68740)Receiving objects: 5% (3437/68740)Receiving objects: 6% (4125/68740)Receiving objects: 7% (4812/68740)Receiving objects: 8% (5500/68740)Receiving objects: 9% (6187/68740)Receiving objects: 10% (6874/68740)Receiving objects: 11% (7562/68740)Receiving objects: 12% (8249/68740)Receiving objects: 13% (8937/68740)Receiving objects: 14% (9624/68740)Receiving objects: 15% (10311/68740)Receiving objects: 16% (10999/68740)Receiving objects: 17% (11686/68740)Receiving objects: 18% (12374/68740), 15.62 MiB | 31.30 MiB/sReceiving objects: 19% (13061/68740), 15.62 MiB | 31.30 MiB/sReceiving objects: 20% (13748/68740), 15.62 MiB | 31.30 MiB/sReceiving objects: 21% (14436/68740), 15.62 MiB | 31.30 MiB/sReceiving objects: 22% (15123/68740), 15.62 MiB | 31.30 MiB/sReceiving objects: 23% (15811/68740), 15.62 MiB | 31.30 MiB/sReceiving objects: 23% (16175/68740), 43.71 MiB | 43.75 MiB/sReceiving objects: 24% (16498/68740), 43.71 MiB | 43.75 MiB/sReceiving objects: 25% (17185/68740), 43.71 MiB | 43.75 MiB/sReceiving objects: 26% (17873/68740), 43.71 MiB | 43.75 MiB/sReceiving objects: 27% (18560/68740), 43.71 MiB | 43.75 MiB/sReceiving objects: 28% (19248/68740), 43.71 MiB | 43.75 MiB/sReceiving objects: 29% (19935/68740), 43.71 MiB | 43.75 MiB/sReceiving objects: 30% (20622/68740), 43.71 MiB | 43.75 MiB/sReceiving objects: 31% (21310/68740), 43.71 MiB | 43.75 MiB/sReceiving objects: 32% (21997/68740), 43.71 MiB | 43.75 MiB/sReceiving objects: 33% (22685/68740), 43.71 MiB | 43.75 MiB/sReceiving objects: 34% (23372/68740), 43.71 MiB | 43.75 MiB/sReceiving objects: 35% (24059/68740), 43.71 MiB | 43.75 MiB/sReceiving objects: 36% (24747/68740), 43.71 MiB | 43.75 MiB/sReceiving objects: 37% (25434/68740), 43.71 MiB | 43.75 MiB/sReceiving objects: 38% (26122/68740), 43.71 MiB | 43.75 MiB/sReceiving objects: 39% (26809/68740), 43.71 MiB | 43.75 MiB/sReceiving objects: 40% (27496/68740), 43.71 MiB | 43.75 MiB/sReceiving objects: 41% (28184/68740), 43.71 MiB | 43.75 MiB/sReceiving objects: 42% (28871/68740), 43.71 MiB | 43.75 MiB/sReceiving objects: 43% (29559/68740), 43.71 MiB | 43.75 MiB/sReceiving objects: 44% (30246/68740), 43.71 MiB | 43.75 MiB/sReceiving objects: 45% (30933/68740), 43.71 MiB | 43.75 MiB/sReceiving objects: 46% (31621/68740), 43.71 MiB | 43.75 MiB/sReceiving objects: 47% (32308/68740), 43.71 MiB | 43.75 MiB/sReceiving objects: 48% (32996/68740), 43.71 MiB | 43.75 MiB/sReceiving objects: 49% (33683/68740), 43.71 MiB | 43.75 MiB/sReceiving objects: 50% (34370/68740), 43.71 MiB | 43.75 MiB/sReceiving objects: 51% (35058/68740), 43.71 MiB | 43.75 MiB/sReceiving objects: 52% (35745/68740), 43.71 MiB | 43.75 MiB/sReceiving objects: 53% (36433/68740), 43.71 MiB | 43.75 MiB/sReceiving objects: 54% (37120/68740), 43.71 MiB | 43.75 MiB/sReceiving objects: 55% (37807/68740), 43.71 MiB | 43.75 MiB/sReceiving objects: 56% (38495/68740), 43.71 MiB | 43.75 MiB/sReceiving objects: 57% (39182/68740), 43.71 MiB | 43.75 MiB/sReceiving objects: 58% (39870/68740), 43.71 MiB | 43.75 MiB/sReceiving objects: 59% (40557/68740), 43.71 MiB | 43.75 MiB/sReceiving objects: 60% (41244/68740), 43.71 MiB | 43.75 MiB/sReceiving objects: 61% (41932/68740), 43.71 MiB | 43.75 MiB/sReceiving objects: 62% (42619/68740), 43.71 MiB | 43.75 MiB/sReceiving objects: 63% (43307/68740), 43.71 MiB | 43.75 MiB/sReceiving objects: 64% (43994/68740), 43.71 MiB | 43.75 MiB/sReceiving objects: 65% (44681/68740), 43.71 MiB | 43.75 MiB/sReceiving objects: 66% (45369/68740), 43.71 MiB | 43.75 MiB/sReceiving objects: 67% (46056/68740), 43.71 MiB | 43.75 MiB/sReceiving objects: 68% (46744/68740), 43.71 MiB | 43.75 MiB/sReceiving objects: 69% (47431/68740), 43.71 MiB | 43.75 MiB/sReceiving objects: 70% (48118/68740), 43.71 MiB | 43.75 MiB/sReceiving objects: 71% (48806/68740), 43.71 MiB | 43.75 MiB/sReceiving objects: 72% (49493/68740), 43.71 MiB | 43.75 MiB/sReceiving objects: 73% (50181/68740), 43.71 MiB | 43.75 MiB/sReceiving objects: 74% (50868/68740), 43.71 MiB | 43.75 MiB/sReceiving objects: 75% (51555/68740), 43.71 MiB | 43.75 MiB/sReceiving objects: 76% (52243/68740), 43.71 MiB | 43.75 MiB/sReceiving objects: 77% (52930/68740), 43.71 MiB | 43.75 MiB/sReceiving objects: 78% (53618/68740), 43.71 MiB | 43.75 MiB/sReceiving objects: 79% (54305/68740), 43.71 MiB | 43.75 MiB/sReceiving objects: 80% (54992/68740), 43.71 MiB | 43.75 MiB/sReceiving objects: 81% (55680/68740), 43.71 MiB | 43.75 MiB/sReceiving objects: 82% (56367/68740), 43.71 MiB | 43.75 MiB/sReceiving objects: 83% (57055/68740), 43.71 MiB | 43.75 MiB/sReceiving objects: 84% (57742/68740), 43.71 MiB | 43.75 MiB/sReceiving objects: 85% (58429/68740), 43.71 MiB | 43.75 MiB/sReceiving objects: 86% (59117/68740), 43.71 MiB | 43.75 MiB/sReceiving objects: 87% (59804/68740), 43.71 MiB | 43.75 MiB/sReceiving objects: 88% (60492/68740), 43.71 MiB | 43.75 MiB/sReceiving objects: 89% (61179/68740), 43.71 MiB | 43.75 MiB/sReceiving objects: 90% (61866/68740), 43.71 MiB | 43.75 MiB/sReceiving objects: 91% (62554/68740), 43.71 MiB | 43.75 MiB/sReceiving objects: 92% (63241/68740), 43.71 MiB | 43.75 MiB/sReceiving objects: 93% (63929/68740), 43.71 MiB | 43.75 MiB/sReceiving objects: 94% (64616/68740), 43.71 MiB | 43.75 MiB/sReceiving objects: 95% (65303/68740), 43.71 MiB | 43.75 MiB/sReceiving objects: 96% (65991/68740), 43.71 MiB | 43.75 MiB/sReceiving objects: 97% (66678/68740), 43.71 MiB | 43.75 MiB/sReceiving objects: 98% (67366/68740), 43.71 MiB | 43.75 MiB/sReceiving objects: 99% (68053/68740), 43.71 MiB | 43.75 MiB/sremote: Total 68740 (delta 4155), reused 4142 (delta 4113), pack-reused 64368 (from 3)
Receiving objects: 100% (68740/68740), 43.71 MiB | 43.75 MiB/sReceiving objects: 100% (68740/68740), 68.86 MiB | 47.52 MiB/s, done.
Resolving deltas: 0% (0/40434)Resolving deltas: 1% (405/40434)Resolving deltas: 2% (809/40434)Resolving deltas: 3% (1214/40434)Resolving deltas: 4% (1618/40434)Resolving deltas: 5% (2022/40434)Resolving deltas: 6% (2427/40434)Resolving deltas: 7% (2831/40434)Resolving deltas: 8% (3235/40434)Resolving deltas: 9% (3640/40434)Resolving deltas: 10% (4044/40434)Resolving deltas: 11% (4448/40434)Resolving deltas: 12% (4853/40434)Resolving deltas: 13% (5257/40434)Resolving deltas: 14% (5661/40434)Resolving deltas: 15% (6066/40434)Resolving deltas: 16% (6470/40434)Resolving deltas: 17% (6874/40434)Resolving deltas: 18% (7279/40434)Resolving deltas: 19% (7683/40434)Resolving deltas: 20% (8087/40434)Resolving deltas: 21% (8492/40434)Resolving deltas: 22% (8896/40434)Resolving deltas: 23% (9300/40434)Resolving deltas: 24% (9705/40434)Resolving deltas: 25% (10109/40434)Resolving deltas: 26% (10513/40434)Resolving deltas: 27% (10918/40434)Resolving deltas: 28% (11322/40434)Resolving deltas: 29% (11726/40434)Resolving deltas: 30% (12131/40434)Resolving deltas: 31% (12535/40434)Resolving deltas: 32% (12939/40434)Resolving deltas: 33% (13345/40434)Resolving deltas: 34% (13748/40434)Resolving deltas: 35% (14152/40434)Resolving deltas: 36% (14557/40434)Resolving deltas: 37% (14961/40434)Resolving deltas: 38% (15365/40434)Resolving deltas: 39% (15770/40434)Resolving deltas: 40% (16174/40434)Resolving deltas: 41% (16578/40434)Resolving deltas: 42% (16983/40434)Resolving deltas: 43% (17387/40434)Resolving deltas: 44% (17791/40434)Resolving deltas: 45% (18196/40434)Resolving deltas: 46% (18600/40434)Resolving deltas: 47% (19005/40434)Resolving deltas: 48% (19409/40434)Resolving deltas: 49% (19813/40434)Resolving deltas: 50% (20217/40434)Resolving deltas: 51% (20622/40434)Resolving deltas: 52% (21026/40434)Resolving deltas: 53% (21431/40434)Resolving deltas: 54% (21836/40434)Resolving deltas: 55% (22239/40434)Resolving deltas: 56% (22644/40434)Resolving deltas: 57% (23048/40434)Resolving deltas: 58% (23452/40434)Resolving deltas: 59% (23857/40434)Resolving deltas: 60% (24263/40434)Resolving deltas: 61% (24665/40434)Resolving deltas: 62% (25070/40434)Resolving deltas: 63% (25474/40434)Resolving deltas: 64% (25878/40434)Resolving deltas: 65% (26283/40434)Resolving deltas: 66% (26687/40434)Resolving deltas: 67% (27091/40434)Resolving deltas: 68% (27496/40434)Resolving deltas: 69% (27900/40434)Resolving deltas: 70% (28304/40434)Resolving deltas: 71% (28709/40434)Resolving deltas: 72% (29113/40434)Resolving deltas: 73% (29517/40434)Resolving deltas: 74% (29922/40434)Resolving deltas: 75% (30326/40434)Resolving deltas: 76% (30730/40434)Resolving deltas: 77% (31135/40434)Resolving deltas: 78% (31539/40434)Resolving deltas: 79% (31943/40434)Resolving deltas: 80% (32348/40434)Resolving deltas: 81% (32752/40434)Resolving deltas: 82% (33156/40434)Resolving deltas: 83% (33562/40434)Resolving deltas: 84% (33965/40434)Resolving deltas: 85% (34369/40434)Resolving deltas: 86% (34774/40434)Resolving deltas: 87% (35178/40434)Resolving deltas: 88% (35583/40434)Resolving deltas: 89% (35987/40434)Resolving deltas: 90% (36391/40434)Resolving deltas: 90% (36629/40434), completed with 96 local objects.
fatal: pack has 3805 unresolved deltas
fatal: fetch-pack: invalid index-pack output
at PluginClassLoader for git-client//org.jenkinsci.plugins.gitclient.CliGitAPIImpl.launchCommandIn(CliGitAPIImpl.java:2848)
at PluginClassLoader for git-client//org.jenkinsci.plugins.gitclient.CliGitAPIImpl.launchCommandWithCredentials(CliGitAPIImpl.java:2184)
at PluginClassLoader for git-client//org.jenkinsci.plugins.gitclient.CliGitAPIImpl$1.execute(CliGitAPIImpl.java:635)
at PluginClassLoader for git-client//org.jenkinsci.plugins.gitclient.RemoteGitImpl$CommandInvocationHandler$GitCommandMasterToSlaveCallable.call(RemoteGitImpl.java:170)
at PluginClassLoader for git-client//org.jenkinsci.plugins.gitclient.RemoteGitImpl$CommandInvocationHandler$GitCommandMasterToSlaveCallable.call(RemoteGitImpl.java:161)
at hudson.remoting.UserRequest.perform(UserRequest.java:225)
at hudson.remoting.UserRequest.perform(UserRequest.java:50)
at hudson.remoting.Request$2.run(Request.java:391)
at hudson.remoting.InterceptingExecutorService.lambda$wrap$0(InterceptingExecutorService.java:81)
at java.base/java.util.concurrent.FutureTask.run(FutureTask.java:264)
at java.base/java.util.concurrent.ThreadPoolExecutor.runWorker(ThreadPoolExecutor.java:1136)
at java.base/java.util.concurrent.ThreadPoolExecutor$Worker.run(ThreadPoolExecutor.java:635)
at java.base/java.lang.Thread.run(Thread.java:840)
Suppressed: hudson.remoting.Channel$CallSiteStackTrace: Remote call to builds59
at hudson.remoting.Channel.attachCallSiteStackTrace(Channel.java:1923)
at hudson.remoting.UserRequest$ExceptionResponse.retrieve(UserRequest.java:384)
at hudson.remoting.Channel.call(Channel.java:1112)
at PluginClassLoader for git-client//org.jenkinsci.plugins.gitclient.RemoteGitImpl$CommandInvocationHandler.execute(RemoteGitImpl.java:153)
at jdk.internal.reflect.GeneratedMethodAccessor1122.invoke(Unknown Source)
at java.base/jdk.internal.reflect.DelegatingMethodAccessorImpl.invoke(DelegatingMethodAccessorImpl.java:43)
at java.base/java.lang.reflect.Method.invoke(Method.java:569)
at PluginClassLoader for git-client//org.jenkinsci.plugins.gitclient.RemoteGitImpl$CommandInvocationHandler.invoke(RemoteGitImpl.java:138)
at PluginClassLoader for git-client/jdk.proxy119/jdk.proxy119.$Proxy247.execute(Unknown Source)
at PluginClassLoader for git//hudson.plugins.git.GitSCM.fetchFrom(GitSCM.java:995)
at PluginClassLoader for git//hudson.plugins.git.GitSCM.retrieveChanges(GitSCM.java:1239)
at PluginClassLoader for git//hudson.plugins.git.GitSCM._checkout(GitSCM.java:1310)
at PluginClassLoader for git//hudson.plugins.git.GitSCM.checkout(GitSCM.java:1277)
at hudson.scm.SCM.checkout(SCM.java:540)
at hudson.model.AbstractProject.checkout(AbstractProject.java:1250)
at hudson.model.AbstractBuild$AbstractBuildExecution.defaultCheckout(AbstractBuild.java:649)
at jenkins.scm.SCMCheckoutStrategy.checkout(SCMCheckoutStrategy.java:85)
at hudson.model.AbstractBuild$AbstractBuildExecution.run(AbstractBuild.java:522)
at hudson.model.Run.execute(Run.java:1833)
at hudson.model.FreeStyleBuild.run(FreeStyleBuild.java:44)
at hudson.model.ResourceController.execute(ResourceController.java:101)
at hudson.model.Executor.run(Executor.java:446)
ERROR: Error fetching remote repo 'origin'
Archiving artifacts
Recording test results
[Checks API] No suitable checks publisher found.
Build failed in Jenkins: JMeter » JMeter-trunk #1000
Posted by Apache Jenkins Server <je...@builds.apache.org>.
See <https://ci-builds.apache.org/job/JMeter/job/JMeter-trunk/1000/display/redirect>
Changes:
------------------------------------------
Started by GitHub push by vlsi
Started by GitHub push by vlsi
Running as SYSTEM
[EnvInject] - Loading node environment variables.
Building remotely on builds59 (ubuntu ubuntu-avx) in workspace <https://ci-builds.apache.org/job/JMeter/job/JMeter-trunk/ws/>
[WS-CLEANUP] Deleting project workspace...
[WS-CLEANUP] Done
The recommended git tool is: NONE
No credentials specified
> git rev-parse --resolve-git-dir <https://ci-builds.apache.org/job/JMeter/job/JMeter-trunk/ws/.git> # timeout=10
Fetching changes from the remote Git repository
> git config remote.origin.url https://github.com/apache/jmeter.git # timeout=10
Fetching upstream changes from https://github.com/apache/jmeter.git
> git --version # timeout=10
> git --version # 'git version 2.34.1'
> git fetch --tags --force --progress -- https://github.com/apache/jmeter.git +refs/heads/*:refs/remotes/origin/* # timeout=10
ERROR: Error fetching remote repo 'origin'
hudson.plugins.git.GitException: Failed to fetch from https://github.com/apache/jmeter.git
at PluginClassLoader for git//hudson.plugins.git.GitSCM.fetchFrom(GitSCM.java:997)
at PluginClassLoader for git//hudson.plugins.git.GitSCM.retrieveChanges(GitSCM.java:1239)
at PluginClassLoader for git//hudson.plugins.git.GitSCM._checkout(GitSCM.java:1310)
at PluginClassLoader for git//hudson.plugins.git.GitSCM.checkout(GitSCM.java:1277)
at hudson.scm.SCM.checkout(SCM.java:540)
at hudson.model.AbstractProject.checkout(AbstractProject.java:1250)
at hudson.model.AbstractBuild$AbstractBuildExecution.defaultCheckout(AbstractBuild.java:649)
at jenkins.scm.SCMCheckoutStrategy.checkout(SCMCheckoutStrategy.java:85)
at hudson.model.AbstractBuild$AbstractBuildExecution.run(AbstractBuild.java:522)
at hudson.model.Run.execute(Run.java:1833)
at hudson.model.FreeStyleBuild.run(FreeStyleBuild.java:44)
at hudson.model.ResourceController.execute(ResourceController.java:101)
at hudson.model.Executor.run(Executor.java:446)
Caused by: hudson.plugins.git.GitException: Command "git fetch --tags --force --progress -- https://github.com/apache/jmeter.git +refs/heads/*:refs/remotes/origin/*" returned status code 128:
stdout:
stderr: remote: Enumerating objects: 68737, done.
remote: Counting objects: 0% (1/4369) remote: Counting objects: 1% (44/4369) remote: Counting objects: 2% (88/4369) remote: Counting objects: 3% (132/4369) remote: Counting objects: 4% (175/4369) remote: Counting objects: 5% (219/4369) remote: Counting objects: 6% (263/4369) remote: Counting objects: 7% (306/4369) remote: Counting objects: 8% (350/4369) remote: Counting objects: 9% (394/4369) remote: Counting objects: 10% (437/4369) remote: Counting objects: 11% (481/4369) remote: Counting objects: 12% (525/4369) remote: Counting objects: 13% (568/4369) remote: Counting objects: 14% (612/4369) remote: Counting objects: 15% (656/4369) remote: Counting objects: 16% (700/4369) remote: Counting objects: 17% (743/4369) remote: Counting objects: 18% (787/4369) remote: Counting objects: 19% (831/4369) remote: Counting objects: 20% (874/4369) remote: Counting objects: 21% (918/4369) remote: Counting objects: 22% (962/4369) remote: Counting objects: 23% (1005/4369) remote: Counting objects: 24% (1049/4369) remote: Counting objects: 25% (1093/4369) remote: Counting objects: 26% (1136/4369) remote: Counting objects: 27% (1180/4369) remote: Counting objects: 28% (1224/4369) remote: Counting objects: 29% (1268/4369) remote: Counting objects: 30% (1311/4369) remote: Counting objects: 31% (1355/4369) remote: Counting objects: 32% (1399/4369) remote: Counting objects: 33% (1442/4369) remote: Counting objects: 34% (1486/4369) remote: Counting objects: 35% (1530/4369) remote: Counting objects: 36% (1573/4369) remote: Counting objects: 37% (1617/4369) remote: Counting objects: 38% (1661/4369) remote: Counting objects: 39% (1704/4369) remote: Counting objects: 40% (1748/4369) remote: Counting objects: 41% (1792/4369) remote: Counting objects: 42% (1835/4369) remote: Counting objects: 43% (1879/4369) remote: Counting objects: 44% (1923/4369) remote: Counting objects: 45% (1967/4369) remote: Counting objects: 46% (2010/4369) remote: Counting objects: 47% (2054/4369) remote: Counting objects: 48% (2098/4369) remote: Counting objects: 49% (2141/4369) remote: Counting objects: 50% (2185/4369) remote: Counting objects: 51% (2229/4369) remote: Counting objects: 52% (2272/4369) remote: Counting objects: 53% (2316/4369) remote: Counting objects: 54% (2360/4369) remote: Counting objects: 55% (2403/4369) remote: Counting objects: 56% (2447/4369) remote: Counting objects: 57% (2491/4369) remote: Counting objects: 58% (2535/4369) remote: Counting objects: 59% (2578/4369) remote: Counting objects: 60% (2622/4369) remote: Counting objects: 61% (2666/4369) remote: Counting objects: 62% (2709/4369) remote: Counting objects: 63% (2753/4369) remote: Counting objects: 64% (2797/4369) remote: Counting objects: 65% (2840/4369) remote: Counting objects: 66% (2884/4369) remote: Counting objects: 67% (2928/4369) remote: Counting objects: 68% (2971/4369) remote: Counting objects: 69% (3015/4369) remote: Counting objects: 70% (3059/4369) remote: Counting objects: 71% (3102/4369) remote: Counting objects: 72% (3146/4369) remote: Counting objects: 73% (3190/4369) remote: Counting objects: 74% (3234/4369) remote: Counting objects: 75% (3277/4369) remote: Counting objects: 76% (3321/4369) remote: Counting objects: 77% (3365/4369) remote: Counting objects: 78% (3408/4369) remote: Counting objects: 79% (3452/4369) remote: Counting objects: 80% (3496/4369) remote: Counting objects: 81% (3539/4369) remote: Counting objects: 82% (3583/4369) remote: Counting objects: 83% (3627/4369) remote: Counting objects: 84% (3670/4369) remote: Counting objects: 85% (3714/4369) remote: Counting objects: 86% (3758/4369) remote: Counting objects: 87% (3802/4369) remote: Counting objects: 88% (3845/4369) remote: Counting objects: 89% (3889/4369) remote: Counting objects: 90% (3933/4369) remote: Counting objects: 91% (3976/4369) remote: Counting objects: 92% (4020/4369) remote: Counting objects: 93% (4064/4369) remote: Counting objects: 94% (4107/4369) remote: Counting objects: 95% (4151/4369) remote: Counting objects: 96% (4195/4369) remote: Counting objects: 97% (4238/4369) remote: Counting objects: 98% (4282/4369) remote: Counting objects: 99% (4326/4369) remote: Counting objects: 100% (4369/4369) remote: Counting objects: 100% (4369/4369), done.
remote: Compressing objects: 0% (1/244) remote: Compressing objects: 1% (3/244) remote: Compressing objects: 2% (5/244) remote: Compressing objects: 3% (8/244) remote: Compressing objects: 4% (10/244) remote: Compressing objects: 5% (13/244) remote: Compressing objects: 6% (15/244) remote: Compressing objects: 7% (18/244) remote: Compressing objects: 8% (20/244) remote: Compressing objects: 9% (22/244) remote: Compressing objects: 10% (25/244) remote: Compressing objects: 11% (27/244) remote: Compressing objects: 12% (30/244) remote: Compressing objects: 13% (32/244) remote: Compressing objects: 14% (35/244) remote: Compressing objects: 15% (37/244) remote: Compressing objects: 16% (40/244) remote: Compressing objects: 17% (42/244) remote: Compressing objects: 18% (44/244) remote: Compressing objects: 19% (47/244) remote: Compressing objects: 20% (49/244) remote: Compressing objects: 21% (52/244) remote: Compressing objects: 22% (54/244) remote: Compressing objects: 23% (57/244) remote: Compressing objects: 24% (59/244) remote: Compressing objects: 25% (61/244) remote: Compressing objects: 26% (64/244) remote: Compressing objects: 27% (66/244) remote: Compressing objects: 28% (69/244) remote: Compressing objects: 29% (71/244) remote: Compressing objects: 30% (74/244) remote: Compressing objects: 31% (76/244) remote: Compressing objects: 32% (79/244) remote: Compressing objects: 33% (81/244) remote: Compressing objects: 34% (83/244) remote: Compressing objects: 35% (86/244) remote: Compressing objects: 36% (88/244) remote: Compressing objects: 37% (91/244) remote: Compressing objects: 38% (93/244) remote: Compressing objects: 39% (96/244) remote: Compressing objects: 40% (98/244) remote: Compressing objects: 41% (101/244) remote: Compressing objects: 42% (103/244) remote: Compressing objects: 43% (105/244) remote: Compressing objects: 44% (108/244) remote: Compressing objects: 45% (110/244) remote: Compressing objects: 46% (113/244) remote: Compressing objects: 47% (115/244) remote: Compressing objects: 48% (118/244) remote: Compressing objects: 49% (120/244) remote: Compressing objects: 50% (122/244) remote: Compressing objects: 51% (125/244) remote: Compressing objects: 52% (127/244) remote: Compressing objects: 53% (130/244) remote: Compressing objects: 54% (132/244) remote: Compressing objects: 55% (135/244) remote: Compressing objects: 56% (137/244) remote: Compressing objects: 57% (140/244) remote: Compressing objects: 58% (142/244) remote: Compressing objects: 59% (144/244) remote: Compressing objects: 60% (147/244) remote: Compressing objects: 61% (149/244) remote: Compressing objects: 62% (152/244) remote: Compressing objects: 63% (154/244) remote: Compressing objects: 64% (157/244) remote: Compressing objects: 65% (159/244) remote: Compressing objects: 66% (162/244) remote: Compressing objects: 67% (164/244) remote: Compressing objects: 68% (166/244) remote: Compressing objects: 69% (169/244) remote: Compressing objects: 70% (171/244) remote: Compressing objects: 71% (174/244) remote: Compressing objects: 72% (176/244) remote: Compressing objects: 73% (179/244) remote: Compressing objects: 74% (181/244) remote: Compressing objects: 75% (183/244) remote: Compressing objects: 76% (186/244) remote: Compressing objects: 77% (188/244) remote: Compressing objects: 78% (191/244) remote: Compressing objects: 79% (193/244) remote: Compressing objects: 80% (196/244) remote: Compressing objects: 81% (198/244) remote: Compressing objects: 82% (201/244) remote: Compressing objects: 83% (203/244) remote: Compressing objects: 84% (205/244) remote: Compressing objects: 85% (208/244) remote: Compressing objects: 86% (210/244) remote: Compressing objects: 87% (213/244) remote: Compressing objects: 88% (215/244) remote: Compressing objects: 89% (218/244) remote: Compressing objects: 90% (220/244) remote: Compressing objects: 91% (223/244) remote: Compressing objects: 92% (225/244) remote: Compressing objects: 93% (227/244) remote: Compressing objects: 94% (230/244) remote: Compressing objects: 95% (232/244) remote: Compressing objects: 96% (235/244) remote: Compressing objects: 97% (237/244) remote: Compressing objects: 98% (240/244) remote: Compressing objects: 99% (242/244) remote: Compressing objects: 100% (244/244) remote: Compressing objects: 100% (244/244), done.
Receiving objects: 0% (1/68737)Receiving objects: 1% (688/68737)Receiving objects: 2% (1375/68737)Receiving objects: 3% (2063/68737)Receiving objects: 4% (2750/68737)Receiving objects: 5% (3437/68737)Receiving objects: 6% (4125/68737)Receiving objects: 7% (4812/68737)Receiving objects: 8% (5499/68737)Receiving objects: 9% (6187/68737)Receiving objects: 10% (6874/68737)Receiving objects: 11% (7562/68737)Receiving objects: 12% (8249/68737)Receiving objects: 13% (8936/68737)Receiving objects: 14% (9624/68737)Receiving objects: 15% (10311/68737)Receiving objects: 16% (10998/68737)Receiving objects: 17% (11686/68737)Receiving objects: 18% (12373/68737), 16.23 MiB | 32.45 MiB/sReceiving objects: 19% (13061/68737), 16.23 MiB | 32.45 MiB/sReceiving objects: 20% (13748/68737), 16.23 MiB | 32.45 MiB/sReceiving objects: 20% (14338/68737), 36.28 MiB | 36.28 MiB/sReceiving objects: 21% (14435/68737), 36.28 MiB | 36.28 MiB/sReceiving objects: 22% (15123/68737), 36.28 MiB | 36.28 MiB/sReceiving objects: 23% (15810/68737), 36.28 MiB | 36.28 MiB/sReceiving objects: 24% (16497/68737), 36.28 MiB | 36.28 MiB/sReceiving objects: 25% (17185/68737), 36.28 MiB | 36.28 MiB/sReceiving objects: 26% (17872/68737), 36.28 MiB | 36.28 MiB/sReceiving objects: 27% (18559/68737), 36.28 MiB | 36.28 MiB/sReceiving objects: 28% (19247/68737), 36.28 MiB | 36.28 MiB/sReceiving objects: 29% (19934/68737), 36.28 MiB | 36.28 MiB/sReceiving objects: 30% (20622/68737), 36.28 MiB | 36.28 MiB/sReceiving objects: 31% (21309/68737), 36.28 MiB | 36.28 MiB/sReceiving objects: 32% (21996/68737), 36.28 MiB | 36.28 MiB/sReceiving objects: 33% (22684/68737), 36.28 MiB | 36.28 MiB/sReceiving objects: 34% (23371/68737), 36.28 MiB | 36.28 MiB/sReceiving objects: 35% (24058/68737), 36.28 MiB | 36.28 MiB/sReceiving objects: 36% (24746/68737), 36.28 MiB | 36.28 MiB/sReceiving objects: 37% (25433/68737), 36.28 MiB | 36.28 MiB/sReceiving objects: 38% (26121/68737), 36.28 MiB | 36.28 MiB/sReceiving objects: 39% (26808/68737), 36.28 MiB | 36.28 MiB/sReceiving objects: 40% (27495/68737), 36.28 MiB | 36.28 MiB/sReceiving objects: 41% (28183/68737), 36.28 MiB | 36.28 MiB/sReceiving objects: 42% (28870/68737), 36.28 MiB | 36.28 MiB/sReceiving objects: 43% (29557/68737), 36.28 MiB | 36.28 MiB/sReceiving objects: 44% (30245/68737), 36.28 MiB | 36.28 MiB/sReceiving objects: 45% (30932/68737), 36.28 MiB | 36.28 MiB/sReceiving objects: 46% (31620/68737), 36.28 MiB | 36.28 MiB/sReceiving objects: 47% (32307/68737), 36.28 MiB | 36.28 MiB/sReceiving objects: 48% (32994/68737), 36.28 MiB | 36.28 MiB/sReceiving objects: 49% (33682/68737), 36.28 MiB | 36.28 MiB/sReceiving objects: 50% (34369/68737), 36.28 MiB | 36.28 MiB/sReceiving objects: 51% (35056/68737), 36.28 MiB | 36.28 MiB/sReceiving objects: 52% (35744/68737), 36.28 MiB | 36.28 MiB/sReceiving objects: 53% (36431/68737), 36.28 MiB | 36.28 MiB/sReceiving objects: 54% (37118/68737), 36.28 MiB | 36.28 MiB/sReceiving objects: 55% (37806/68737), 36.28 MiB | 36.28 MiB/sReceiving objects: 56% (38493/68737), 36.28 MiB | 36.28 MiB/sReceiving objects: 57% (39181/68737), 36.28 MiB | 36.28 MiB/sReceiving objects: 58% (39868/68737), 36.28 MiB | 36.28 MiB/sReceiving objects: 59% (40555/68737), 36.28 MiB | 36.28 MiB/sReceiving objects: 60% (41243/68737), 36.28 MiB | 36.28 MiB/sReceiving objects: 61% (41930/68737), 36.28 MiB | 36.28 MiB/sReceiving objects: 62% (42617/68737), 36.28 MiB | 36.28 MiB/sReceiving objects: 63% (43305/68737), 36.28 MiB | 36.28 MiB/sReceiving objects: 64% (43992/68737), 36.28 MiB | 36.28 MiB/sReceiving objects: 65% (44680/68737), 36.28 MiB | 36.28 MiB/sReceiving objects: 66% (45367/68737), 36.28 MiB | 36.28 MiB/sReceiving objects: 67% (46054/68737), 36.28 MiB | 36.28 MiB/sReceiving objects: 68% (46742/68737), 36.28 MiB | 36.28 MiB/sReceiving objects: 69% (47429/68737), 36.28 MiB | 36.28 MiB/sReceiving objects: 70% (48116/68737), 36.28 MiB | 36.28 MiB/sReceiving objects: 71% (48804/68737), 36.28 MiB | 36.28 MiB/sReceiving objects: 72% (49491/68737), 36.28 MiB | 36.28 MiB/sReceiving objects: 73% (50179/68737), 36.28 MiB | 36.28 MiB/sReceiving objects: 74% (50866/68737), 36.28 MiB | 36.28 MiB/sReceiving objects: 75% (51553/68737), 36.28 MiB | 36.28 MiB/sReceiving objects: 76% (52241/68737), 36.28 MiB | 36.28 MiB/sReceiving objects: 77% (52928/68737), 62.12 MiB | 41.41 MiB/sReceiving objects: 78% (53615/68737), 62.12 MiB | 41.41 MiB/sReceiving objects: 79% (54303/68737), 62.12 MiB | 41.41 MiB/sReceiving objects: 80% (54990/68737), 62.12 MiB | 41.41 MiB/sReceiving objects: 81% (55677/68737), 62.12 MiB | 41.41 MiB/sReceiving objects: 82% (56365/68737), 62.12 MiB | 41.41 MiB/sReceiving objects: 83% (57052/68737), 62.12 MiB | 41.41 MiB/sReceiving objects: 84% (57740/68737), 62.12 MiB | 41.41 MiB/sReceiving objects: 85% (58427/68737), 62.12 MiB | 41.41 MiB/sReceiving objects: 86% (59114/68737), 62.12 MiB | 41.41 MiB/sReceiving objects: 87% (59802/68737), 62.12 MiB | 41.41 MiB/sReceiving objects: 88% (60489/68737), 62.12 MiB | 41.41 MiB/sReceiving objects: 89% (61176/68737), 62.12 MiB | 41.41 MiB/sReceiving objects: 90% (61864/68737), 62.12 MiB | 41.41 MiB/sReceiving objects: 91% (62551/68737), 62.12 MiB | 41.41 MiB/sReceiving objects: 92% (63239/68737), 62.12 MiB | 41.41 MiB/sReceiving objects: 93% (63926/68737), 62.12 MiB | 41.41 MiB/sReceiving objects: 94% (64613/68737), 62.12 MiB | 41.41 MiB/sReceiving objects: 95% (65301/68737), 62.12 MiB | 41.41 MiB/sReceiving objects: 96% (65988/68737), 62.12 MiB | 41.41 MiB/sReceiving objects: 97% (66675/68737), 62.12 MiB | 41.41 MiB/sReceiving objects: 98% (67363/68737), 62.12 MiB | 41.41 MiB/sReceiving objects: 99% (68050/68737), 62.12 MiB | 41.41 MiB/sremote: Total 68737 (delta 4153), reused 4140 (delta 4112), pack-reused 64368 (from 3)
Receiving objects: 100% (68737/68737), 62.12 MiB | 41.41 MiB/sReceiving objects: 100% (68737/68737), 68.86 MiB | 41.82 MiB/s, done.
Resolving deltas: 0% (0/40432)Resolving deltas: 1% (405/40432)Resolving deltas: 2% (809/40432)Resolving deltas: 3% (1213/40432)Resolving deltas: 4% (1619/40432)Resolving deltas: 5% (2022/40432)Resolving deltas: 6% (2426/40432)Resolving deltas: 7% (2831/40432)Resolving deltas: 8% (3235/40432)Resolving deltas: 9% (3639/40432)Resolving deltas: 10% (4044/40432)Resolving deltas: 11% (4448/40432)Resolving deltas: 12% (4852/40432)Resolving deltas: 13% (5257/40432)Resolving deltas: 14% (5661/40432)Resolving deltas: 15% (6065/40432)Resolving deltas: 16% (6470/40432)Resolving deltas: 17% (6874/40432)Resolving deltas: 18% (7278/40432)Resolving deltas: 19% (7683/40432)Resolving deltas: 20% (8087/40432)Resolving deltas: 21% (8491/40432)Resolving deltas: 22% (8896/40432)Resolving deltas: 23% (9300/40432)Resolving deltas: 24% (9704/40432)Resolving deltas: 25% (10108/40432)Resolving deltas: 26% (10514/40432)Resolving deltas: 27% (10917/40432)Resolving deltas: 28% (11321/40432)Resolving deltas: 29% (11726/40432)Resolving deltas: 30% (12130/40432)Resolving deltas: 31% (12534/40432)Resolving deltas: 32% (12939/40432)Resolving deltas: 33% (13346/40432)Resolving deltas: 34% (13747/40432)Resolving deltas: 35% (14152/40432)Resolving deltas: 36% (14556/40432)Resolving deltas: 37% (14960/40432)Resolving deltas: 38% (15365/40432)Resolving deltas: 39% (15769/40432)Resolving deltas: 40% (16173/40432)Resolving deltas: 41% (16578/40432)Resolving deltas: 42% (16982/40432)Resolving deltas: 43% (17386/40432)Resolving deltas: 44% (17792/40432)Resolving deltas: 45% (18195/40432)Resolving deltas: 46% (18599/40432)Resolving deltas: 47% (19004/40432)Resolving deltas: 48% (19408/40432)Resolving deltas: 49% (19812/40432)Resolving deltas: 50% (20217/40432)Resolving deltas: 51% (20621/40432)Resolving deltas: 52% (21025/40432)Resolving deltas: 53% (21429/40432)Resolving deltas: 54% (21834/40432)Resolving deltas: 55% (22238/40432)Resolving deltas: 56% (22642/40432)Resolving deltas: 57% (23047/40432)Resolving deltas: 58% (23451/40432)Resolving deltas: 59% (23855/40432)Resolving deltas: 60% (24260/40432)Resolving deltas: 61% (24664/40432)Resolving deltas: 62% (25068/40432)Resolving deltas: 63% (25473/40432)Resolving deltas: 64% (25877/40432)Resolving deltas: 65% (26282/40432)Resolving deltas: 66% (26687/40432)Resolving deltas: 67% (27090/40432)Resolving deltas: 68% (27495/40432)Resolving deltas: 69% (27899/40432)Resolving deltas: 70% (28303/40432)Resolving deltas: 71% (28707/40432)Resolving deltas: 72% (29112/40432)Resolving deltas: 73% (29517/40432)Resolving deltas: 74% (29920/40432)Resolving deltas: 75% (30324/40432)Resolving deltas: 76% (30729/40432)Resolving deltas: 77% (31133/40432)Resolving deltas: 78% (31537/40432)Resolving deltas: 79% (31942/40432)Resolving deltas: 80% (32346/40432)Resolving deltas: 81% (32750/40432)Resolving deltas: 82% (33155/40432)Resolving deltas: 83% (33559/40432)Resolving deltas: 84% (33963/40432)Resolving deltas: 85% (34368/40432)Resolving deltas: 86% (34773/40432)Resolving deltas: 87% (35176/40432)Resolving deltas: 88% (35581/40432)Resolving deltas: 89% (35985/40432)Resolving deltas: 90% (36389/40432)Resolving deltas: 90% (36627/40432), completed with 96 local objects.
fatal: pack has 3805 unresolved deltas
fatal: fetch-pack: invalid index-pack output
at PluginClassLoader for git-client//org.jenkinsci.plugins.gitclient.CliGitAPIImpl.launchCommandIn(CliGitAPIImpl.java:2848)
at PluginClassLoader for git-client//org.jenkinsci.plugins.gitclient.CliGitAPIImpl.launchCommandWithCredentials(CliGitAPIImpl.java:2184)
at PluginClassLoader for git-client//org.jenkinsci.plugins.gitclient.CliGitAPIImpl$1.execute(CliGitAPIImpl.java:635)
at PluginClassLoader for git-client//org.jenkinsci.plugins.gitclient.RemoteGitImpl$CommandInvocationHandler$GitCommandMasterToSlaveCallable.call(RemoteGitImpl.java:170)
at PluginClassLoader for git-client//org.jenkinsci.plugins.gitclient.RemoteGitImpl$CommandInvocationHandler$GitCommandMasterToSlaveCallable.call(RemoteGitImpl.java:161)
at hudson.remoting.UserRequest.perform(UserRequest.java:225)
at hudson.remoting.UserRequest.perform(UserRequest.java:50)
at hudson.remoting.Request$2.run(Request.java:391)
at hudson.remoting.InterceptingExecutorService.lambda$wrap$0(InterceptingExecutorService.java:81)
at java.base/java.util.concurrent.FutureTask.run(FutureTask.java:264)
at java.base/java.util.concurrent.ThreadPoolExecutor.runWorker(ThreadPoolExecutor.java:1136)
at java.base/java.util.concurrent.ThreadPoolExecutor$Worker.run(ThreadPoolExecutor.java:635)
at java.base/java.lang.Thread.run(Thread.java:840)
Suppressed: hudson.remoting.Channel$CallSiteStackTrace: Remote call to builds59
at hudson.remoting.Channel.attachCallSiteStackTrace(Channel.java:1923)
at hudson.remoting.UserRequest$ExceptionResponse.retrieve(UserRequest.java:384)
at hudson.remoting.Channel.call(Channel.java:1112)
at PluginClassLoader for git-client//org.jenkinsci.plugins.gitclient.RemoteGitImpl$CommandInvocationHandler.execute(RemoteGitImpl.java:153)
at jdk.internal.reflect.GeneratedMethodAccessor1122.invoke(Unknown Source)
at java.base/jdk.internal.reflect.DelegatingMethodAccessorImpl.invoke(DelegatingMethodAccessorImpl.java:43)
at java.base/java.lang.reflect.Method.invoke(Method.java:569)
at PluginClassLoader for git-client//org.jenkinsci.plugins.gitclient.RemoteGitImpl$CommandInvocationHandler.invoke(RemoteGitImpl.java:138)
at PluginClassLoader for git-client/jdk.proxy119/jdk.proxy119.$Proxy247.execute(Unknown Source)
at PluginClassLoader for git//hudson.plugins.git.GitSCM.fetchFrom(GitSCM.java:995)
at PluginClassLoader for git//hudson.plugins.git.GitSCM.retrieveChanges(GitSCM.java:1239)
at PluginClassLoader for git//hudson.plugins.git.GitSCM._checkout(GitSCM.java:1310)
at PluginClassLoader for git//hudson.plugins.git.GitSCM.checkout(GitSCM.java:1277)
at hudson.scm.SCM.checkout(SCM.java:540)
at hudson.model.AbstractProject.checkout(AbstractProject.java:1250)
at hudson.model.AbstractBuild$AbstractBuildExecution.defaultCheckout(AbstractBuild.java:649)
at jenkins.scm.SCMCheckoutStrategy.checkout(SCMCheckoutStrategy.java:85)
at hudson.model.AbstractBuild$AbstractBuildExecution.run(AbstractBuild.java:522)
at hudson.model.Run.execute(Run.java:1833)
at hudson.model.FreeStyleBuild.run(FreeStyleBuild.java:44)
at hudson.model.ResourceController.execute(ResourceController.java:101)
at hudson.model.Executor.run(Executor.java:446)
ERROR: Error fetching remote repo 'origin'
Archiving artifacts
Recording test results
[Checks API] No suitable checks publisher found.
Build failed in Jenkins: JMeter » JMeter-trunk #999
Posted by Apache Jenkins Server <je...@builds.apache.org>.
See <https://ci-builds.apache.org/job/JMeter/job/JMeter-trunk/999/display/redirect>
Changes:
------------------------------------------
Started by GitHub push by vlsi
Started by GitHub push by vlsi
Running as SYSTEM
[EnvInject] - Loading node environment variables.
Building remotely on builds59 (ubuntu ubuntu-avx) in workspace <https://ci-builds.apache.org/job/JMeter/job/JMeter-trunk/ws/>
[WS-CLEANUP] Deleting project workspace...
[WS-CLEANUP] Done
The recommended git tool is: NONE
No credentials specified
> git rev-parse --resolve-git-dir <https://ci-builds.apache.org/job/JMeter/job/JMeter-trunk/ws/.git> # timeout=10
Fetching changes from the remote Git repository
> git config remote.origin.url https://github.com/apache/jmeter.git # timeout=10
Fetching upstream changes from https://github.com/apache/jmeter.git
> git --version # timeout=10
> git --version # 'git version 2.34.1'
> git fetch --tags --force --progress -- https://github.com/apache/jmeter.git +refs/heads/*:refs/remotes/origin/* # timeout=10
ERROR: Error fetching remote repo 'origin'
hudson.plugins.git.GitException: Failed to fetch from https://github.com/apache/jmeter.git
at PluginClassLoader for git//hudson.plugins.git.GitSCM.fetchFrom(GitSCM.java:997)
at PluginClassLoader for git//hudson.plugins.git.GitSCM.retrieveChanges(GitSCM.java:1239)
at PluginClassLoader for git//hudson.plugins.git.GitSCM._checkout(GitSCM.java:1310)
at PluginClassLoader for git//hudson.plugins.git.GitSCM.checkout(GitSCM.java:1277)
at hudson.scm.SCM.checkout(SCM.java:540)
at hudson.model.AbstractProject.checkout(AbstractProject.java:1250)
at hudson.model.AbstractBuild$AbstractBuildExecution.defaultCheckout(AbstractBuild.java:649)
at jenkins.scm.SCMCheckoutStrategy.checkout(SCMCheckoutStrategy.java:85)
at hudson.model.AbstractBuild$AbstractBuildExecution.run(AbstractBuild.java:522)
at hudson.model.Run.execute(Run.java:1833)
at hudson.model.FreeStyleBuild.run(FreeStyleBuild.java:44)
at hudson.model.ResourceController.execute(ResourceController.java:101)
at hudson.model.Executor.run(Executor.java:446)
Caused by: hudson.plugins.git.GitException: Command "git fetch --tags --force --progress -- https://github.com/apache/jmeter.git +refs/heads/*:refs/remotes/origin/*" returned status code 128:
stdout:
stderr: remote: Enumerating objects: 68734, done.
remote: Counting objects: 0% (1/4407) remote: Counting objects: 1% (45/4407) remote: Counting objects: 2% (89/4407) remote: Counting objects: 3% (133/4407) remote: Counting objects: 4% (177/4407) remote: Counting objects: 5% (221/4407) remote: Counting objects: 6% (265/4407) remote: Counting objects: 7% (309/4407) remote: Counting objects: 8% (353/4407) remote: Counting objects: 9% (397/4407) remote: Counting objects: 10% (441/4407) remote: Counting objects: 11% (485/4407) remote: Counting objects: 12% (529/4407) remote: Counting objects: 13% (573/4407) remote: Counting objects: 14% (617/4407) remote: Counting objects: 15% (662/4407) remote: Counting objects: 16% (706/4407) remote: Counting objects: 17% (750/4407) remote: Counting objects: 18% (794/4407) remote: Counting objects: 19% (838/4407) remote: Counting objects: 20% (882/4407) remote: Counting objects: 21% (926/4407) remote: Counting objects: 22% (970/4407) remote: Counting objects: 23% (1014/4407) remote: Counting objects: 24% (1058/4407) remote: Counting objects: 25% (1102/4407) remote: Counting objects: 26% (1146/4407) remote: Counting objects: 27% (1190/4407) remote: Counting objects: 28% (1234/4407) remote: Counting objects: 29% (1279/4407) remote: Counting objects: 30% (1323/4407) remote: Counting objects: 31% (1367/4407) remote: Counting objects: 32% (1411/4407) remote: Counting objects: 33% (1455/4407) remote: Counting objects: 34% (1499/4407) remote: Counting objects: 35% (1543/4407) remote: Counting objects: 36% (1587/4407) remote: Counting objects: 37% (1631/4407) remote: Counting objects: 38% (1675/4407) remote: Counting objects: 39% (1719/4407) remote: Counting objects: 40% (1763/4407) remote: Counting objects: 41% (1807/4407) remote: Counting objects: 42% (1851/4407) remote: Counting objects: 43% (1896/4407) remote: Counting objects: 44% (1940/4407) remote: Counting objects: 45% (1984/4407) remote: Counting objects: 46% (2028/4407) remote: Counting objects: 47% (2072/4407) remote: Counting objects: 48% (2116/4407) remote: Counting objects: 49% (2160/4407) remote: Counting objects: 50% (2204/4407) remote: Counting objects: 51% (2248/4407) remote: Counting objects: 52% (2292/4407) remote: Counting objects: 53% (2336/4407) remote: Counting objects: 54% (2380/4407) remote: Counting objects: 55% (2424/4407) remote: Counting objects: 56% (2468/4407) remote: Counting objects: 57% (2512/4407) remote: Counting objects: 58% (2557/4407) remote: Counting objects: 59% (2601/4407) remote: Counting objects: 60% (2645/4407) remote: Counting objects: 61% (2689/4407) remote: Counting objects: 62% (2733/4407) remote: Counting objects: 63% (2777/4407) remote: Counting objects: 64% (2821/4407) remote: Counting objects: 65% (2865/4407) remote: Counting objects: 66% (2909/4407) remote: Counting objects: 67% (2953/4407) remote: Counting objects: 68% (2997/4407) remote: Counting objects: 69% (3041/4407) remote: Counting objects: 70% (3085/4407) remote: Counting objects: 71% (3129/4407) remote: Counting objects: 72% (3174/4407) remote: Counting objects: 73% (3218/4407) remote: Counting objects: 74% (3262/4407) remote: Counting objects: 75% (3306/4407) remote: Counting objects: 76% (3350/4407) remote: Counting objects: 77% (3394/4407) remote: Counting objects: 78% (3438/4407) remote: Counting objects: 79% (3482/4407) remote: Counting objects: 80% (3526/4407) remote: Counting objects: 81% (3570/4407) remote: Counting objects: 82% (3614/4407) remote: Counting objects: 83% (3658/4407) remote: Counting objects: 84% (3702/4407) remote: Counting objects: 85% (3746/4407) remote: Counting objects: 86% (3791/4407) remote: Counting objects: 87% (3835/4407) remote: Counting objects: 88% (3879/4407) remote: Counting objects: 89% (3923/4407) remote: Counting objects: 90% (3967/4407) remote: Counting objects: 91% (4011/4407) remote: Counting objects: 92% (4055/4407) remote: Counting objects: 93% (4099/4407) remote: Counting objects: 94% (4143/4407) remote: Counting objects: 95% (4187/4407) remote: Counting objects: 96% (4231/4407) remote: Counting objects: 97% (4275/4407) remote: Counting objects: 98% (4319/4407) remote: Counting objects: 99% (4363/4407) remote: Counting objects: 100% (4407/4407) remote: Counting objects: 100% (4407/4407), done.
remote: Compressing objects: 0% (1/252) remote: Compressing objects: 1% (3/252) remote: Compressing objects: 2% (6/252) remote: Compressing objects: 3% (8/252) remote: Compressing objects: 4% (11/252) remote: Compressing objects: 5% (13/252) remote: Compressing objects: 6% (16/252) remote: Compressing objects: 7% (18/252) remote: Compressing objects: 8% (21/252) remote: Compressing objects: 9% (23/252) remote: Compressing objects: 10% (26/252) remote: Compressing objects: 11% (28/252) remote: Compressing objects: 12% (31/252) remote: Compressing objects: 13% (33/252) remote: Compressing objects: 14% (36/252) remote: Compressing objects: 15% (38/252) remote: Compressing objects: 16% (41/252) remote: Compressing objects: 17% (43/252) remote: Compressing objects: 18% (46/252) remote: Compressing objects: 19% (48/252) remote: Compressing objects: 20% (51/252) remote: Compressing objects: 21% (53/252) remote: Compressing objects: 22% (56/252) remote: Compressing objects: 23% (58/252) remote: Compressing objects: 24% (61/252) remote: Compressing objects: 25% (63/252) remote: Compressing objects: 26% (66/252) remote: Compressing objects: 27% (69/252) remote: Compressing objects: 28% (71/252) remote: Compressing objects: 29% (74/252) remote: Compressing objects: 30% (76/252) remote: Compressing objects: 31% (79/252) remote: Compressing objects: 32% (81/252) remote: Compressing objects: 33% (84/252) remote: Compressing objects: 34% (86/252) remote: Compressing objects: 35% (89/252) remote: Compressing objects: 36% (91/252) remote: Compressing objects: 37% (94/252) remote: Compressing objects: 38% (96/252) remote: Compressing objects: 39% (99/252) remote: Compressing objects: 40% (101/252) remote: Compressing objects: 41% (104/252) remote: Compressing objects: 42% (106/252) remote: Compressing objects: 43% (109/252) remote: Compressing objects: 44% (111/252) remote: Compressing objects: 45% (114/252) remote: Compressing objects: 46% (116/252) remote: Compressing objects: 47% (119/252) remote: Compressing objects: 48% (121/252) remote: Compressing objects: 49% (124/252) remote: Compressing objects: 50% (126/252) remote: Compressing objects: 51% (129/252) remote: Compressing objects: 52% (132/252) remote: Compressing objects: 53% (134/252) remote: Compressing objects: 54% (137/252) remote: Compressing objects: 55% (139/252) remote: Compressing objects: 56% (142/252) remote: Compressing objects: 57% (144/252) remote: Compressing objects: 58% (147/252) remote: Compressing objects: 59% (149/252) remote: Compressing objects: 60% (152/252) remote: Compressing objects: 61% (154/252) remote: Compressing objects: 62% (157/252) remote: Compressing objects: 63% (159/252) remote: Compressing objects: 64% (162/252) remote: Compressing objects: 65% (164/252) remote: Compressing objects: 66% (167/252) remote: Compressing objects: 67% (169/252) remote: Compressing objects: 68% (172/252) remote: Compressing objects: 69% (174/252) remote: Compressing objects: 70% (177/252) remote: Compressing objects: 71% (179/252) remote: Compressing objects: 72% (182/252) remote: Compressing objects: 73% (184/252) remote: Compressing objects: 74% (187/252) remote: Compressing objects: 75% (189/252) remote: Compressing objects: 76% (192/252) remote: Compressing objects: 77% (195/252) remote: Compressing objects: 78% (197/252) remote: Compressing objects: 79% (200/252) remote: Compressing objects: 80% (202/252) remote: Compressing objects: 81% (205/252) remote: Compressing objects: 82% (207/252) remote: Compressing objects: 83% (210/252) remote: Compressing objects: 84% (212/252) remote: Compressing objects: 85% (215/252) remote: Compressing objects: 86% (217/252) remote: Compressing objects: 87% (220/252) remote: Compressing objects: 88% (222/252) remote: Compressing objects: 89% (225/252) remote: Compressing objects: 90% (227/252) remote: Compressing objects: 91% (230/252) remote: Compressing objects: 92% (232/252) remote: Compressing objects: 93% (235/252) remote: Compressing objects: 94% (237/252) remote: Compressing objects: 95% (240/252) remote: Compressing objects: 96% (242/252) remote: Compressing objects: 97% (245/252) remote: Compressing objects: 98% (247/252) remote: Compressing objects: 99% (250/252) remote: Compressing objects: 100% (252/252) remote: Compressing objects: 100% (252/252), done.
Receiving objects: 0% (1/68734)Receiving objects: 1% (688/68734)Receiving objects: 2% (1375/68734)Receiving objects: 3% (2063/68734)Receiving objects: 4% (2750/68734)Receiving objects: 5% (3437/68734)Receiving objects: 6% (4125/68734)Receiving objects: 7% (4812/68734)Receiving objects: 8% (5499/68734)Receiving objects: 9% (6187/68734)Receiving objects: 10% (6874/68734)Receiving objects: 11% (7561/68734)Receiving objects: 12% (8249/68734)Receiving objects: 13% (8936/68734)Receiving objects: 14% (9623/68734)Receiving objects: 15% (10311/68734)Receiving objects: 16% (10998/68734)Receiving objects: 17% (11685/68734)Receiving objects: 18% (12373/68734)Receiving objects: 19% (13060/68734), 17.95 MiB | 35.89 MiB/sReceiving objects: 20% (13747/68734), 17.95 MiB | 35.89 MiB/sReceiving objects: 21% (14435/68734), 17.95 MiB | 35.89 MiB/sReceiving objects: 22% (15122/68734), 17.95 MiB | 35.89 MiB/sReceiving objects: 23% (15809/68734), 17.95 MiB | 35.89 MiB/sReceiving objects: 23% (16088/68734), 41.51 MiB | 41.51 MiB/sReceiving objects: 24% (16497/68734), 41.51 MiB | 41.51 MiB/sReceiving objects: 25% (17184/68734), 41.51 MiB | 41.51 MiB/sReceiving objects: 26% (17871/68734), 41.51 MiB | 41.51 MiB/sReceiving objects: 27% (18559/68734), 41.51 MiB | 41.51 MiB/sReceiving objects: 28% (19246/68734), 41.51 MiB | 41.51 MiB/sReceiving objects: 29% (19933/68734), 41.51 MiB | 41.51 MiB/sReceiving objects: 30% (20621/68734), 41.51 MiB | 41.51 MiB/sReceiving objects: 31% (21308/68734), 41.51 MiB | 41.51 MiB/sReceiving objects: 32% (21995/68734), 41.51 MiB | 41.51 MiB/sReceiving objects: 33% (22683/68734), 41.51 MiB | 41.51 MiB/sReceiving objects: 34% (23370/68734), 41.51 MiB | 41.51 MiB/sReceiving objects: 35% (24057/68734), 41.51 MiB | 41.51 MiB/sReceiving objects: 36% (24745/68734), 41.51 MiB | 41.51 MiB/sReceiving objects: 37% (25432/68734), 41.51 MiB | 41.51 MiB/sReceiving objects: 38% (26119/68734), 41.51 MiB | 41.51 MiB/sReceiving objects: 39% (26807/68734), 41.51 MiB | 41.51 MiB/sReceiving objects: 40% (27494/68734), 41.51 MiB | 41.51 MiB/sReceiving objects: 41% (28181/68734), 41.51 MiB | 41.51 MiB/sReceiving objects: 42% (28869/68734), 41.51 MiB | 41.51 MiB/sReceiving objects: 43% (29556/68734), 41.51 MiB | 41.51 MiB/sReceiving objects: 44% (30243/68734), 41.51 MiB | 41.51 MiB/sReceiving objects: 45% (30931/68734), 41.51 MiB | 41.51 MiB/sReceiving objects: 46% (31618/68734), 41.51 MiB | 41.51 MiB/sReceiving objects: 47% (32305/68734), 41.51 MiB | 41.51 MiB/sReceiving objects: 48% (32993/68734), 41.51 MiB | 41.51 MiB/sReceiving objects: 49% (33680/68734), 41.51 MiB | 41.51 MiB/sReceiving objects: 50% (34367/68734), 41.51 MiB | 41.51 MiB/sReceiving objects: 51% (35055/68734), 41.51 MiB | 41.51 MiB/sReceiving objects: 52% (35742/68734), 41.51 MiB | 41.51 MiB/sReceiving objects: 53% (36430/68734), 41.51 MiB | 41.51 MiB/sReceiving objects: 54% (37117/68734), 41.51 MiB | 41.51 MiB/sReceiving objects: 55% (37804/68734), 41.51 MiB | 41.51 MiB/sReceiving objects: 56% (38492/68734), 41.51 MiB | 41.51 MiB/sReceiving objects: 57% (39179/68734), 41.51 MiB | 41.51 MiB/sReceiving objects: 58% (39866/68734), 41.51 MiB | 41.51 MiB/sReceiving objects: 59% (40554/68734), 41.51 MiB | 41.51 MiB/sReceiving objects: 60% (41241/68734), 41.51 MiB | 41.51 MiB/sReceiving objects: 61% (41928/68734), 41.51 MiB | 41.51 MiB/sReceiving objects: 62% (42616/68734), 41.51 MiB | 41.51 MiB/sReceiving objects: 63% (43303/68734), 41.51 MiB | 41.51 MiB/sReceiving objects: 64% (43990/68734), 41.51 MiB | 41.51 MiB/sReceiving objects: 65% (44678/68734), 41.51 MiB | 41.51 MiB/sReceiving objects: 66% (45365/68734), 41.51 MiB | 41.51 MiB/sReceiving objects: 67% (46052/68734), 41.51 MiB | 41.51 MiB/sReceiving objects: 68% (46740/68734), 41.51 MiB | 41.51 MiB/sReceiving objects: 69% (47427/68734), 41.51 MiB | 41.51 MiB/sReceiving objects: 70% (48114/68734), 41.51 MiB | 41.51 MiB/sReceiving objects: 71% (48802/68734), 41.51 MiB | 41.51 MiB/sReceiving objects: 72% (49489/68734), 41.51 MiB | 41.51 MiB/sReceiving objects: 73% (50176/68734), 41.51 MiB | 41.51 MiB/sReceiving objects: 74% (50864/68734), 41.51 MiB | 41.51 MiB/sReceiving objects: 75% (51551/68734), 41.51 MiB | 41.51 MiB/sReceiving objects: 76% (52238/68734), 41.51 MiB | 41.51 MiB/sReceiving objects: 77% (52926/68734), 41.51 MiB | 41.51 MiB/sReceiving objects: 78% (53613/68734), 41.51 MiB | 41.51 MiB/sReceiving objects: 79% (54300/68734), 41.51 MiB | 41.51 MiB/sReceiving objects: 80% (54988/68734), 41.51 MiB | 41.51 MiB/sReceiving objects: 81% (55675/68734), 41.51 MiB | 41.51 MiB/sReceiving objects: 82% (56362/68734), 41.51 MiB | 41.51 MiB/sReceiving objects: 83% (57050/68734), 41.51 MiB | 41.51 MiB/sReceiving objects: 84% (57737/68734), 41.51 MiB | 41.51 MiB/sReceiving objects: 85% (58424/68734), 41.51 MiB | 41.51 MiB/sReceiving objects: 86% (59112/68734), 41.51 MiB | 41.51 MiB/sReceiving objects: 87% (59799/68734), 41.51 MiB | 41.51 MiB/sReceiving objects: 88% (60486/68734), 41.51 MiB | 41.51 MiB/sReceiving objects: 89% (61174/68734), 41.51 MiB | 41.51 MiB/sReceiving objects: 90% (61861/68734), 41.51 MiB | 41.51 MiB/sReceiving objects: 91% (62548/68734), 41.51 MiB | 41.51 MiB/sReceiving objects: 92% (63236/68734), 41.51 MiB | 41.51 MiB/sReceiving objects: 93% (63923/68734), 41.51 MiB | 41.51 MiB/sReceiving objects: 94% (64610/68734), 41.51 MiB | 41.51 MiB/sReceiving objects: 95% (65298/68734), 41.51 MiB | 41.51 MiB/sReceiving objects: 96% (65985/68734), 41.51 MiB | 41.51 MiB/sReceiving objects: 97% (66672/68734), 41.51 MiB | 41.51 MiB/sReceiving objects: 98% (67360/68734), 41.51 MiB | 41.51 MiB/sReceiving objects: 99% (68047/68734), 41.51 MiB | 41.51 MiB/sremote: Total 68734 (delta 4184), reused 4170 (delta 4142), pack-reused 64327 (from 3)
Receiving objects: 100% (68734/68734), 41.51 MiB | 41.51 MiB/sReceiving objects: 100% (68734/68734), 68.86 MiB | 45.96 MiB/s, done.
Resolving deltas: 0% (0/40461)Resolving deltas: 1% (405/40461)Resolving deltas: 2% (810/40461)Resolving deltas: 3% (1214/40461)Resolving deltas: 4% (1619/40461)Resolving deltas: 5% (2024/40461)Resolving deltas: 6% (2428/40461)Resolving deltas: 7% (2833/40461)Resolving deltas: 8% (3237/40461)Resolving deltas: 9% (3642/40461)Resolving deltas: 10% (4047/40461)Resolving deltas: 11% (4451/40461)Resolving deltas: 12% (4856/40461)Resolving deltas: 13% (5260/40461)Resolving deltas: 14% (5665/40461)Resolving deltas: 15% (6070/40461)Resolving deltas: 16% (6474/40461)Resolving deltas: 17% (6879/40461)Resolving deltas: 18% (7283/40461)Resolving deltas: 19% (7688/40461)Resolving deltas: 20% (8093/40461)Resolving deltas: 21% (8497/40461)Resolving deltas: 22% (8902/40461)Resolving deltas: 23% (9307/40461)Resolving deltas: 24% (9711/40461)Resolving deltas: 25% (10116/40461)Resolving deltas: 26% (10520/40461)Resolving deltas: 27% (10925/40461)Resolving deltas: 28% (11330/40461)Resolving deltas: 29% (11734/40461)Resolving deltas: 30% (12139/40461)Resolving deltas: 31% (12543/40461)Resolving deltas: 32% (12948/40461)Resolving deltas: 33% (13353/40461)Resolving deltas: 34% (13757/40461)Resolving deltas: 35% (14163/40461)Resolving deltas: 36% (14566/40461)Resolving deltas: 37% (14971/40461)Resolving deltas: 38% (15376/40461)Resolving deltas: 39% (15780/40461)Resolving deltas: 40% (16185/40461)Resolving deltas: 41% (16590/40461)Resolving deltas: 42% (16997/40461)Resolving deltas: 43% (17399/40461)Resolving deltas: 44% (17803/40461)Resolving deltas: 45% (18208/40461)Resolving deltas: 46% (18614/40461)Resolving deltas: 47% (19017/40461)Resolving deltas: 48% (19422/40461)Resolving deltas: 49% (19826/40461)Resolving deltas: 50% (20231/40461)Resolving deltas: 51% (20636/40461)Resolving deltas: 52% (21042/40461)Resolving deltas: 53% (21445/40461)Resolving deltas: 54% (21849/40461)Resolving deltas: 55% (22254/40461)Resolving deltas: 56% (22659/40461)Resolving deltas: 57% (23063/40461)Resolving deltas: 58% (23468/40461)Resolving deltas: 59% (23872/40461)Resolving deltas: 60% (24277/40461)Resolving deltas: 61% (24682/40461)Resolving deltas: 62% (25086/40461)Resolving deltas: 63% (25491/40461)Resolving deltas: 64% (25896/40461)Resolving deltas: 65% (26300/40461)Resolving deltas: 66% (26705/40461)Resolving deltas: 67% (27109/40461)Resolving deltas: 68% (27514/40461)Resolving deltas: 69% (27919/40461)Resolving deltas: 70% (28323/40461)Resolving deltas: 71% (28728/40461)Resolving deltas: 72% (29132/40461)Resolving deltas: 73% (29537/40461)Resolving deltas: 74% (29942/40461)Resolving deltas: 75% (30347/40461)Resolving deltas: 76% (30753/40461)Resolving deltas: 77% (31156/40461)Resolving deltas: 78% (31560/40461)Resolving deltas: 79% (31965/40461)Resolving deltas: 80% (32369/40461)Resolving deltas: 81% (32774/40461)Resolving deltas: 82% (33179/40461)Resolving deltas: 83% (33583/40461)Resolving deltas: 84% (33988/40461)Resolving deltas: 85% (34392/40461)Resolving deltas: 86% (34797/40461)Resolving deltas: 87% (35203/40461)Resolving deltas: 88% (35606/40461)Resolving deltas: 89% (36011/40461)Resolving deltas: 90% (36415/40461)Resolving deltas: 90% (36655/40461), completed with 124 local objects.
fatal: pack has 3806 unresolved deltas
fatal: fetch-pack: invalid index-pack output
at PluginClassLoader for git-client//org.jenkinsci.plugins.gitclient.CliGitAPIImpl.launchCommandIn(CliGitAPIImpl.java:2848)
at PluginClassLoader for git-client//org.jenkinsci.plugins.gitclient.CliGitAPIImpl.launchCommandWithCredentials(CliGitAPIImpl.java:2184)
at PluginClassLoader for git-client//org.jenkinsci.plugins.gitclient.CliGitAPIImpl$1.execute(CliGitAPIImpl.java:635)
at PluginClassLoader for git-client//org.jenkinsci.plugins.gitclient.RemoteGitImpl$CommandInvocationHandler$GitCommandMasterToSlaveCallable.call(RemoteGitImpl.java:170)
at PluginClassLoader for git-client//org.jenkinsci.plugins.gitclient.RemoteGitImpl$CommandInvocationHandler$GitCommandMasterToSlaveCallable.call(RemoteGitImpl.java:161)
at hudson.remoting.UserRequest.perform(UserRequest.java:225)
at hudson.remoting.UserRequest.perform(UserRequest.java:50)
at hudson.remoting.Request$2.run(Request.java:391)
at hudson.remoting.InterceptingExecutorService.lambda$wrap$0(InterceptingExecutorService.java:81)
at java.base/java.util.concurrent.FutureTask.run(FutureTask.java:264)
at java.base/java.util.concurrent.ThreadPoolExecutor.runWorker(ThreadPoolExecutor.java:1136)
at java.base/java.util.concurrent.ThreadPoolExecutor$Worker.run(ThreadPoolExecutor.java:635)
at java.base/java.lang.Thread.run(Thread.java:840)
Suppressed: hudson.remoting.Channel$CallSiteStackTrace: Remote call to builds59
at hudson.remoting.Channel.attachCallSiteStackTrace(Channel.java:1923)
at hudson.remoting.UserRequest$ExceptionResponse.retrieve(UserRequest.java:384)
at hudson.remoting.Channel.call(Channel.java:1112)
at PluginClassLoader for git-client//org.jenkinsci.plugins.gitclient.RemoteGitImpl$CommandInvocationHandler.execute(RemoteGitImpl.java:153)
at jdk.internal.reflect.GeneratedMethodAccessor1122.invoke(Unknown Source)
at java.base/jdk.internal.reflect.DelegatingMethodAccessorImpl.invoke(DelegatingMethodAccessorImpl.java:43)
at java.base/java.lang.reflect.Method.invoke(Method.java:569)
at PluginClassLoader for git-client//org.jenkinsci.plugins.gitclient.RemoteGitImpl$CommandInvocationHandler.invoke(RemoteGitImpl.java:138)
at PluginClassLoader for git-client/jdk.proxy119/jdk.proxy119.$Proxy247.execute(Unknown Source)
at PluginClassLoader for git//hudson.plugins.git.GitSCM.fetchFrom(GitSCM.java:995)
at PluginClassLoader for git//hudson.plugins.git.GitSCM.retrieveChanges(GitSCM.java:1239)
at PluginClassLoader for git//hudson.plugins.git.GitSCM._checkout(GitSCM.java:1310)
at PluginClassLoader for git//hudson.plugins.git.GitSCM.checkout(GitSCM.java:1277)
at hudson.scm.SCM.checkout(SCM.java:540)
at hudson.model.AbstractProject.checkout(AbstractProject.java:1250)
at hudson.model.AbstractBuild$AbstractBuildExecution.defaultCheckout(AbstractBuild.java:649)
at jenkins.scm.SCMCheckoutStrategy.checkout(SCMCheckoutStrategy.java:85)
at hudson.model.AbstractBuild$AbstractBuildExecution.run(AbstractBuild.java:522)
at hudson.model.Run.execute(Run.java:1833)
at hudson.model.FreeStyleBuild.run(FreeStyleBuild.java:44)
at hudson.model.ResourceController.execute(ResourceController.java:101)
at hudson.model.Executor.run(Executor.java:446)
ERROR: Error fetching remote repo 'origin'
Archiving artifacts
Recording test results
[Checks API] No suitable checks publisher found.
Build failed in Jenkins: JMeter » JMeter-trunk #998
Posted by Apache Jenkins Server <je...@builds.apache.org>.
See <https://ci-builds.apache.org/job/JMeter/job/JMeter-trunk/998/display/redirect?page=changes>
Changes:
[Vladimir Sitnikov] fix(deps): update dependency spotbugs to v4.9.8
------------------------------------------
[...truncated 8.71 MiB...]
These files failed verification:
- GRADLE_USER_HOME/caches/modules-2/files-2.1/com.github.spotbugs/spotbugs-annotations/4.9.8/ca4a2783a6123e67124fd7feb4caccd2e2ac9a73/spotbugs-annotations-4.9.8.jar (signature: GRADLE_USER_HOME/caches/modules-2/files-2.1/com.github.spotbugs/spotbugs-annotations/4.9.8/380f9dd1358df3a1b887809e045f3c8d50f2c543/spotbugs-annotations-4.9.8.jar.asc)
- GRADLE_USER_HOME/caches/modules-2/files-2.1/com.github.spotbugs/spotbugs-annotations/4.9.8/f5dbfb5fbab027e81f25d19be0dfc4891328dffc/spotbugs-annotations-4.9.8.module (signature: GRADLE_USER_HOME/caches/modules-2/files-2.1/com.github.spotbugs/spotbugs-annotations/4.9.8/c213284c70e1f095b3a224ddcfa135f647dff6cc/spotbugs-annotations-4.9.8.module.asc)
- GRADLE_USER_HOME/caches/modules-2/files-2.1/com.github.spotbugs/spotbugs/4.9.8/1c828a7c132fdb17d26f01c58cb6fd8e2d2d804c/spotbugs-4.9.8.module (signature: GRADLE_USER_HOME/caches/modules-2/files-2.1/com.github.spotbugs/spotbugs/4.9.8/5f8c15edfc33f3d8b615143a199c13d05801f864/spotbugs-4.9.8.module.asc)
- GRADLE_USER_HOME/caches/modules-2/files-2.1/com.github.stephenc.jcip/jcip-annotations/1.0-1/bdccebfbbbdd66fe56dcdf3bdee7b97a853cccc5/jcip-annotations-1.0-1.pom (signature: GRADLE_USER_HOME/caches/modules-2/files-2.1/com.github.stephenc.jcip/jcip-annotations/1.0-1/6384a3de49584e3859a4811ea1dd92a99eaf0b1b/jcip-annotations-1.0-1.pom.asc)
- GRADLE_USER_HOME/caches/modules-2/files-2.1/com.github.stephenc.jcip/jcip-annotations/1.0-1/ef31541dd28ae2cefdd17c7ebf352d93e9058c63/jcip-annotations-1.0-1.jar (signature: GRADLE_USER_HOME/caches/modules-2/files-2.1/com.github.stephenc.jcip/jcip-annotations/1.0-1/bceb3fe8c5ac3e9d87d673f03fc38acbcf6ed817/jcip-annotations-1.0-1.jar.asc)
- GRADLE_USER_HOME/caches/modules-2/files-2.1/jaxen/jaxen-parent/2.0.0/d311145c4f8835088b86fb8446d725816b03bcca/jaxen-parent-2.0.0.pom (signature: GRADLE_USER_HOME/caches/modules-2/files-2.1/jaxen/jaxen-parent/2.0.0/3e6599ad1b73a0c262eb74a726204b2c171fa767/jaxen-parent-2.0.0.pom.asc)
- GRADLE_USER_HOME/caches/modules-2/files-2.1/jaxen/jaxen/2.0.0/81346e6db971f2ce5e6eb994fd112b9f91986ee/jaxen-2.0.0.pom (signature: GRADLE_USER_HOME/caches/modules-2/files-2.1/jaxen/jaxen/2.0.0/e4a6c2fd9be9809402cba48b050976ceacd0b6c6/jaxen-2.0.0.pom.asc)
- GRADLE_USER_HOME/caches/modules-2/files-2.1/jaxen/jaxen/2.0.0/bd6a33b0fda054a5678010df843cc999f288dc6c/jaxen-2.0.0.jar (signature: GRADLE_USER_HOME/caches/modules-2/files-2.1/jaxen/jaxen/2.0.0/d0ee7d76fdacd99ec3a80f73765d67f0fda6b553/jaxen-2.0.0.jar.asc)
- GRADLE_USER_HOME/caches/modules-2/files-2.1/org.apache.bcel/bcel/6.11.0/8d800a87a4a7e09b1d3e634725806faf11a05006/bcel-6.11.0.jar (signature: GRADLE_USER_HOME/caches/modules-2/files-2.1/org.apache.bcel/bcel/6.11.0/e943e97ffc4d17f082e77d66087064569ca33e48/bcel-6.11.0.jar.asc)
- GRADLE_USER_HOME/caches/modules-2/files-2.1/org.apache.bcel/bcel/6.11.0/a6dc778453e0f1f5bf5a6eb4543a41c46f7fc52c/bcel-6.11.0.pom (signature: GRADLE_USER_HOME/caches/modules-2/files-2.1/org.apache.bcel/bcel/6.11.0/f9fe3141561c7e05da7c313b3c54bed2d3cf7142/bcel-6.11.0.pom.asc)
- GRADLE_USER_HOME/caches/modules-2/files-2.1/org.dom4j/dom4j/2.2.0/52368b1da663abd44a866c4fe4f62c8d8695204a/dom4j-2.2.0.jar (signature: GRADLE_USER_HOME/caches/modules-2/files-2.1/org.dom4j/dom4j/2.2.0/31705be97f03078d9a488e4752661229802cc909/dom4j-2.2.0.jar.asc)
- GRADLE_USER_HOME/caches/modules-2/files-2.1/org.dom4j/dom4j/2.2.0/ef7e4913b0babeef1f6dce2cf45aae8d512715e5/dom4j-2.2.0.module (signature: GRADLE_USER_HOME/caches/modules-2/files-2.1/org.dom4j/dom4j/2.2.0/4a62363ed21fc9b8f0d6311628a79b891af06f76/dom4j-2.2.0.module.asc)
GRADLE_USER_HOME = /home/jenkins/.gradle
These files failed verification:
- GRADLE_USER_HOME/caches/modules-2/files-2.1/com.github.spotbugs/spotbugs-annotations/4.9.8/ca4a2783a6123e67124fd7feb4caccd2e2ac9a73/spotbugs-annotations-4.9.8.jar (signature: GRADLE_USER_HOME/caches/modules-2/files-2.1/com.github.spotbugs/spotbugs-annotations/4.9.8/380f9dd1358df3a1b887809e045f3c8d50f2c543/spotbugs-annotations-4.9.8.jar.asc)
- GRADLE_USER_HOME/caches/modules-2/files-2.1/com.github.spotbugs/spotbugs-annotations/4.9.8/f5dbfb5fbab027e81f25d19be0dfc4891328dffc/spotbugs-annotations-4.9.8.module (signature: GRADLE_USER_HOME/caches/modules-2/files-2.1/com.github.spotbugs/spotbugs-annotations/4.9.8/c213284c70e1f095b3a224ddcfa135f647dff6cc/spotbugs-annotations-4.9.8.module.asc)
- GRADLE_USER_HOME/caches/modules-2/files-2.1/com.github.spotbugs/spotbugs/4.9.8/1c828a7c132fdb17d26f01c58cb6fd8e2d2d804c/spotbugs-4.9.8.module (signature: GRADLE_USER_HOME/caches/modules-2/files-2.1/com.github.spotbugs/spotbugs/4.9.8/5f8c15edfc33f3d8b615143a199c13d05801f864/spotbugs-4.9.8.module.asc)
- GRADLE_USER_HOME/caches/modules-2/files-2.1/com.github.stephenc.jcip/jcip-annotations/1.0-1/bdccebfbbbdd66fe56dcdf3bdee7b97a853cccc5/jcip-annotations-1.0-1.pom (signature: GRADLE_USER_HOME/caches/modules-2/files-2.1/com.github.stephenc.jcip/jcip-annotations/1.0-1/6384a3de49584e3859a4811ea1dd92a99eaf0b1b/jcip-annotations-1.0-1.pom.asc)
- GRADLE_USER_HOME/caches/modules-2/files-2.1/com.github.stephenc.jcip/jcip-annotations/1.0-1/ef31541dd28ae2cefdd17c7ebf352d93e9058c63/jcip-annotations-1.0-1.jar (signature: GRADLE_USER_HOME/caches/modules-2/files-2.1/com.github.stephenc.jcip/jcip-annotations/1.0-1/bceb3fe8c5ac3e9d87d673f03fc38acbcf6ed817/jcip-annotations-1.0-1.jar.asc)
- GRADLE_USER_HOME/caches/modules-2/files-2.1/jaxen/jaxen-parent/2.0.0/d311145c4f8835088b86fb8446d725816b03bcca/jaxen-parent-2.0.0.pom (signature: GRADLE_USER_HOME/caches/modules-2/files-2.1/jaxen/jaxen-parent/2.0.0/3e6599ad1b73a0c262eb74a726204b2c171fa767/jaxen-parent-2.0.0.pom.asc)
- GRADLE_USER_HOME/caches/modules-2/files-2.1/jaxen/jaxen/2.0.0/81346e6db971f2ce5e6eb994fd112b9f91986ee/jaxen-2.0.0.pom (signature: GRADLE_USER_HOME/caches/modules-2/files-2.1/jaxen/jaxen/2.0.0/e4a6c2fd9be9809402cba48b050976ceacd0b6c6/jaxen-2.0.0.pom.asc)
- GRADLE_USER_HOME/caches/modules-2/files-2.1/jaxen/jaxen/2.0.0/bd6a33b0fda054a5678010df843cc999f288dc6c/jaxen-2.0.0.jar (signature: GRADLE_USER_HOME/caches/modules-2/files-2.1/jaxen/jaxen/2.0.0/d0ee7d76fdacd99ec3a80f73765d67f0fda6b553/jaxen-2.0.0.jar.asc)
- GRADLE_USER_HOME/caches/modules-2/files-2.1/org.apache.bcel/bcel/6.11.0/8d800a87a4a7e09b1d3e634725806faf11a05006/bcel-6.11.0.jar (signature: GRADLE_USER_HOME/caches/modules-2/files-2.1/org.apache.bcel/bcel/6.11.0/e943e97ffc4d17f082e77d66087064569ca33e48/bcel-6.11.0.jar.asc)
- GRADLE_USER_HOME/caches/modules-2/files-2.1/org.apache.bcel/bcel/6.11.0/a6dc778453e0f1f5bf5a6eb4543a41c46f7fc52c/bcel-6.11.0.pom (signature: GRADLE_USER_HOME/caches/modules-2/files-2.1/org.apache.bcel/bcel/6.11.0/f9fe3141561c7e05da7c313b3c54bed2d3cf7142/bcel-6.11.0.pom.asc)
- GRADLE_USER_HOME/caches/modules-2/files-2.1/org.dom4j/dom4j/2.2.0/52368b1da663abd44a866c4fe4f62c8d8695204a/dom4j-2.2.0.jar (signature: GRADLE_USER_HOME/caches/modules-2/files-2.1/org.dom4j/dom4j/2.2.0/31705be97f03078d9a488e4752661229802cc909/dom4j-2.2.0.jar.asc)
- GRADLE_USER_HOME/caches/modules-2/files-2.1/org.dom4j/dom4j/2.2.0/ef7e4913b0babeef1f6dce2cf45aae8d512715e5/dom4j-2.2.0.module (signature: GRADLE_USER_HOME/caches/modules-2/files-2.1/org.dom4j/dom4j/2.2.0/4a62363ed21fc9b8f0d6311628a79b891af06f76/dom4j-2.2.0.module.asc)
GRADLE_USER_HOME = /home/jenkins/.gradle
Open this report for more details: file://<https://ci-builds.apache.org/job/JMeter/job/JMeter-trunk/ws/build/reports/dependency-verification/at-1762938448319/dependency-verification-report.html>
* Try:
> Run with --stacktrace option to get the stack trace.
> Run with --info or --debug option to get more log output.
> Get more help at https://help.gradle.org.
==============================================================================
10: Task failed with an exception.
-----------
* What went wrong:
Execution failed for task ':src:jorphan:autostyleKotlinGradleProcess'.
> Dependency verification failed for configuration ':src:jorphan:detachedConfiguration17':
- On artifact bcel-6.11.0.jar (org.apache.bcel:bcel:6.11.0) in repository 'MavenRepo': Artifact was signed with key '2DB4F1EF0FA761ECC4EA935C86FDC7E2A11262CB' (Gary David Gregory (Code signing key) <gg...@apache.org>) and passed verification but the key isn't in your trusted keys list.
- On artifact bcel-6.11.0.pom (org.apache.bcel:bcel:6.11.0) in repository 'MavenRepo': Artifact was signed with key '2DB4F1EF0FA761ECC4EA935C86FDC7E2A11262CB' (Gary David Gregory (Code signing key) <gg...@apache.org>) and passed verification but the key isn't in your trusted keys list.
- On artifact dom4j-2.2.0.jar (org.dom4j:dom4j:2.2.0) in repository 'MavenRepo': Artifact was signed with key '8F9A3C6D105B9F57844A721D79E193516BE7998F' (Filip Jirsák <fi...@jirsak.org>) and passed verification but the key isn't in your trusted keys list.
- On artifact dom4j-2.2.0.module (org.dom4j:dom4j:2.2.0) in repository 'MavenRepo': Artifact was signed with key '8F9A3C6D105B9F57844A721D79E193516BE7998F' (Filip Jirsák <fi...@jirsak.org>) and passed verification but the key isn't in your trusted keys list.
- On artifact jaxen-2.0.0.jar (jaxen:jaxen:2.0.0) in repository 'MavenRepo': Artifact was signed with key 'CA491704D613780D2BEE00F2C6FC46EB51CF569C' and passed verification but the key isn't in your trusted keys list.
- On artifact jaxen-2.0.0.pom (jaxen:jaxen:2.0.0) in repository 'MavenRepo': Artifact was signed with key 'CA491704D613780D2BEE00F2C6FC46EB51CF569C' and passed verification but the key isn't in your trusted keys list.
- On artifact jaxen-parent-2.0.0.pom (jaxen:jaxen-parent:2.0.0) in repository 'MavenRepo': Artifact was signed with key 'CA491704D613780D2BEE00F2C6FC46EB51CF569C' and passed verification but the key isn't in your trusted keys list.
- On artifact jcip-annotations-1.0-1.jar (com.github.stephenc.jcip:jcip-annotations:1.0-1) in repository 'MavenRepo': Artifact was signed with key '042B29E928995B9DB963C636C7CA19B7B620D787' (Stephen Connolly <st...@apache.org>) and passed verification but the key isn't in your trusted keys list.
- On artifact jcip-annotations-1.0-1.pom (com.github.stephenc.jcip:jcip-annotations:1.0-1) in repository 'MavenRepo': Artifact was signed with key '042B29E928995B9DB963C636C7CA19B7B620D787' (Stephen Connolly <st...@apache.org>) and passed verification but the key isn't in your trusted keys list.
- On artifact spotbugs-4.9.8.jar (com.github.spotbugs:spotbugs:4.9.8) in repository 'MavenRepo': Artifact was signed with key 'D878D4A823EAE731B729D1A8D2151178A123C97F' (Kengo TODA <sk...@gmail.com>) and passed verification but the key isn't in your trusted keys list.
- On artifact spotbugs-4.9.8.module (com.github.spotbugs:spotbugs:4.9.8) in repository 'MavenRepo': Artifact was signed with key 'D878D4A823EAE731B729D1A8D2151178A123C97F' (Kengo TODA <sk...@gmail.com>) and passed verification but the key isn't in your trusted keys list.
- On artifact spotbugs-annotations-4.9.8.jar (com.github.spotbugs:spotbugs-annotations:4.9.8) in repository 'MavenRepo': Artifact was signed with key 'D878D4A823EAE731B729D1A8D2151178A123C97F' (Kengo TODA <sk...@gmail.com>) and passed verification but the key isn't in your trusted keys list.
- On artifact spotbugs-annotations-4.9.8.module (com.github.spotbugs:spotbugs-annotations:4.9.8) in repository 'MavenRepo': Artifact was signed with key 'D878D4A823EAE731B729D1A8D2151178A123C97F' (Kengo TODA <sk...@gmail.com>) and passed verification but the key isn't in your trusted keys list.
If the artifacts are trustworthy, you will need to update the gradle/verification-metadata.xml file. For more on how to do this, please refer to https://docs.gradle.org/8.14.3/userguide/dependency_verification.html#sec:troubleshooting-verification in the Gradle documentation.
These files failed verification:
- GRADLE_USER_HOME/caches/modules-2/files-2.1/com.github.spotbugs/spotbugs-annotations/4.9.8/ca4a2783a6123e67124fd7feb4caccd2e2ac9a73/spotbugs-annotations-4.9.8.jar (signature: GRADLE_USER_HOME/caches/modules-2/files-2.1/com.github.spotbugs/spotbugs-annotations/4.9.8/380f9dd1358df3a1b887809e045f3c8d50f2c543/spotbugs-annotations-4.9.8.jar.asc)
- GRADLE_USER_HOME/caches/modules-2/files-2.1/com.github.spotbugs/spotbugs-annotations/4.9.8/f5dbfb5fbab027e81f25d19be0dfc4891328dffc/spotbugs-annotations-4.9.8.module (signature: GRADLE_USER_HOME/caches/modules-2/files-2.1/com.github.spotbugs/spotbugs-annotations/4.9.8/c213284c70e1f095b3a224ddcfa135f647dff6cc/spotbugs-annotations-4.9.8.module.asc)
- GRADLE_USER_HOME/caches/modules-2/files-2.1/com.github.spotbugs/spotbugs/4.9.8/1c828a7c132fdb17d26f01c58cb6fd8e2d2d804c/spotbugs-4.9.8.module (signature: GRADLE_USER_HOME/caches/modules-2/files-2.1/com.github.spotbugs/spotbugs/4.9.8/5f8c15edfc33f3d8b615143a199c13d05801f864/spotbugs-4.9.8.module.asc)
- GRADLE_USER_HOME/caches/modules-2/files-2.1/com.github.spotbugs/spotbugs/4.9.8/661dba9d1f4d027591b2b4102e0f493bb4c0691b/spotbugs-4.9.8.jar (signature: GRADLE_USER_HOME/caches/modules-2/files-2.1/com.github.spotbugs/spotbugs/4.9.8/223c1741029cce0bc150af85be7979ea1983578f/spotbugs-4.9.8.jar.asc)
- GRADLE_USER_HOME/caches/modules-2/files-2.1/com.github.stephenc.jcip/jcip-annotations/1.0-1/bdccebfbbbdd66fe56dcdf3bdee7b97a853cccc5/jcip-annotations-1.0-1.pom (signature: GRADLE_USER_HOME/caches/modules-2/files-2.1/com.github.stephenc.jcip/jcip-annotations/1.0-1/6384a3de49584e3859a4811ea1dd92a99eaf0b1b/jcip-annotations-1.0-1.pom.asc)
- GRADLE_USER_HOME/caches/modules-2/files-2.1/com.github.stephenc.jcip/jcip-annotations/1.0-1/ef31541dd28ae2cefdd17c7ebf352d93e9058c63/jcip-annotations-1.0-1.jar (signature: GRADLE_USER_HOME/caches/modules-2/files-2.1/com.github.stephenc.jcip/jcip-annotations/1.0-1/bceb3fe8c5ac3e9d87d673f03fc38acbcf6ed817/jcip-annotations-1.0-1.jar.asc)
- GRADLE_USER_HOME/caches/modules-2/files-2.1/jaxen/jaxen-parent/2.0.0/d311145c4f8835088b86fb8446d725816b03bcca/jaxen-parent-2.0.0.pom (signature: GRADLE_USER_HOME/caches/modules-2/files-2.1/jaxen/jaxen-parent/2.0.0/3e6599ad1b73a0c262eb74a726204b2c171fa767/jaxen-parent-2.0.0.pom.asc)
- GRADLE_USER_HOME/caches/modules-2/files-2.1/jaxen/jaxen/2.0.0/81346e6db971f2ce5e6eb994fd112b9f91986ee/jaxen-2.0.0.pom (signature: GRADLE_USER_HOME/caches/modules-2/files-2.1/jaxen/jaxen/2.0.0/e4a6c2fd9be9809402cba48b050976ceacd0b6c6/jaxen-2.0.0.pom.asc)
- GRADLE_USER_HOME/caches/modules-2/files-2.1/jaxen/jaxen/2.0.0/bd6a33b0fda054a5678010df843cc999f288dc6c/jaxen-2.0.0.jar (signature: GRADLE_USER_HOME/caches/modules-2/files-2.1/jaxen/jaxen/2.0.0/d0ee7d76fdacd99ec3a80f73765d67f0fda6b553/jaxen-2.0.0.jar.asc)
- GRADLE_USER_HOME/caches/modules-2/files-2.1/org.apache.bcel/bcel/6.11.0/8d800a87a4a7e09b1d3e634725806faf11a05006/bcel-6.11.0.jar (signature: GRADLE_USER_HOME/caches/modules-2/files-2.1/org.apache.bcel/bcel/6.11.0/e943e97ffc4d17f082e77d66087064569ca33e48/bcel-6.11.0.jar.asc)
- GRADLE_USER_HOME/caches/modules-2/files-2.1/org.apache.bcel/bcel/6.11.0/a6dc778453e0f1f5bf5a6eb4543a41c46f7fc52c/bcel-6.11.0.pom (signature: GRADLE_USER_HOME/caches/modules-2/files-2.1/org.apache.bcel/bcel/6.11.0/f9fe3141561c7e05da7c313b3c54bed2d3cf7142/bcel-6.11.0.pom.asc)
- GRADLE_USER_HOME/caches/modules-2/files-2.1/org.dom4j/dom4j/2.2.0/52368b1da663abd44a866c4fe4f62c8d8695204a/dom4j-2.2.0.jar (signature: GRADLE_USER_HOME/caches/modules-2/files-2.1/org.dom4j/dom4j/2.2.0/31705be97f03078d9a488e4752661229802cc909/dom4j-2.2.0.jar.asc)
- GRADLE_USER_HOME/caches/modules-2/files-2.1/org.dom4j/dom4j/2.2.0/ef7e4913b0babeef1f6dce2cf45aae8d512715e5/dom4j-2.2.0.module (signature: GRADLE_USER_HOME/caches/modules-2/files-2.1/org.dom4j/dom4j/2.2.0/4a62363ed21fc9b8f0d6311628a79b891af06f76/dom4j-2.2.0.module.asc)
GRADLE_USER_HOME = /home/jenkins/.gradle
These files failed verification:
- GRADLE_USER_HOME/caches/modules-2/files-2.1/com.github.spotbugs/spotbugs-annotations/4.9.8/ca4a2783a6123e67124fd7feb4caccd2e2ac9a73/spotbugs-annotations-4.9.8.jar (signature: GRADLE_USER_HOME/caches/modules-2/files-2.1/com.github.spotbugs/spotbugs-annotations/4.9.8/380f9dd1358df3a1b887809e045f3c8d50f2c543/spotbugs-annotations-4.9.8.jar.asc)
- GRADLE_USER_HOME/caches/modules-2/files-2.1/com.github.spotbugs/spotbugs-annotations/4.9.8/f5dbfb5fbab027e81f25d19be0dfc4891328dffc/spotbugs-annotations-4.9.8.module (signature: GRADLE_USER_HOME/caches/modules-2/files-2.1/com.github.spotbugs/spotbugs-annotations/4.9.8/c213284c70e1f095b3a224ddcfa135f647dff6cc/spotbugs-annotations-4.9.8.module.asc)
- GRADLE_USER_HOME/caches/modules-2/files-2.1/com.github.spotbugs/spotbugs/4.9.8/1c828a7c132fdb17d26f01c58cb6fd8e2d2d804c/spotbugs-4.9.8.module (signature: GRADLE_USER_HOME/caches/modules-2/files-2.1/com.github.spotbugs/spotbugs/4.9.8/5f8c15edfc33f3d8b615143a199c13d05801f864/spotbugs-4.9.8.module.asc)
- GRADLE_USER_HOME/caches/modules-2/files-2.1/com.github.spotbugs/spotbugs/4.9.8/661dba9d1f4d027591b2b4102e0f493bb4c0691b/spotbugs-4.9.8.jar (signature: GRADLE_USER_HOME/caches/modules-2/files-2.1/com.github.spotbugs/spotbugs/4.9.8/223c1741029cce0bc150af85be7979ea1983578f/spotbugs-4.9.8.jar.asc)
- GRADLE_USER_HOME/caches/modules-2/files-2.1/com.github.stephenc.jcip/jcip-annotations/1.0-1/bdccebfbbbdd66fe56dcdf3bdee7b97a853cccc5/jcip-annotations-1.0-1.pom (signature: GRADLE_USER_HOME/caches/modules-2/files-2.1/com.github.stephenc.jcip/jcip-annotations/1.0-1/6384a3de49584e3859a4811ea1dd92a99eaf0b1b/jcip-annotations-1.0-1.pom.asc)
- GRADLE_USER_HOME/caches/modules-2/files-2.1/com.github.stephenc.jcip/jcip-annotations/1.0-1/ef31541dd28ae2cefdd17c7ebf352d93e9058c63/jcip-annotations-1.0-1.jar (signature: GRADLE_USER_HOME/caches/modules-2/files-2.1/com.github.stephenc.jcip/jcip-annotations/1.0-1/bceb3fe8c5ac3e9d87d673f03fc38acbcf6ed817/jcip-annotations-1.0-1.jar.asc)
- GRADLE_USER_HOME/caches/modules-2/files-2.1/jaxen/jaxen-parent/2.0.0/d311145c4f8835088b86fb8446d725816b03bcca/jaxen-parent-2.0.0.pom (signature: GRADLE_USER_HOME/caches/modules-2/files-2.1/jaxen/jaxen-parent/2.0.0/3e6599ad1b73a0c262eb74a726204b2c171fa767/jaxen-parent-2.0.0.pom.asc)
- GRADLE_USER_HOME/caches/modules-2/files-2.1/jaxen/jaxen/2.0.0/81346e6db971f2ce5e6eb994fd112b9f91986ee/jaxen-2.0.0.pom (signature: GRADLE_USER_HOME/caches/modules-2/files-2.1/jaxen/jaxen/2.0.0/e4a6c2fd9be9809402cba48b050976ceacd0b6c6/jaxen-2.0.0.pom.asc)
- GRADLE_USER_HOME/caches/modules-2/files-2.1/jaxen/jaxen/2.0.0/bd6a33b0fda054a5678010df843cc999f288dc6c/jaxen-2.0.0.jar (signature: GRADLE_USER_HOME/caches/modules-2/files-2.1/jaxen/jaxen/2.0.0/d0ee7d76fdacd99ec3a80f73765d67f0fda6b553/jaxen-2.0.0.jar.asc)
- GRADLE_USER_HOME/caches/modules-2/files-2.1/org.apache.bcel/bcel/6.11.0/8d800a87a4a7e09b1d3e634725806faf11a05006/bcel-6.11.0.jar (signature: GRADLE_USER_HOME/caches/modules-2/files-2.1/org.apache.bcel/bcel/6.11.0/e943e97ffc4d17f082e77d66087064569ca33e48/bcel-6.11.0.jar.asc)
- GRADLE_USER_HOME/caches/modules-2/files-2.1/org.apache.bcel/bcel/6.11.0/a6dc778453e0f1f5bf5a6eb4543a41c46f7fc52c/bcel-6.11.0.pom (signature: GRADLE_USER_HOME/caches/modules-2/files-2.1/org.apache.bcel/bcel/6.11.0/f9fe3141561c7e05da7c313b3c54bed2d3cf7142/bcel-6.11.0.pom.asc)
- GRADLE_USER_HOME/caches/modules-2/files-2.1/org.dom4j/dom4j/2.2.0/52368b1da663abd44a866c4fe4f62c8d8695204a/dom4j-2.2.0.jar (signature: GRADLE_USER_HOME/caches/modules-2/files-2.1/org.dom4j/dom4j/2.2.0/31705be97f03078d9a488e4752661229802cc909/dom4j-2.2.0.jar.asc)
- GRADLE_USER_HOME/caches/modules-2/files-2.1/org.dom4j/dom4j/2.2.0/ef7e4913b0babeef1f6dce2cf45aae8d512715e5/dom4j-2.2.0.module (signature: GRADLE_USER_HOME/caches/modules-2/files-2.1/org.dom4j/dom4j/2.2.0/4a62363ed21fc9b8f0d6311628a79b891af06f76/dom4j-2.2.0.module.asc)
GRADLE_USER_HOME = /home/jenkins/.gradle
Open this report for more details: file://<https://ci-builds.apache.org/job/JMeter/job/JMeter-trunk/ws/build/reports/dependency-verification/at-1762938448319/dependency-verification-report.html>
* Try:
> Run with --stacktrace option to get the stack trace.
> Run with --info or --debug option to get more log output.
> Get more help at https://help.gradle.org.
==============================================================================
11: Task failed with an exception.
-----------
* What went wrong:
Execution failed for task ':src:functions:checkstyleMain'.
> Dependency verification failed for configuration ':src:functions:checkstyle':
- On artifact bcel-6.11.0.jar (org.apache.bcel:bcel:6.11.0) in repository 'MavenRepo': Artifact was signed with key '2DB4F1EF0FA761ECC4EA935C86FDC7E2A11262CB' (Gary David Gregory (Code signing key) <gg...@apache.org>) and passed verification but the key isn't in your trusted keys list.
- On artifact bcel-6.11.0.pom (org.apache.bcel:bcel:6.11.0) in repository 'MavenRepo': Artifact was signed with key '2DB4F1EF0FA761ECC4EA935C86FDC7E2A11262CB' (Gary David Gregory (Code signing key) <gg...@apache.org>) and passed verification but the key isn't in your trusted keys list.
- On artifact dom4j-2.2.0.jar (org.dom4j:dom4j:2.2.0) in repository 'MavenRepo': Artifact was signed with key '8F9A3C6D105B9F57844A721D79E193516BE7998F' (Filip Jirsák <fi...@jirsak.org>) and passed verification but the key isn't in your trusted keys list.
- On artifact dom4j-2.2.0.module (org.dom4j:dom4j:2.2.0) in repository 'MavenRepo': Artifact was signed with key '8F9A3C6D105B9F57844A721D79E193516BE7998F' (Filip Jirsák <fi...@jirsak.org>) and passed verification but the key isn't in your trusted keys list.
- On artifact jaxen-2.0.0.jar (jaxen:jaxen:2.0.0) in repository 'MavenRepo': Artifact was signed with key 'CA491704D613780D2BEE00F2C6FC46EB51CF569C' and passed verification but the key isn't in your trusted keys list.
- On artifact jaxen-2.0.0.pom (jaxen:jaxen:2.0.0) in repository 'MavenRepo': Artifact was signed with key 'CA491704D613780D2BEE00F2C6FC46EB51CF569C' and passed verification but the key isn't in your trusted keys list.
- On artifact jaxen-parent-2.0.0.pom (jaxen:jaxen-parent:2.0.0) in repository 'MavenRepo': Artifact was signed with key 'CA491704D613780D2BEE00F2C6FC46EB51CF569C' and passed verification but the key isn't in your trusted keys list.
- On artifact jcip-annotations-1.0-1.jar (com.github.stephenc.jcip:jcip-annotations:1.0-1) in repository 'MavenRepo': Artifact was signed with key '042B29E928995B9DB963C636C7CA19B7B620D787' (Stephen Connolly <st...@apache.org>) and passed verification but the key isn't in your trusted keys list.
- On artifact jcip-annotations-1.0-1.pom (com.github.stephenc.jcip:jcip-annotations:1.0-1) in repository 'MavenRepo': Artifact was signed with key '042B29E928995B9DB963C636C7CA19B7B620D787' (Stephen Connolly <st...@apache.org>) and passed verification but the key isn't in your trusted keys list.
- On artifact spotbugs-4.9.8.jar (com.github.spotbugs:spotbugs:4.9.8) in repository 'MavenRepo': Artifact was signed with key 'D878D4A823EAE731B729D1A8D2151178A123C97F' (Kengo TODA <sk...@gmail.com>) and passed verification but the key isn't in your trusted keys list.
- On artifact spotbugs-4.9.8.module (com.github.spotbugs:spotbugs:4.9.8) in repository 'MavenRepo': Artifact was signed with key 'D878D4A823EAE731B729D1A8D2151178A123C97F' (Kengo TODA <sk...@gmail.com>) and passed verification but the key isn't in your trusted keys list.
- On artifact spotbugs-annotations-4.9.8.jar (com.github.spotbugs:spotbugs-annotations:4.9.8) in repository 'MavenRepo': Artifact was signed with key 'D878D4A823EAE731B729D1A8D2151178A123C97F' (Kengo TODA <sk...@gmail.com>) and passed verification but the key isn't in your trusted keys list.
- On artifact spotbugs-annotations-4.9.8.module (com.github.spotbugs:spotbugs-annotations:4.9.8) in repository 'MavenRepo': Artifact was signed with key 'D878D4A823EAE731B729D1A8D2151178A123C97F' (Kengo TODA <sk...@gmail.com>) and passed verification but the key isn't in your trusted keys list.
If the artifacts are trustworthy, you will need to update the gradle/verification-metadata.xml file. For more on how to do this, please refer to https://docs.gradle.org/8.14.3/userguide/dependency_verification.html#sec:troubleshooting-verification in the Gradle documentation.
These files failed verification:
- GRADLE_USER_HOME/caches/modules-2/files-2.1/com.github.spotbugs/spotbugs-annotations/4.9.8/ca4a2783a6123e67124fd7feb4caccd2e2ac9a73/spotbugs-annotations-4.9.8.jar (signature: GRADLE_USER_HOME/caches/modules-2/files-2.1/com.github.spotbugs/spotbugs-annotations/4.9.8/380f9dd1358df3a1b887809e045f3c8d50f2c543/spotbugs-annotations-4.9.8.jar.asc)
- GRADLE_USER_HOME/caches/modules-2/files-2.1/com.github.spotbugs/spotbugs-annotations/4.9.8/f5dbfb5fbab027e81f25d19be0dfc4891328dffc/spotbugs-annotations-4.9.8.module (signature: GRADLE_USER_HOME/caches/modules-2/files-2.1/com.github.spotbugs/spotbugs-annotations/4.9.8/c213284c70e1f095b3a224ddcfa135f647dff6cc/spotbugs-annotations-4.9.8.module.asc)
- GRADLE_USER_HOME/caches/modules-2/files-2.1/com.github.spotbugs/spotbugs/4.9.8/1c828a7c132fdb17d26f01c58cb6fd8e2d2d804c/spotbugs-4.9.8.module (signature: GRADLE_USER_HOME/caches/modules-2/files-2.1/com.github.spotbugs/spotbugs/4.9.8/5f8c15edfc33f3d8b615143a199c13d05801f864/spotbugs-4.9.8.module.asc)
- GRADLE_USER_HOME/caches/modules-2/files-2.1/com.github.spotbugs/spotbugs/4.9.8/661dba9d1f4d027591b2b4102e0f493bb4c0691b/spotbugs-4.9.8.jar (signature: GRADLE_USER_HOME/caches/modules-2/files-2.1/com.github.spotbugs/spotbugs/4.9.8/223c1741029cce0bc150af85be7979ea1983578f/spotbugs-4.9.8.jar.asc)
- GRADLE_USER_HOME/caches/modules-2/files-2.1/com.github.stephenc.jcip/jcip-annotations/1.0-1/bdccebfbbbdd66fe56dcdf3bdee7b97a853cccc5/jcip-annotations-1.0-1.pom (signature: GRADLE_USER_HOME/caches/modules-2/files-2.1/com.github.stephenc.jcip/jcip-annotations/1.0-1/6384a3de49584e3859a4811ea1dd92a99eaf0b1b/jcip-annotations-1.0-1.pom.asc)
- GRADLE_USER_HOME/caches/modules-2/files-2.1/com.github.stephenc.jcip/jcip-annotations/1.0-1/ef31541dd28ae2cefdd17c7ebf352d93e9058c63/jcip-annotations-1.0-1.jar (signature: GRADLE_USER_HOME/caches/modules-2/files-2.1/com.github.stephenc.jcip/jcip-annotations/1.0-1/bceb3fe8c5ac3e9d87d673f03fc38acbcf6ed817/jcip-annotations-1.0-1.jar.asc)
- GRADLE_USER_HOME/caches/modules-2/files-2.1/jaxen/jaxen-parent/2.0.0/d311145c4f8835088b86fb8446d725816b03bcca/jaxen-parent-2.0.0.pom (signature: GRADLE_USER_HOME/caches/modules-2/files-2.1/jaxen/jaxen-parent/2.0.0/3e6599ad1b73a0c262eb74a726204b2c171fa767/jaxen-parent-2.0.0.pom.asc)
- GRADLE_USER_HOME/caches/modules-2/files-2.1/jaxen/jaxen/2.0.0/81346e6db971f2ce5e6eb994fd112b9f91986ee/jaxen-2.0.0.pom (signature: GRADLE_USER_HOME/caches/modules-2/files-2.1/jaxen/jaxen/2.0.0/e4a6c2fd9be9809402cba48b050976ceacd0b6c6/jaxen-2.0.0.pom.asc)
- GRADLE_USER_HOME/caches/modules-2/files-2.1/jaxen/jaxen/2.0.0/bd6a33b0fda054a5678010df843cc999f288dc6c/jaxen-2.0.0.jar (signature: GRADLE_USER_HOME/caches/modules-2/files-2.1/jaxen/jaxen/2.0.0/d0ee7d76fdacd99ec3a80f73765d67f0fda6b553/jaxen-2.0.0.jar.asc)
- GRADLE_USER_HOME/caches/modules-2/files-2.1/org.apache.bcel/bcel/6.11.0/8d800a87a4a7e09b1d3e634725806faf11a05006/bcel-6.11.0.jar (signature: GRADLE_USER_HOME/caches/modules-2/files-2.1/org.apache.bcel/bcel/6.11.0/e943e97ffc4d17f082e77d66087064569ca33e48/bcel-6.11.0.jar.asc)
- GRADLE_USER_HOME/caches/modules-2/files-2.1/org.apache.bcel/bcel/6.11.0/a6dc778453e0f1f5bf5a6eb4543a41c46f7fc52c/bcel-6.11.0.pom (signature: GRADLE_USER_HOME/caches/modules-2/files-2.1/org.apache.bcel/bcel/6.11.0/f9fe3141561c7e05da7c313b3c54bed2d3cf7142/bcel-6.11.0.pom.asc)
- GRADLE_USER_HOME/caches/modules-2/files-2.1/org.dom4j/dom4j/2.2.0/52368b1da663abd44a866c4fe4f62c8d8695204a/dom4j-2.2.0.jar (signature: GRADLE_USER_HOME/caches/modules-2/files-2.1/org.dom4j/dom4j/2.2.0/31705be97f03078d9a488e4752661229802cc909/dom4j-2.2.0.jar.asc)
- GRADLE_USER_HOME/caches/modules-2/files-2.1/org.dom4j/dom4j/2.2.0/ef7e4913b0babeef1f6dce2cf45aae8d512715e5/dom4j-2.2.0.module (signature: GRADLE_USER_HOME/caches/modules-2/files-2.1/org.dom4j/dom4j/2.2.0/4a62363ed21fc9b8f0d6311628a79b891af06f76/dom4j-2.2.0.module.asc)
GRADLE_USER_HOME = /home/jenkins/.gradle
These files failed verification:
- GRADLE_USER_HOME/caches/modules-2/files-2.1/com.github.spotbugs/spotbugs-annotations/4.9.8/ca4a2783a6123e67124fd7feb4caccd2e2ac9a73/spotbugs-annotations-4.9.8.jar (signature: GRADLE_USER_HOME/caches/modules-2/files-2.1/com.github.spotbugs/spotbugs-annotations/4.9.8/380f9dd1358df3a1b887809e045f3c8d50f2c543/spotbugs-annotations-4.9.8.jar.asc)
- GRADLE_USER_HOME/caches/modules-2/files-2.1/com.github.spotbugs/spotbugs-annotations/4.9.8/f5dbfb5fbab027e81f25d19be0dfc4891328dffc/spotbugs-annotations-4.9.8.module (signature: GRADLE_USER_HOME/caches/modules-2/files-2.1/com.github.spotbugs/spotbugs-annotations/4.9.8/c213284c70e1f095b3a224ddcfa135f647dff6cc/spotbugs-annotations-4.9.8.module.asc)
- GRADLE_USER_HOME/caches/modules-2/files-2.1/com.github.spotbugs/spotbugs/4.9.8/1c828a7c132fdb17d26f01c58cb6fd8e2d2d804c/spotbugs-4.9.8.module (signature: GRADLE_USER_HOME/caches/modules-2/files-2.1/com.github.spotbugs/spotbugs/4.9.8/5f8c15edfc33f3d8b615143a199c13d05801f864/spotbugs-4.9.8.module.asc)
- GRADLE_USER_HOME/caches/modules-2/files-2.1/com.github.spotbugs/spotbugs/4.9.8/661dba9d1f4d027591b2b4102e0f493bb4c0691b/spotbugs-4.9.8.jar (signature: GRADLE_USER_HOME/caches/modules-2/files-2.1/com.github.spotbugs/spotbugs/4.9.8/223c1741029cce0bc150af85be7979ea1983578f/spotbugs-4.9.8.jar.asc)
- GRADLE_USER_HOME/caches/modules-2/files-2.1/com.github.stephenc.jcip/jcip-annotations/1.0-1/bdccebfbbbdd66fe56dcdf3bdee7b97a853cccc5/jcip-annotations-1.0-1.pom (signature: GRADLE_USER_HOME/caches/modules-2/files-2.1/com.github.stephenc.jcip/jcip-annotations/1.0-1/6384a3de49584e3859a4811ea1dd92a99eaf0b1b/jcip-annotations-1.0-1.pom.asc)
- GRADLE_USER_HOME/caches/modules-2/files-2.1/com.github.stephenc.jcip/jcip-annotations/1.0-1/ef31541dd28ae2cefdd17c7ebf352d93e9058c63/jcip-annotations-1.0-1.jar (signature: GRADLE_USER_HOME/caches/modules-2/files-2.1/com.github.stephenc.jcip/jcip-annotations/1.0-1/bceb3fe8c5ac3e9d87d673f03fc38acbcf6ed817/jcip-annotations-1.0-1.jar.asc)
- GRADLE_USER_HOME/caches/modules-2/files-2.1/jaxen/jaxen-parent/2.0.0/d311145c4f8835088b86fb8446d725816b03bcca/jaxen-parent-2.0.0.pom (signature: GRADLE_USER_HOME/caches/modules-2/files-2.1/jaxen/jaxen-parent/2.0.0/3e6599ad1b73a0c262eb74a726204b2c171fa767/jaxen-parent-2.0.0.pom.asc)
- GRADLE_USER_HOME/caches/modules-2/files-2.1/jaxen/jaxen/2.0.0/81346e6db971f2ce5e6eb994fd112b9f91986ee/jaxen-2.0.0.pom (signature: GRADLE_USER_HOME/caches/modules-2/files-2.1/jaxen/jaxen/2.0.0/e4a6c2fd9be9809402cba48b050976ceacd0b6c6/jaxen-2.0.0.pom.asc)
- GRADLE_USER_HOME/caches/modules-2/files-2.1/jaxen/jaxen/2.0.0/bd6a33b0fda054a5678010df843cc999f288dc6c/jaxen-2.0.0.jar (signature: GRADLE_USER_HOME/caches/modules-2/files-2.1/jaxen/jaxen/2.0.0/d0ee7d76fdacd99ec3a80f73765d67f0fda6b553/jaxen-2.0.0.jar.asc)
- GRADLE_USER_HOME/caches/modules-2/files-2.1/org.apache.bcel/bcel/6.11.0/8d800a87a4a7e09b1d3e634725806faf11a05006/bcel-6.11.0.jar (signature: GRADLE_USER_HOME/caches/modules-2/files-2.1/org.apache.bcel/bcel/6.11.0/e943e97ffc4d17f082e77d66087064569ca33e48/bcel-6.11.0.jar.asc)
- GRADLE_USER_HOME/caches/modules-2/files-2.1/org.apache.bcel/bcel/6.11.0/a6dc778453e0f1f5bf5a6eb4543a41c46f7fc52c/bcel-6.11.0.pom (signature: GRADLE_USER_HOME/caches/modules-2/files-2.1/org.apache.bcel/bcel/6.11.0/f9fe3141561c7e05da7c313b3c54bed2d3cf7142/bcel-6.11.0.pom.asc)
- GRADLE_USER_HOME/caches/modules-2/files-2.1/org.dom4j/dom4j/2.2.0/52368b1da663abd44a866c4fe4f62c8d8695204a/dom4j-2.2.0.jar (signature: GRADLE_USER_HOME/caches/modules-2/files-2.1/org.dom4j/dom4j/2.2.0/31705be97f03078d9a488e4752661229802cc909/dom4j-2.2.0.jar.asc)
- GRADLE_USER_HOME/caches/modules-2/files-2.1/org.dom4j/dom4j/2.2.0/ef7e4913b0babeef1f6dce2cf45aae8d512715e5/dom4j-2.2.0.module (signature: GRADLE_USER_HOME/caches/modules-2/files-2.1/org.dom4j/dom4j/2.2.0/4a62363ed21fc9b8f0d6311628a79b891af06f76/dom4j-2.2.0.module.asc)
GRADLE_USER_HOME = /home/jenkins/.gradle
Open this report for more details: file://<https://ci-builds.apache.org/job/JMeter/job/JMeter-trunk/ws/build/reports/dependency-verification/at-1762938448319/dependency-verification-report.html>
* Try:
> Run with --stacktrace option to get the stack trace.
> Run with --info or --debug option to get more log output.
> Get more help at https://help.gradle.org.
==============================================================================
12: Task failed with an exception.
-----------
* What went wrong:
Execution failed for task ':src:launcher:spotbugsMain'.
> A failure occurred while executing com.github.spotbugs.snom.internal.SpotBugsRunnerForHybrid$SpotBugsExecutor
> Could not isolate value com.github.spotbugs.snom.internal.SpotBugsRunnerForHybrid$SpotBugsWorkParameters_Decorated@2153cb1e of type SpotBugsRunnerForHybrid.SpotBugsWorkParameters
> Dependency verification failed for configuration ':src:launcher:spotbugs':
- On artifact bcel-6.11.0.jar (org.apache.bcel:bcel:6.11.0) in repository 'MavenRepo': Artifact was signed with key '2DB4F1EF0FA761ECC4EA935C86FDC7E2A11262CB' (Gary David Gregory (Code signing key) <gg...@apache.org>) and passed verification but the key isn't in your trusted keys list.
- On artifact bcel-6.11.0.pom (org.apache.bcel:bcel:6.11.0) in repository 'MavenRepo': Artifact was signed with key '2DB4F1EF0FA761ECC4EA935C86FDC7E2A11262CB' (Gary David Gregory (Code signing key) <gg...@apache.org>) and passed verification but the key isn't in your trusted keys list.
- On artifact dom4j-2.2.0.jar (org.dom4j:dom4j:2.2.0) in repository 'MavenRepo': Artifact was signed with key '8F9A3C6D105B9F57844A721D79E193516BE7998F' (Filip Jirsák <fi...@jirsak.org>) and passed verification but the key isn't in your trusted keys list.
- On artifact dom4j-2.2.0.module (org.dom4j:dom4j:2.2.0) in repository 'MavenRepo': Artifact was signed with key '8F9A3C6D105B9F57844A721D79E193516BE7998F' (Filip Jirsák <fi...@jirsak.org>) and passed verification but the key isn't in your trusted keys list.
- On artifact jaxen-2.0.0.jar (jaxen:jaxen:2.0.0) in repository 'MavenRepo': Artifact was signed with key 'CA491704D613780D2BEE00F2C6FC46EB51CF569C' and passed verification but the key isn't in your trusted keys list.
- On artifact jaxen-2.0.0.pom (jaxen:jaxen:2.0.0) in repository 'MavenRepo': Artifact was signed with key 'CA491704D613780D2BEE00F2C6FC46EB51CF569C' and passed verification but the key isn't in your trusted keys list.
- On artifact jaxen-parent-2.0.0.pom (jaxen:jaxen-parent:2.0.0) in repository 'MavenRepo': Artifact was signed with key 'CA491704D613780D2BEE00F2C6FC46EB51CF569C' and passed verification but the key isn't in your trusted keys list.
- On artifact jcip-annotations-1.0-1.jar (com.github.stephenc.jcip:jcip-annotations:1.0-1) in repository 'MavenRepo': Artifact was signed with key '042B29E928995B9DB963C636C7CA19B7B620D787' (Stephen Connolly <st...@apache.org>) and passed verification but the key isn't in your trusted keys list.
- On artifact jcip-annotations-1.0-1.pom (com.github.stephenc.jcip:jcip-annotations:1.0-1) in repository 'MavenRepo': Artifact was signed with key '042B29E928995B9DB963C636C7CA19B7B620D787' (Stephen Connolly <st...@apache.org>) and passed verification but the key isn't in your trusted keys list.
- On artifact spotbugs-4.9.8.jar (com.github.spotbugs:spotbugs:4.9.8) in repository 'MavenRepo': Artifact was signed with key 'D878D4A823EAE731B729D1A8D2151178A123C97F' (Kengo TODA <sk...@gmail.com>) and passed verification but the key isn't in your trusted keys list.
- On artifact spotbugs-4.9.8.module (com.github.spotbugs:spotbugs:4.9.8) in repository 'MavenRepo': Artifact was signed with key 'D878D4A823EAE731B729D1A8D2151178A123C97F' (Kengo TODA <sk...@gmail.com>) and passed verification but the key isn't in your trusted keys list.
- On artifact spotbugs-annotations-4.9.8.jar (com.github.spotbugs:spotbugs-annotations:4.9.8) in repository 'MavenRepo': Artifact was signed with key 'D878D4A823EAE731B729D1A8D2151178A123C97F' (Kengo TODA <sk...@gmail.com>) and passed verification but the key isn't in your trusted keys list.
- On artifact spotbugs-annotations-4.9.8.module (com.github.spotbugs:spotbugs-annotations:4.9.8) in repository 'MavenRepo': Artifact was signed with key 'D878D4A823EAE731B729D1A8D2151178A123C97F' (Kengo TODA <sk...@gmail.com>) and passed verification but the key isn't in your trusted keys list.
If the artifacts are trustworthy, you will need to update the gradle/verification-metadata.xml file. For more on how to do this, please refer to https://docs.gradle.org/8.14.3/userguide/dependency_verification.html#sec:troubleshooting-verification in the Gradle documentation.
These files failed verification:
- GRADLE_USER_HOME/caches/modules-2/files-2.1/com.github.spotbugs/spotbugs-annotations/4.9.8/ca4a2783a6123e67124fd7feb4caccd2e2ac9a73/spotbugs-annotations-4.9.8.jar (signature: GRADLE_USER_HOME/caches/modules-2/files-2.1/com.github.spotbugs/spotbugs-annotations/4.9.8/380f9dd1358df3a1b887809e045f3c8d50f2c543/spotbugs-annotations-4.9.8.jar.asc)
- GRADLE_USER_HOME/caches/modules-2/files-2.1/com.github.spotbugs/spotbugs-annotations/4.9.8/f5dbfb5fbab027e81f25d19be0dfc4891328dffc/spotbugs-annotations-4.9.8.module (signature: GRADLE_USER_HOME/caches/modules-2/files-2.1/com.github.spotbugs/spotbugs-annotations/4.9.8/c213284c70e1f095b3a224ddcfa135f647dff6cc/spotbugs-annotations-4.9.8.module.asc)
- GRADLE_USER_HOME/caches/modules-2/files-2.1/com.github.spotbugs/spotbugs/4.9.8/1c828a7c132fdb17d26f01c58cb6fd8e2d2d804c/spotbugs-4.9.8.module (signature: GRADLE_USER_HOME/caches/modules-2/files-2.1/com.github.spotbugs/spotbugs/4.9.8/5f8c15edfc33f3d8b615143a199c13d05801f864/spotbugs-4.9.8.module.asc)
- GRADLE_USER_HOME/caches/modules-2/files-2.1/com.github.spotbugs/spotbugs/4.9.8/661dba9d1f4d027591b2b4102e0f493bb4c0691b/spotbugs-4.9.8.jar (signature: GRADLE_USER_HOME/caches/modules-2/files-2.1/com.github.spotbugs/spotbugs/4.9.8/223c1741029cce0bc150af85be7979ea1983578f/spotbugs-4.9.8.jar.asc)
- GRADLE_USER_HOME/caches/modules-2/files-2.1/com.github.stephenc.jcip/jcip-annotations/1.0-1/bdccebfbbbdd66fe56dcdf3bdee7b97a853cccc5/jcip-annotations-1.0-1.pom (signature: GRADLE_USER_HOME/caches/modules-2/files-2.1/com.github.stephenc.jcip/jcip-annotations/1.0-1/6384a3de49584e3859a4811ea1dd92a99eaf0b1b/jcip-annotations-1.0-1.pom.asc)
- GRADLE_USER_HOME/caches/modules-2/files-2.1/com.github.stephenc.jcip/jcip-annotations/1.0-1/ef31541dd28ae2cefdd17c7ebf352d93e9058c63/jcip-annotations-1.0-1.jar (signature: GRADLE_USER_HOME/caches/modules-2/files-2.1/com.github.stephenc.jcip/jcip-annotations/1.0-1/bceb3fe8c5ac3e9d87d673f03fc38acbcf6ed817/jcip-annotations-1.0-1.jar.asc)
- GRADLE_USER_HOME/caches/modules-2/files-2.1/jaxen/jaxen-parent/2.0.0/d311145c4f8835088b86fb8446d725816b03bcca/jaxen-parent-2.0.0.pom (signature: GRADLE_USER_HOME/caches/modules-2/files-2.1/jaxen/jaxen-parent/2.0.0/3e6599ad1b73a0c262eb74a726204b2c171fa767/jaxen-parent-2.0.0.pom.asc)
- GRADLE_USER_HOME/caches/modules-2/files-2.1/jaxen/jaxen/2.0.0/81346e6db971f2ce5e6eb994fd112b9f91986ee/jaxen-2.0.0.pom (signature: GRADLE_USER_HOME/caches/modules-2/files-2.1/jaxen/jaxen/2.0.0/e4a6c2fd9be9809402cba48b050976ceacd0b6c6/jaxen-2.0.0.pom.asc)
- GRADLE_USER_HOME/caches/modules-2/files-2.1/jaxen/jaxen/2.0.0/bd6a33b0fda054a5678010df843cc999f288dc6c/jaxen-2.0.0.jar (signature: GRADLE_USER_HOME/caches/modules-2/files-2.1/jaxen/jaxen/2.0.0/d0ee7d76fdacd99ec3a80f73765d67f0fda6b553/jaxen-2.0.0.jar.asc)
- GRADLE_USER_HOME/caches/modules-2/files-2.1/org.apache.bcel/bcel/6.11.0/8d800a87a4a7e09b1d3e634725806faf11a05006/bcel-6.11.0.jar (signature: GRADLE_USER_HOME/caches/modules-2/files-2.1/org.apache.bcel/bcel/6.11.0/e943e97ffc4d17f082e77d66087064569ca33e48/bcel-6.11.0.jar.asc)
- GRADLE_USER_HOME/caches/modules-2/files-2.1/org.apache.bcel/bcel/6.11.0/a6dc778453e0f1f5bf5a6eb4543a41c46f7fc52c/bcel-6.11.0.pom (signature: GRADLE_USER_HOME/caches/modules-2/files-2.1/org.apache.bcel/bcel/6.11.0/f9fe3141561c7e05da7c313b3c54bed2d3cf7142/bcel-6.11.0.pom.asc)
- GRADLE_USER_HOME/caches/modules-2/files-2.1/org.dom4j/dom4j/2.2.0/52368b1da663abd44a866c4fe4f62c8d8695204a/dom4j-2.2.0.jar (signature: GRADLE_USER_HOME/caches/modules-2/files-2.1/org.dom4j/dom4j/2.2.0/31705be97f03078d9a488e4752661229802cc909/dom4j-2.2.0.jar.asc)
- GRADLE_USER_HOME/caches/modules-2/files-2.1/org.dom4j/dom4j/2.2.0/ef7e4913b0babeef1f6dce2cf45aae8d512715e5/dom4j-2.2.0.module (signature: GRADLE_USER_HOME/caches/modules-2/files-2.1/org.dom4j/dom4j/2.2.0/4a62363ed21fc9b8f0d6311628a79b891af06f76/dom4j-2.2.0.module.asc)
GRADLE_USER_HOME = /home/jenkins/.gradle
These files failed verification:
- GRADLE_USER_HOME/caches/modules-2/files-2.1/com.github.spotbugs/spotbugs-annotations/4.9.8/ca4a2783a6123e67124fd7feb4caccd2e2ac9a73/spotbugs-annotations-4.9.8.jar (signature: GRADLE_USER_HOME/caches/modules-2/files-2.1/com.github.spotbugs/spotbugs-annotations/4.9.8/380f9dd1358df3a1b887809e045f3c8d50f2c543/spotbugs-annotations-4.9.8.jar.asc)
- GRADLE_USER_HOME/caches/modules-2/files-2.1/com.github.spotbugs/spotbugs-annotations/4.9.8/f5dbfb5fbab027e81f25d19be0dfc4891328dffc/spotbugs-annotations-4.9.8.module (signature: GRADLE_USER_HOME/caches/modules-2/files-2.1/com.github.spotbugs/spotbugs-annotations/4.9.8/c213284c70e1f095b3a224ddcfa135f647dff6cc/spotbugs-annotations-4.9.8.module.asc)
- GRADLE_USER_HOME/caches/modules-2/files-2.1/com.github.spotbugs/spotbugs/4.9.8/1c828a7c132fdb17d26f01c58cb6fd8e2d2d804c/spotbugs-4.9.8.module (signature: GRADLE_USER_HOME/caches/modules-2/files-2.1/com.github.spotbugs/spotbugs/4.9.8/5f8c15edfc33f3d8b615143a199c13d05801f864/spotbugs-4.9.8.module.asc)
- GRADLE_USER_HOME/caches/modules-2/files-2.1/com.github.spotbugs/spotbugs/4.9.8/661dba9d1f4d027591b2b4102e0f493bb4c0691b/spotbugs-4.9.8.jar (signature: GRADLE_USER_HOME/caches/modules-2/files-2.1/com.github.spotbugs/spotbugs/4.9.8/223c1741029cce0bc150af85be7979ea1983578f/spotbugs-4.9.8.jar.asc)
- GRADLE_USER_HOME/caches/modules-2/files-2.1/com.github.stephenc.jcip/jcip-annotations/1.0-1/bdccebfbbbdd66fe56dcdf3bdee7b97a853cccc5/jcip-annotations-1.0-1.pom (signature: GRADLE_USER_HOME/caches/modules-2/files-2.1/com.github.stephenc.jcip/jcip-annotations/1.0-1/6384a3de49584e3859a4811ea1dd92a99eaf0b1b/jcip-annotations-1.0-1.pom.asc)
- GRADLE_USER_HOME/caches/modules-2/files-2.1/com.github.stephenc.jcip/jcip-annotations/1.0-1/ef31541dd28ae2cefdd17c7ebf352d93e9058c63/jcip-annotations-1.0-1.jar (signature: GRADLE_USER_HOME/caches/modules-2/files-2.1/com.github.stephenc.jcip/jcip-annotations/1.0-1/bceb3fe8c5ac3e9d87d673f03fc38acbcf6ed817/jcip-annotations-1.0-1.jar.asc)
- GRADLE_USER_HOME/caches/modules-2/files-2.1/jaxen/jaxen-parent/2.0.0/d311145c4f8835088b86fb8446d725816b03bcca/jaxen-parent-2.0.0.pom (signature: GRADLE_USER_HOME/caches/modules-2/files-2.1/jaxen/jaxen-parent/2.0.0/3e6599ad1b73a0c262eb74a726204b2c171fa767/jaxen-parent-2.0.0.pom.asc)
- GRADLE_USER_HOME/caches/modules-2/files-2.1/jaxen/jaxen/2.0.0/81346e6db971f2ce5e6eb994fd112b9f91986ee/jaxen-2.0.0.pom (signature: GRADLE_USER_HOME/caches/modules-2/files-2.1/jaxen/jaxen/2.0.0/e4a6c2fd9be9809402cba48b050976ceacd0b6c6/jaxen-2.0.0.pom.asc)
- GRADLE_USER_HOME/caches/modules-2/files-2.1/jaxen/jaxen/2.0.0/bd6a33b0fda054a5678010df843cc999f288dc6c/jaxen-2.0.0.jar (signature: GRADLE_USER_HOME/caches/modules-2/files-2.1/jaxen/jaxen/2.0.0/d0ee7d76fdacd99ec3a80f73765d67f0fda6b553/jaxen-2.0.0.jar.asc)
- GRADLE_USER_HOME/caches/modules-2/files-2.1/org.apache.bcel/bcel/6.11.0/8d800a87a4a7e09b1d3e634725806faf11a05006/bcel-6.11.0.jar (signature: GRADLE_USER_HOME/caches/modules-2/files-2.1/org.apache.bcel/bcel/6.11.0/e943e97ffc4d17f082e77d66087064569ca33e48/bcel-6.11.0.jar.asc)
- GRADLE_USER_HOME/caches/modules-2/files-2.1/org.apache.bcel/bcel/6.11.0/a6dc778453e0f1f5bf5a6eb4543a41c46f7fc52c/bcel-6.11.0.pom (signature: GRADLE_USER_HOME/caches/modules-2/files-2.1/org.apache.bcel/bcel/6.11.0/f9fe3141561c7e05da7c313b3c54bed2d3cf7142/bcel-6.11.0.pom.asc)
- GRADLE_USER_HOME/caches/modules-2/files-2.1/org.dom4j/dom4j/2.2.0/52368b1da663abd44a866c4fe4f62c8d8695204a/dom4j-2.2.0.jar (signature: GRADLE_USER_HOME/caches/modules-2/files-2.1/org.dom4j/dom4j/2.2.0/31705be97f03078d9a488e4752661229802cc909/dom4j-2.2.0.jar.asc)
- GRADLE_USER_HOME/caches/modules-2/files-2.1/org.dom4j/dom4j/2.2.0/ef7e4913b0babeef1f6dce2cf45aae8d512715e5/dom4j-2.2.0.module (signature: GRADLE_USER_HOME/caches/modules-2/files-2.1/org.dom4j/dom4j/2.2.0/4a62363ed21fc9b8f0d6311628a79b891af06f76/dom4j-2.2.0.module.asc)
GRADLE_USER_HOME = /home/jenkins/.gradle
Open this report for more details: file://<https://ci-builds.apache.org/job/JMeter/job/JMeter-trunk/ws/build/reports/dependency-verification/at-1762938448319/dependency-verification-report.html>
* Try:
> Run with --stacktrace option to get the stack trace.
> Run with --info or --debug option to get more log output.
> Get more help at https://help.gradle.org.
==============================================================================
Deprecated Gradle features were used in this build, making it incompatible with Gradle 9.0.
You can use '--warning-mode all' to show the individual deprecation warnings and determine if they come from your own scripts or plugins.
For more on this, please refer to https://docs.gradle.org/8.14.3/userguide/command_line_interface.html#sec:command_line_warnings in the Gradle documentation.
BUILD FAILED in 8m 3s
392 actionable tasks: 234 executed, 158 up-to-date
See the profiling report at: file://<https://ci-builds.apache.org/job/JMeter/job/JMeter-trunk/ws/build/reports/profile/profile-2025-11-12-09-07-34.html>
A fine-grained performance profile is available: use the --scan option.
Build step 'Invoke Gradle script' changed build result to FAILURE
Build step 'Invoke Gradle script' marked build as failure
Xvfb stopping
Archiving artifacts
Recording test results
[Checks API] No suitable checks publisher found.