You are viewing a plain text version of this content. The canonical link for it is here.
Posted to dev@lens.apache.org by "Raju Bairishetti (JIRA)" <ji...@apache.org> on 2017/11/22 02:47:00 UTC
[jira] [Created] (LENS-1488)
TestQueryService.testEstimateRejectionException test is failing
consistently
Raju Bairishetti created LENS-1488:
--------------------------------------
Summary: TestQueryService.testEstimateRejectionException test is failing consistently
Key: LENS-1488
URL: https://issues.apache.org/jira/browse/LENS-1488
Project: Apache Lens
Issue Type: Bug
Components: server
Reporter: Raju Bairishetti
TestQueryService.testEstimateRejectionException is failing.
{noformat}
Tests run: 70, Failures: 2, Errors: 0, Skipped: 0, Time elapsed: 333.018 sec <<< FAILURE! - in org.apache.lens.server.query.TestQueryService
testEstimateRejectionException(org.apache.lens.server.query.TestQueryService) Time elapsed: 5.145 sec <<< FAILURE!
java.lang.AssertionError: expected [true] but found [false]
at org.testng.Assert.fail(Assert.java:94)
at org.testng.Assert.failNotEquals(Assert.java:494)
at org.testng.Assert.assertTrue(Assert.java:42)
at org.testng.Assert.assertTrue(Assert.java:52)
at org.apache.lens.server.query.TestQueryService.testEstimateRejectionException(TestQueryService.java:2114)
testEstimateRejectionException(org.apache.lens.server.query.TestQueryService) Time elapsed: 4.269 sec <<< FAILURE!
java.lang.AssertionError: expected [true] but found [false]
at org.testng.Assert.fail(Assert.java:94)
at org.testng.Assert.failNotEquals(Assert.java:494)
at org.testng.Assert.assertTrue(Assert.java:42)
at org.testng.Assert.assertTrue(Assert.java:52)
at org.apache.lens.server.query.TestQueryService.testEstimateRejectionException(TestQueryService.java:2114)
Results :
Failed tests:
TestQueryService.testEstimateRejectionException:2114 expected [true] but found [false]
TestQueryService.testEstimateRejectionException:2114 expected [true] but found [false]
{noformat}
--
This message was sent by Atlassian JIRA
(v6.4.14#64029)