You are viewing a plain text version of this content. The canonical link for it is here.
Posted to notifications@directory.apache.org by Apache Jenkins Server <je...@builds.apache.org> on 2026/07/14 16:14:22 UTC
Build failed in Jenkins: Directory » dir-scimple #905
See <https://ci-builds.apache.org/job/Directory/job/dir-scimple/905/display/redirect?page=changes>
Changes:
[Brian Demers] Bump ch.qos.logback:logback-core from 1.5.34 to 1.5.35
[Brian Demers] Bump github/codeql-action/upload-sarif from 4.36.2 to 4.37.0
[Brian Demers] Bump actions/setup-java from 5.2.0 to 5.5.0
[Brian Demers] Bump actions/checkout from 6.0.3 to 7.0.0
[Brian Demers] Bump io.smallrye:jandex-maven-plugin from 3.5.3 to 3.6.0
[Brian Demers] Bump org.apache.maven.plugins:maven-enforcer-plugin from 3.6.2 to 3.6.3
[Brian Demers] Bump org.jacoco:jacoco-maven-plugin from 0.8.14 to 0.8.15
[Brian Demers] Bump org.apache.maven.plugins:maven-surefire-plugin from 3.5.5 to 3.5.6
------------------------------------------
Started by an SCM change
Running as SYSTEM
[EnvInject] - Loading node environment variables.
Building remotely on builds39 (ubuntu) in workspace <https://ci-builds.apache.org/job/Directory/job/dir-scimple/ws/>
The recommended git tool is: NONE
No credentials specified
> git rev-parse --resolve-git-dir <https://ci-builds.apache.org/job/Directory/job/dir-scimple/ws/.git> # timeout=10
Fetching changes from the remote Git repository
> git config remote.origin.url https://gitbox.apache.org/repos/asf/directory-scimple.git # timeout=10
Cleaning workspace
> git rev-parse --verify HEAD # timeout=10
Resetting working tree
> git reset --hard # timeout=10
> git clean -fdx # timeout=10
Pruning obsolete local branches
Fetching upstream changes from https://gitbox.apache.org/repos/asf/directory-scimple.git
> git --version # timeout=10
> git --version # 'git version 2.34.1'
> git fetch --tags --force --progress --prune -- https://gitbox.apache.org/repos/asf/directory-scimple.git +refs/heads/*:refs/remotes/origin/* # timeout=10
> git rev-parse refs/remotes/origin/develop^{commit} # timeout=10
Checking out Revision d70105ac8b7957270b06281e33e7925dd7674672 (refs/remotes/origin/develop)
> git config core.sparsecheckout # timeout=10
> git checkout -f d70105ac8b7957270b06281e33e7925dd7674672 # timeout=10
Commit message: "Bump org.apache.maven.plugins:maven-surefire-plugin from 3.5.5 to 3.5.6"
> git rev-list --no-walk 25e7646641717e42e29c477ff3dd5b391a52c7d8 # timeout=10
Parsing POMs
Modules changed, recalculating dependency graph
Established TCP socket on 42385
maven35-agent.jar already up to date
maven35-interceptor.jar already up to date
maven3-interceptor-commons.jar already up to date
[dir-scimple] $ /home/jenkins/tools/java/latest1.8/bin/java -cp /home/jenkins/maven35-agent.jar:/home/jenkins/tools/maven/latest3/boot/plexus-classworlds-2.9.0.jar:/home/jenkins/tools/maven/latest3/conf/logging jenkins.maven3.agent.Maven35Main /home/jenkins/tools/maven/latest3 /home/jenkins/agent.jar /home/jenkins/maven35-interceptor.jar /home/jenkins/maven3-interceptor-commons.jar 42385
Exception in thread "main" java.lang.UnsupportedClassVersionError: hudson/remoting/Launcher has been compiled by a more recent version of the Java Runtime (class file version 55.0), this version of the Java Runtime only recognizes class file versions up to 52.0
at java.lang.ClassLoader.defineClass1(Native Method)
at java.lang.ClassLoader.defineClass(ClassLoader.java:756)
at java.security.SecureClassLoader.defineClass(SecureClassLoader.java:142)
at java.net.URLClassLoader.defineClass(URLClassLoader.java:473)
at java.net.URLClassLoader.access$100(URLClassLoader.java:74)
at java.net.URLClassLoader$1.run(URLClassLoader.java:369)
at java.net.URLClassLoader$1.run(URLClassLoader.java:363)
at java.security.AccessController.doPrivileged(Native Method)
at java.net.URLClassLoader.findClass(URLClassLoader.java:362)
at org.codehaus.plexus.classworlds.realm.ClassRealm.findClassInternal(ClassRealm.java:256)
at org.codehaus.plexus.classworlds.realm.ClassRealm.loadClassFromSelf(ClassRealm.java:351)
at org.codehaus.plexus.classworlds.strategy.SelfFirstStrategy.loadClass(SelfFirstStrategy.java:36)
at org.codehaus.plexus.classworlds.realm.ClassRealm.unsynchronizedLoadClass(ClassRealm.java:225)
at org.codehaus.plexus.classworlds.realm.ClassRealm.loadClass(ClassRealm.java:210)
at org.codehaus.plexus.classworlds.realm.ClassRealm.loadClass(ClassRealm.java:205)
at jenkins.maven3.agent.Maven35Main.main(Maven35Main.java:136)
at jenkins.maven3.agent.Maven35Main.main(Maven35Main.java:66)
ERROR: Failed to parse POMs
java.io.EOFException: unexpected stream termination
at hudson.remoting.ChannelBuilder.negotiate(ChannelBuilder.java:478)
at hudson.remoting.ChannelBuilder.build(ChannelBuilder.java:422)
at hudson.slaves.Channels.forProcess(Channels.java:121)
at PluginClassLoader for maven-plugin//hudson.maven.AbstractMavenProcessFactory.newProcess(AbstractMavenProcessFactory.java:298)
at PluginClassLoader for maven-plugin//hudson.maven.ProcessCache.get(ProcessCache.java:236)
at PluginClassLoader for maven-plugin//hudson.maven.MavenModuleSetBuild$MavenModuleSetBuildExecution.doRun(MavenModuleSetBuild.java:802)
at hudson.model.AbstractBuild$AbstractBuildExecution.run(AbstractBuild.java:527)
at hudson.model.Run.execute(Run.java:1833)
at PluginClassLoader for maven-plugin//hudson.maven.MavenModuleSetBuild.run(MavenModuleSetBuild.java:543)
at hudson.model.ResourceController.execute(ResourceController.java:101)
at hudson.model.Executor.run(Executor.java:446)
Build failed in Jenkins: Directory » dir-scimple #909
Posted by Apache Jenkins Server <je...@builds.apache.org>.
See <https://ci-builds.apache.org/job/Directory/job/dir-scimple/909/display/redirect?page=changes>
Changes:
[Brian Demers] Bump actions/setup-java from 5.5.0 to 5.6.0
[Brian Demers] Bump github/codeql-action/upload-sarif from 4.37.0 to 4.37.1
------------------------------------------
Started by an SCM change
Running as SYSTEM
[EnvInject] - Loading node environment variables.
Building remotely on builds59 (ubuntu ubuntu-avx) in workspace <https://ci-builds.apache.org/job/Directory/job/dir-scimple/ws/>
The recommended git tool is: NONE
No credentials specified
> git rev-parse --resolve-git-dir <https://ci-builds.apache.org/job/Directory/job/dir-scimple/ws/.git> # timeout=10
Fetching changes from the remote Git repository
> git config remote.origin.url https://gitbox.apache.org/repos/asf/directory-scimple.git # timeout=10
Cleaning workspace
> git rev-parse --verify HEAD # timeout=10
Resetting working tree
> git reset --hard # timeout=10
> git clean -fdx # timeout=10
Pruning obsolete local branches
Fetching upstream changes from https://gitbox.apache.org/repos/asf/directory-scimple.git
> git --version # timeout=10
> git --version # 'git version 2.34.1'
> git fetch --tags --force --progress --prune -- https://gitbox.apache.org/repos/asf/directory-scimple.git +refs/heads/*:refs/remotes/origin/* # timeout=10
> git rev-parse refs/remotes/origin/develop^{commit} # timeout=10
Checking out Revision 13b82c0c87be7e83a30ee4668ab2a8f4b73a8918 (refs/remotes/origin/develop)
> git config core.sparsecheckout # timeout=10
> git checkout -f 13b82c0c87be7e83a30ee4668ab2a8f4b73a8918 # timeout=10
Commit message: "Bump github/codeql-action/upload-sarif from 4.37.0 to 4.37.1"
> git rev-list --no-walk 144833d7e9bd2ec562255d8ffa70c5c2302b0d92 # timeout=10
Parsing POMs
Modules changed, recalculating dependency graph
Established TCP socket on 40247
maven35-agent.jar already up to date
maven35-interceptor.jar already up to date
maven3-interceptor-commons.jar already up to date
[dir-scimple] $ /home/jenkins/tools/java/latest1.8/bin/java -cp /home/jenkins/jenkins-agent/maven35-agent.jar:/home/jenkins/tools/maven/latest3/boot/plexus-classworlds-2.9.0.jar:/home/jenkins/tools/maven/latest3/conf/logging jenkins.maven3.agent.Maven35Main /home/jenkins/tools/maven/latest3 /home/jenkins/jenkins-agent/agent.jar /home/jenkins/jenkins-agent/maven35-interceptor.jar /home/jenkins/jenkins-agent/maven3-interceptor-commons.jar 40247
Exception in thread "main" java.lang.UnsupportedClassVersionError: hudson/remoting/Launcher has been compiled by a more recent version of the Java Runtime (class file version 55.0), this version of the Java Runtime only recognizes class file versions up to 52.0
at java.lang.ClassLoader.defineClass1(Native Method)
at java.lang.ClassLoader.defineClass(ClassLoader.java:756)
at java.security.SecureClassLoader.defineClass(SecureClassLoader.java:142)
at java.net.URLClassLoader.defineClass(URLClassLoader.java:473)
at java.net.URLClassLoader.access$100(URLClassLoader.java:74)
at java.net.URLClassLoader$1.run(URLClassLoader.java:369)
at java.net.URLClassLoader$1.run(URLClassLoader.java:363)
at java.security.AccessController.doPrivileged(Native Method)
at java.net.URLClassLoader.findClass(URLClassLoader.java:362)
at org.codehaus.plexus.classworlds.realm.ClassRealm.findClassInternal(ClassRealm.java:256)
at org.codehaus.plexus.classworlds.realm.ClassRealm.loadClassFromSelf(ClassRealm.java:351)
at org.codehaus.plexus.classworlds.strategy.SelfFirstStrategy.loadClass(SelfFirstStrategy.java:36)
at org.codehaus.plexus.classworlds.realm.ClassRealm.unsynchronizedLoadClass(ClassRealm.java:225)
at org.codehaus.plexus.classworlds.realm.ClassRealm.loadClass(ClassRealm.java:210)
at org.codehaus.plexus.classworlds.realm.ClassRealm.loadClass(ClassRealm.java:205)
at jenkins.maven3.agent.Maven35Main.main(Maven35Main.java:136)
at jenkins.maven3.agent.Maven35Main.main(Maven35Main.java:66)
ERROR: Failed to parse POMs
java.io.EOFException: unexpected stream termination
at hudson.remoting.ChannelBuilder.negotiate(ChannelBuilder.java:478)
at hudson.remoting.ChannelBuilder.build(ChannelBuilder.java:422)
at hudson.slaves.Channels.forProcess(Channels.java:121)
at PluginClassLoader for maven-plugin//hudson.maven.AbstractMavenProcessFactory.newProcess(AbstractMavenProcessFactory.java:298)
at PluginClassLoader for maven-plugin//hudson.maven.ProcessCache.get(ProcessCache.java:236)
at PluginClassLoader for maven-plugin//hudson.maven.MavenModuleSetBuild$MavenModuleSetBuildExecution.doRun(MavenModuleSetBuild.java:802)
at hudson.model.AbstractBuild$AbstractBuildExecution.run(AbstractBuild.java:527)
at hudson.model.Run.execute(Run.java:1833)
at PluginClassLoader for maven-plugin//hudson.maven.MavenModuleSetBuild.run(MavenModuleSetBuild.java:543)
at hudson.model.ResourceController.execute(ResourceController.java:101)
at hudson.model.Executor.run(Executor.java:446)
Build failed in Jenkins: Directory » dir-scimple #908
Posted by Apache Jenkins Server <je...@builds.apache.org>.
See <https://ci-builds.apache.org/job/Directory/job/dir-scimple/908/display/redirect?page=changes>
Changes:
[Brian Demers] Bump Spring Boot to 3.5.16 and 4.1.0
[Brian Demers] Bump github/codeql-action/analyze from 4.36.2 to 4.37.0
[Brian Demers] Bump codeql-action/init to 4.37.0 to match analyze/upload-sarif
[Brian Demers] Bump org.wildfly.plugins:wildfly-maven-plugin
------------------------------------------
Started by an SCM change
Running as SYSTEM
[EnvInject] - Loading node environment variables.
Building remotely on builds39 (ubuntu) in workspace <https://ci-builds.apache.org/job/Directory/job/dir-scimple/ws/>
The recommended git tool is: NONE
No credentials specified
> git rev-parse --resolve-git-dir <https://ci-builds.apache.org/job/Directory/job/dir-scimple/ws/.git> # timeout=10
Fetching changes from the remote Git repository
> git config remote.origin.url https://gitbox.apache.org/repos/asf/directory-scimple.git # timeout=10
Cleaning workspace
> git rev-parse --verify HEAD # timeout=10
Resetting working tree
> git reset --hard # timeout=10
> git clean -fdx # timeout=10
Pruning obsolete local branches
Fetching upstream changes from https://gitbox.apache.org/repos/asf/directory-scimple.git
> git --version # timeout=10
> git --version # 'git version 2.34.1'
> git fetch --tags --force --progress --prune -- https://gitbox.apache.org/repos/asf/directory-scimple.git +refs/heads/*:refs/remotes/origin/* # timeout=10
> git rev-parse refs/remotes/origin/develop^{commit} # timeout=10
Checking out Revision 144833d7e9bd2ec562255d8ffa70c5c2302b0d92 (refs/remotes/origin/develop)
> git config core.sparsecheckout # timeout=10
> git checkout -f 144833d7e9bd2ec562255d8ffa70c5c2302b0d92 # timeout=10
Commit message: "Bump org.wildfly.plugins:wildfly-maven-plugin"
> git rev-list --no-walk 3d9329ed8fe4fc220cc2f57a6223671b1db97b65 # timeout=10
Parsing POMs
Downloaded artifact https://repo.maven.apache.org/maven2/org/springframework/boot/spring-boot-dependencies/3.5.16/spring-boot-dependencies-3.5.16.pom
Downloaded artifact https://repo.maven.apache.org/maven2/org/eclipse/jetty/ee10/jetty-ee10-bom/12.0.36/jetty-ee10-bom-12.0.36.pom
Downloaded artifact https://repo.maven.apache.org/maven2/org/eclipse/jetty/jetty-bom/12.0.36/jetty-bom-12.0.36.pom
Downloaded artifact https://repo.maven.apache.org/maven2/io/micrometer/micrometer-bom/1.15.12/micrometer-bom-1.15.12.pom
Downloaded artifact https://repo.maven.apache.org/maven2/io/netty/netty-bom/4.1.135.Final/netty-bom-4.1.135.Final.pom
Downloaded artifact https://repo.maven.apache.org/maven2/org/apache/pulsar/pulsar-bom/4.0.11/pulsar-bom-4.0.11.pom
Downloaded artifact https://repo.maven.apache.org/maven2/io/projectreactor/reactor-bom/2024.0.18/reactor-bom-2024.0.18.pom
Downloaded artifact https://repo.maven.apache.org/maven2/org/springframework/amqp/spring-amqp-bom/3.2.12/spring-amqp-bom-3.2.12.pom
Downloaded artifact https://repo.maven.apache.org/maven2/org/springframework/batch/spring-batch-bom/5.2.6/spring-batch-bom-5.2.6.pom
Downloaded artifact https://repo.maven.apache.org/maven2/org/springframework/data/spring-data-bom/2025.0.13/spring-data-bom-2025.0.13.pom
Downloaded artifact https://repo.maven.apache.org/maven2/org/springframework/spring-framework-bom/6.2.19/spring-framework-bom-6.2.19.pom
Downloaded artifact https://repo.maven.apache.org/maven2/org/springframework/integration/spring-integration-bom/6.5.10/spring-integration-bom-6.5.10.pom
Downloaded artifact https://repo.maven.apache.org/maven2/org/springframework/pulsar/spring-pulsar-bom/1.2.18/spring-pulsar-bom-1.2.18.pom
Downloaded artifact https://repo.maven.apache.org/maven2/org/springframework/restdocs/spring-restdocs-bom/3.0.6/spring-restdocs-bom-3.0.6.pom
Downloaded artifact https://repo.maven.apache.org/maven2/org/springframework/security/spring-security-bom/6.5.11/spring-security-bom-6.5.11.pom
Downloaded artifact https://repo.maven.apache.org/maven2/org/springframework/session/spring-session-bom/3.5.7/spring-session-bom-3.5.7.pom
Downloaded artifact https://repo.maven.apache.org/maven2/org/springframework/ws/spring-ws-bom/4.1.4/spring-ws-bom-4.1.4.pom
Modules changed, recalculating dependency graph
Established TCP socket on 40009
maven35-agent.jar already up to date
maven35-interceptor.jar already up to date
maven3-interceptor-commons.jar already up to date
[dir-scimple] $ /home/jenkins/tools/java/latest1.8/bin/java -cp /home/jenkins/maven35-agent.jar:/home/jenkins/tools/maven/latest3/boot/plexus-classworlds-2.9.0.jar:/home/jenkins/tools/maven/latest3/conf/logging jenkins.maven3.agent.Maven35Main /home/jenkins/tools/maven/latest3 /home/jenkins/agent.jar /home/jenkins/maven35-interceptor.jar /home/jenkins/maven3-interceptor-commons.jar 40009
Exception in thread "main" java.lang.UnsupportedClassVersionError: hudson/remoting/Launcher has been compiled by a more recent version of the Java Runtime (class file version 55.0), this version of the Java Runtime only recognizes class file versions up to 52.0
at java.lang.ClassLoader.defineClass1(Native Method)
at java.lang.ClassLoader.defineClass(ClassLoader.java:756)
at java.security.SecureClassLoader.defineClass(SecureClassLoader.java:142)
at java.net.URLClassLoader.defineClass(URLClassLoader.java:473)
at java.net.URLClassLoader.access$100(URLClassLoader.java:74)
at java.net.URLClassLoader$1.run(URLClassLoader.java:369)
at java.net.URLClassLoader$1.run(URLClassLoader.java:363)
at java.security.AccessController.doPrivileged(Native Method)
at java.net.URLClassLoader.findClass(URLClassLoader.java:362)
at org.codehaus.plexus.classworlds.realm.ClassRealm.findClassInternal(ClassRealm.java:256)
at org.codehaus.plexus.classworlds.realm.ClassRealm.loadClassFromSelf(ClassRealm.java:351)
at org.codehaus.plexus.classworlds.strategy.SelfFirstStrategy.loadClass(SelfFirstStrategy.java:36)
at org.codehaus.plexus.classworlds.realm.ClassRealm.unsynchronizedLoadClass(ClassRealm.java:225)
at org.codehaus.plexus.classworlds.realm.ClassRealm.loadClass(ClassRealm.java:210)
at org.codehaus.plexus.classworlds.realm.ClassRealm.loadClass(ClassRealm.java:205)
at jenkins.maven3.agent.Maven35Main.main(Maven35Main.java:136)
at jenkins.maven3.agent.Maven35Main.main(Maven35Main.java:66)
ERROR: Failed to parse POMs
java.io.EOFException: unexpected stream termination
at hudson.remoting.ChannelBuilder.negotiate(ChannelBuilder.java:478)
at hudson.remoting.ChannelBuilder.build(ChannelBuilder.java:422)
at hudson.slaves.Channels.forProcess(Channels.java:121)
at PluginClassLoader for maven-plugin//hudson.maven.AbstractMavenProcessFactory.newProcess(AbstractMavenProcessFactory.java:298)
at PluginClassLoader for maven-plugin//hudson.maven.ProcessCache.get(ProcessCache.java:236)
at PluginClassLoader for maven-plugin//hudson.maven.MavenModuleSetBuild$MavenModuleSetBuildExecution.doRun(MavenModuleSetBuild.java:802)
at hudson.model.AbstractBuild$AbstractBuildExecution.run(AbstractBuild.java:527)
at hudson.model.Run.execute(Run.java:1833)
at PluginClassLoader for maven-plugin//hudson.maven.MavenModuleSetBuild.run(MavenModuleSetBuild.java:543)
at hudson.model.ResourceController.execute(ResourceController.java:101)
at hudson.model.Executor.run(Executor.java:446)
Build failed in Jenkins: Directory » dir-scimple #907
Posted by Apache Jenkins Server <je...@builds.apache.org>.
See <https://ci-builds.apache.org/job/Directory/job/dir-scimple/907/display/redirect>
Changes:
------------------------------------------
Started by an SCM change
Running as SYSTEM
[EnvInject] - Loading node environment variables.
Building remotely on builds39 (ubuntu) in workspace <https://ci-builds.apache.org/job/Directory/job/dir-scimple/ws/>
The recommended git tool is: NONE
No credentials specified
> git rev-parse --resolve-git-dir <https://ci-builds.apache.org/job/Directory/job/dir-scimple/ws/.git> # timeout=10
Fetching changes from the remote Git repository
> git config remote.origin.url https://gitbox.apache.org/repos/asf/directory-scimple.git # timeout=10
Cleaning workspace
> git rev-parse --verify HEAD # timeout=10
Resetting working tree
> git reset --hard # timeout=10
> git clean -fdx # timeout=10
Pruning obsolete local branches
Fetching upstream changes from https://gitbox.apache.org/repos/asf/directory-scimple.git
> git --version # timeout=10
> git --version # 'git version 2.34.1'
> git fetch --tags --force --progress --prune -- https://gitbox.apache.org/repos/asf/directory-scimple.git +refs/heads/*:refs/remotes/origin/* # timeout=10
> git rev-parse refs/remotes/origin/develop^{commit} # timeout=10
Checking out Revision 3d9329ed8fe4fc220cc2f57a6223671b1db97b65 (refs/remotes/origin/develop)
> git config core.sparsecheckout # timeout=10
> git checkout -f 3d9329ed8fe4fc220cc2f57a6223671b1db97b65 # timeout=10
Commit message: "Fix SpotBugs synchronization warning"
> git rev-list --no-walk 3d9329ed8fe4fc220cc2f57a6223671b1db97b65 # timeout=10
Parsing POMs
Modules changed, recalculating dependency graph
Established TCP socket on 40259
maven35-agent.jar already up to date
maven35-interceptor.jar already up to date
maven3-interceptor-commons.jar already up to date
[dir-scimple] $ /home/jenkins/tools/java/latest1.8/bin/java -cp /home/jenkins/maven35-agent.jar:/home/jenkins/tools/maven/latest3/boot/plexus-classworlds-2.9.0.jar:/home/jenkins/tools/maven/latest3/conf/logging jenkins.maven3.agent.Maven35Main /home/jenkins/tools/maven/latest3 /home/jenkins/agent.jar /home/jenkins/maven35-interceptor.jar /home/jenkins/maven3-interceptor-commons.jar 40259
Exception in thread "main" java.lang.UnsupportedClassVersionError: hudson/remoting/Launcher has been compiled by a more recent version of the Java Runtime (class file version 55.0), this version of the Java Runtime only recognizes class file versions up to 52.0
at java.lang.ClassLoader.defineClass1(Native Method)
at java.lang.ClassLoader.defineClass(ClassLoader.java:756)
at java.security.SecureClassLoader.defineClass(SecureClassLoader.java:142)
at java.net.URLClassLoader.defineClass(URLClassLoader.java:473)
at java.net.URLClassLoader.access$100(URLClassLoader.java:74)
at java.net.URLClassLoader$1.run(URLClassLoader.java:369)
at java.net.URLClassLoader$1.run(URLClassLoader.java:363)
at java.security.AccessController.doPrivileged(Native Method)
at java.net.URLClassLoader.findClass(URLClassLoader.java:362)
at org.codehaus.plexus.classworlds.realm.ClassRealm.findClassInternal(ClassRealm.java:256)
at org.codehaus.plexus.classworlds.realm.ClassRealm.loadClassFromSelf(ClassRealm.java:351)
at org.codehaus.plexus.classworlds.strategy.SelfFirstStrategy.loadClass(SelfFirstStrategy.java:36)
at org.codehaus.plexus.classworlds.realm.ClassRealm.unsynchronizedLoadClass(ClassRealm.java:225)
at org.codehaus.plexus.classworlds.realm.ClassRealm.loadClass(ClassRealm.java:210)
at org.codehaus.plexus.classworlds.realm.ClassRealm.loadClass(ClassRealm.java:205)
at jenkins.maven3.agent.Maven35Main.main(Maven35Main.java:136)
at jenkins.maven3.agent.Maven35Main.main(Maven35Main.java:66)
ERROR: Failed to parse POMs
java.io.EOFException: unexpected stream termination
at hudson.remoting.ChannelBuilder.negotiate(ChannelBuilder.java:478)
at hudson.remoting.ChannelBuilder.build(ChannelBuilder.java:422)
at hudson.slaves.Channels.forProcess(Channels.java:121)
at PluginClassLoader for maven-plugin//hudson.maven.AbstractMavenProcessFactory.newProcess(AbstractMavenProcessFactory.java:298)
at PluginClassLoader for maven-plugin//hudson.maven.ProcessCache.get(ProcessCache.java:236)
at PluginClassLoader for maven-plugin//hudson.maven.MavenModuleSetBuild$MavenModuleSetBuildExecution.doRun(MavenModuleSetBuild.java:802)
at hudson.model.AbstractBuild$AbstractBuildExecution.run(AbstractBuild.java:527)
at hudson.model.Run.execute(Run.java:1833)
at PluginClassLoader for maven-plugin//hudson.maven.MavenModuleSetBuild.run(MavenModuleSetBuild.java:543)
at hudson.model.ResourceController.execute(ResourceController.java:101)
at hudson.model.Executor.run(Executor.java:446)
Build failed in Jenkins: Directory » dir-scimple #906
Posted by Apache Jenkins Server <je...@builds.apache.org>.
See <https://ci-builds.apache.org/job/Directory/job/dir-scimple/906/display/redirect?page=changes>
Changes:
[Brian Demers] Bump version.quarkus from 3.34.6 to 3.37.2
[Brian Demers] Update payara/micro Docker tag to v7.2026.6
[Brian Demers] Bump org.jreleaser:jreleaser-maven-plugin from 1.23.0 to 1.25.0
[Brian Demers] Bump org.apache.maven.plugins:maven-failsafe-plugin from 3.5.5 to 3.5.6
[Brian Demers] Bump com.github.spotbugs:spotbugs-maven-plugin from 4.9.8.3 to 4.10.3.0
[Brian Demers] Fix SpotBugs synchronization warning
------------------------------------------
Started by timer
Running as SYSTEM
[EnvInject] - Loading node environment variables.
Building remotely on builds39 (ubuntu) in workspace <https://ci-builds.apache.org/job/Directory/job/dir-scimple/ws/>
The recommended git tool is: NONE
No credentials specified
> git rev-parse --resolve-git-dir <https://ci-builds.apache.org/job/Directory/job/dir-scimple/ws/.git> # timeout=10
Fetching changes from the remote Git repository
> git config remote.origin.url https://gitbox.apache.org/repos/asf/directory-scimple.git # timeout=10
Cleaning workspace
> git rev-parse --verify HEAD # timeout=10
Resetting working tree
> git reset --hard # timeout=10
> git clean -fdx # timeout=10
Pruning obsolete local branches
Fetching upstream changes from https://gitbox.apache.org/repos/asf/directory-scimple.git
> git --version # timeout=10
> git --version # 'git version 2.34.1'
> git fetch --tags --force --progress --prune -- https://gitbox.apache.org/repos/asf/directory-scimple.git +refs/heads/*:refs/remotes/origin/* # timeout=10
> git rev-parse refs/remotes/origin/develop^{commit} # timeout=10
Checking out Revision 3d9329ed8fe4fc220cc2f57a6223671b1db97b65 (refs/remotes/origin/develop)
> git config core.sparsecheckout # timeout=10
> git checkout -f 3d9329ed8fe4fc220cc2f57a6223671b1db97b65 # timeout=10
Commit message: "Fix SpotBugs synchronization warning"
> git rev-list --no-walk d70105ac8b7957270b06281e33e7925dd7674672 # timeout=10
Parsing POMs
Downloaded artifact https://repo.maven.apache.org/maven2/io/quarkus/platform/quarkus-bom/3.37.2/quarkus-bom-3.37.2.pom
Modules changed, recalculating dependency graph
Established TCP socket on 37253
maven35-agent.jar already up to date
maven35-interceptor.jar already up to date
maven3-interceptor-commons.jar already up to date
[dir-scimple] $ /home/jenkins/tools/java/latest1.8/bin/java -cp /home/jenkins/maven35-agent.jar:/home/jenkins/tools/maven/latest3/boot/plexus-classworlds-2.9.0.jar:/home/jenkins/tools/maven/latest3/conf/logging jenkins.maven3.agent.Maven35Main /home/jenkins/tools/maven/latest3 /home/jenkins/agent.jar /home/jenkins/maven35-interceptor.jar /home/jenkins/maven3-interceptor-commons.jar 37253
Exception in thread "main" java.lang.UnsupportedClassVersionError: hudson/remoting/Launcher has been compiled by a more recent version of the Java Runtime (class file version 55.0), this version of the Java Runtime only recognizes class file versions up to 52.0
at java.lang.ClassLoader.defineClass1(Native Method)
at java.lang.ClassLoader.defineClass(ClassLoader.java:756)
at java.security.SecureClassLoader.defineClass(SecureClassLoader.java:142)
at java.net.URLClassLoader.defineClass(URLClassLoader.java:473)
at java.net.URLClassLoader.access$100(URLClassLoader.java:74)
at java.net.URLClassLoader$1.run(URLClassLoader.java:369)
at java.net.URLClassLoader$1.run(URLClassLoader.java:363)
at java.security.AccessController.doPrivileged(Native Method)
at java.net.URLClassLoader.findClass(URLClassLoader.java:362)
at org.codehaus.plexus.classworlds.realm.ClassRealm.findClassInternal(ClassRealm.java:256)
at org.codehaus.plexus.classworlds.realm.ClassRealm.loadClassFromSelf(ClassRealm.java:351)
at org.codehaus.plexus.classworlds.strategy.SelfFirstStrategy.loadClass(SelfFirstStrategy.java:36)
at org.codehaus.plexus.classworlds.realm.ClassRealm.unsynchronizedLoadClass(ClassRealm.java:225)
at org.codehaus.plexus.classworlds.realm.ClassRealm.loadClass(ClassRealm.java:210)
at org.codehaus.plexus.classworlds.realm.ClassRealm.loadClass(ClassRealm.java:205)
at jenkins.maven3.agent.Maven35Main.main(Maven35Main.java:136)
at jenkins.maven3.agent.Maven35Main.main(Maven35Main.java:66)
ERROR: Failed to parse POMs
java.io.EOFException: unexpected stream termination
at hudson.remoting.ChannelBuilder.negotiate(ChannelBuilder.java:478)
at hudson.remoting.ChannelBuilder.build(ChannelBuilder.java:422)
at hudson.slaves.Channels.forProcess(Channels.java:121)
at PluginClassLoader for maven-plugin//hudson.maven.AbstractMavenProcessFactory.newProcess(AbstractMavenProcessFactory.java:298)
at PluginClassLoader for maven-plugin//hudson.maven.ProcessCache.get(ProcessCache.java:236)
at PluginClassLoader for maven-plugin//hudson.maven.MavenModuleSetBuild$MavenModuleSetBuildExecution.doRun(MavenModuleSetBuild.java:802)
at hudson.model.AbstractBuild$AbstractBuildExecution.run(AbstractBuild.java:527)
at hudson.model.Run.execute(Run.java:1833)
at PluginClassLoader for maven-plugin//hudson.maven.MavenModuleSetBuild.run(MavenModuleSetBuild.java:543)
at hudson.model.ResourceController.execute(ResourceController.java:101)
at hudson.model.Executor.run(Executor.java:446)