You are viewing a plain text version of this content. The canonical link for it is here.
Posted to commits@beam.apache.org by Apache Jenkins Server <je...@builds.apache.org> on 2017/09/18 12:49:56 UTC

Build failed in Jenkins: beam_PostCommit_Python_Verify #3155

See <https://builds.apache.org/job/beam_PostCommit_Python_Verify/3155/display/redirect?page=changes>

Changes:

[echauchot] [BEAM-2957] Fix flaky ElasticsearchIOTest.testSplit in

------------------------------------------
[...truncated 458.12 KB...]
test_type_check_valid_composite_types (apache_beam.typehints.typehints_test.TupleHintTestCase) ... ok
test_type_check_valid_simple_type_arbitrary_length (apache_beam.typehints.typehints_test.TupleHintTestCase) ... ok
test_type_check_valid_simple_types (apache_beam.typehints.typehints_test.TupleHintTestCase) ... ok
test_getitem_duplicates_ignored (apache_beam.typehints.typehints_test.UnionHintTestCase) ... ok
test_getitem_must_be_valid_type_param (apache_beam.typehints.typehints_test.UnionHintTestCase) ... ok
test_getitem_must_be_valid_type_param_cant_be_object_instance (apache_beam.typehints.typehints_test.UnionHintTestCase) ... ok
test_getitem_nested_unions_flattened (apache_beam.typehints.typehints_test.UnionHintTestCase) ... ok
test_nested_compatibility (apache_beam.typehints.typehints_test.UnionHintTestCase) ... ok
test_union_hint_compatibility (apache_beam.typehints.typehints_test.UnionHintTestCase) ... ok
test_union_hint_enforcement_composite_type_in_union (apache_beam.typehints.typehints_test.UnionHintTestCase) ... ok
test_union_hint_enforcement_not_part_of_union (apache_beam.typehints.typehints_test.UnionHintTestCase) ... ok
test_union_hint_enforcement_part_of_union (apache_beam.typehints.typehints_test.UnionHintTestCase) ... ok
test_union_hint_repr (apache_beam.typehints.typehints_test.UnionHintTestCase) ... ok
test_deprecated_with_since_current (apache_beam.utils.annotations_test.AnnotationTests) ... ok
test_deprecated_with_since_current_message (apache_beam.utils.annotations_test.AnnotationTests) ... ok
test_deprecated_without_current (apache_beam.utils.annotations_test.AnnotationTests) ... ok
test_deprecated_without_since_should_fail (apache_beam.utils.annotations_test.AnnotationTests) ... ok
test_experimental_with_current (apache_beam.utils.annotations_test.AnnotationTests) ... ok
test_experimental_with_current_message (apache_beam.utils.annotations_test.AnnotationTests) ... ok
test_experimental_without_current (apache_beam.utils.annotations_test.AnnotationTests) ... ok
test_frequency (apache_beam.utils.annotations_test.AnnotationTests)
Tests that the filter 'once' is sufficient to print once per ... ok
test_equal_objects (apache_beam.utils.counters_test.CounterNameTest) ... ok
test_hash_two_objects (apache_beam.utils.counters_test.CounterNameTest) ... ok
test_method_forwarding_not_windows (apache_beam.utils.processes_test.Exec) ... ok
test_method_forwarding_windows (apache_beam.utils.processes_test.Exec) ... ok
test_call_two_objects (apache_beam.utils.retry_test.RetryStateTest) ... ok
test_single_failure (apache_beam.utils.retry_test.RetryStateTest) ... ok
test_two_failures (apache_beam.utils.retry_test.RetryStateTest) ... ok
test_log_calls_for_permanent_failure (apache_beam.utils.retry_test.RetryTest) ... ok
test_log_calls_for_transient_failure (apache_beam.utils.retry_test.RetryTest) ... ok
test_with_default_number_of_retries (apache_beam.utils.retry_test.RetryTest) ... ok
test_with_explicit_decorator (apache_beam.utils.retry_test.RetryTest) ... ok
test_with_explicit_initial_delay (apache_beam.utils.retry_test.RetryTest) ... ok
test_with_explicit_number_of_retries (apache_beam.utils.retry_test.RetryTest) ... ok
test_with_http_error_that_should_be_retried (apache_beam.utils.retry_test.RetryTest) ... SKIP: google-apitools is not installed
test_with_http_error_that_should_not_be_retried (apache_beam.utils.retry_test.RetryTest) ... SKIP: google-apitools is not installed
test_with_no_retry_decorator (apache_beam.utils.retry_test.RetryTest) ... ok
test_with_real_clock (apache_beam.utils.retry_test.RetryTest) ... ok
test_arithmetic (apache_beam.utils.timestamp_test.DurationTest) ... ok
test_of (apache_beam.utils.timestamp_test.DurationTest) ... ok
test_precision (apache_beam.utils.timestamp_test.DurationTest) ... ok
test_sort_order (apache_beam.utils.timestamp_test.DurationTest) ... ok
test_str (apache_beam.utils.timestamp_test.DurationTest) ... ok
test_arithmetic (apache_beam.utils.timestamp_test.TimestampTest) ... ok
test_of (apache_beam.utils.timestamp_test.TimestampTest) ... ok
test_precision (apache_beam.utils.timestamp_test.TimestampTest) ... ok
test_sort_order (apache_beam.utils.timestamp_test.TimestampTest) ... ok
test_str (apache_beam.utils.timestamp_test.TimestampTest) ... ok
test_utc_timestamp (apache_beam.utils.timestamp_test.TimestampTest) ... ok
test_equality (apache_beam.utils.windowed_value_test.WindowedValueTest) ... ok
test_hash (apache_beam.utils.windowed_value_test.WindowedValueTest) ... ok
test_pickle (apache_beam.utils.windowed_value_test.WindowedValueTest) ... ok
test_timestamps (apache_beam.utils.windowed_value_test.WindowedValueTest) ... ok
test_with_value (apache_beam.utils.windowed_value_test.WindowedValueTest) ... ok
test_retry_fork_graph (apache_beam.pipeline_test.DirectRunnerRetryTests) ... ok
test_element (apache_beam.pipeline_test.DoFnTest) ... ok
test_side_input_no_tag (apache_beam.pipeline_test.DoFnTest) ... ok
test_side_input_tagged (apache_beam.pipeline_test.DoFnTest) ... ok
test_timestamp_param (apache_beam.pipeline_test.DoFnTest) ... ok
test_window_param (apache_beam.pipeline_test.DoFnTest) ... ok
test_attribute_setting (apache_beam.pipeline_test.PipelineOptionsTest) ... ok
test_defaults (apache_beam.pipeline_test.PipelineOptionsTest) ... ok
test_dir (apache_beam.pipeline_test.PipelineOptionsTest) ... ok
test_flag_parsing (apache_beam.pipeline_test.PipelineOptionsTest) ... ok
test_keyword_parsing (apache_beam.pipeline_test.PipelineOptionsTest) ... ok
test_view_as (apache_beam.pipeline_test.PipelineOptionsTest) ... ok
test_aggregator_empty_input (apache_beam.pipeline_test.PipelineTest) ... ok
test_apply_custom_transform (apache_beam.pipeline_test.PipelineTest) ... ok
test_create (apache_beam.pipeline_test.PipelineTest) ... ok
test_create_singleton_pcollection (apache_beam.pipeline_test.PipelineTest) ... <https://builds.apache.org/job/beam_PostCommit_Python_Verify/ws/sdks/python/apache_beam/coders/typecoders.py>:134: UserWarning: Using fallback coder for typehint: List[int].
  warnings.warn('Using fallback coder for typehint: %r.' % typehint)
ok
test_flatmap_builtin (apache_beam.pipeline_test.PipelineTest) ... ok
test_memory_usage (apache_beam.pipeline_test.PipelineTest) ... ok
test_metrics_in_source (apache_beam.pipeline_test.PipelineTest) ... ok
test_pipeline_as_context (apache_beam.pipeline_test.PipelineTest) ... <https://builds.apache.org/job/beam_PostCommit_Python_Verify/ws/sdks/python/apache_beam/coders/typecoders.py>:134: UserWarning: Using fallback coder for typehint: <type 'exceptions.ValueError'>.
  warnings.warn('Using fallback coder for typehint: %r.' % typehint)
ok
test_ptransform_overrides (apache_beam.pipeline_test.PipelineTest) ... ok
test_read (apache_beam.pipeline_test.PipelineTest) ... ok
test_reuse_cloned_custom_transform_instance (apache_beam.pipeline_test.PipelineTest) ... ok
test_reuse_custom_transform_instance (apache_beam.pipeline_test.PipelineTest) ... <https://builds.apache.org/job/beam_PostCommit_Python_Verify/ws/sdks/python/apache_beam/pipeline_test.py>:210: DeprecationWarning: BaseException.message has been deprecated as of Python 2.6
  cm.exception.message,
ok
test_transform_no_super_init (apache_beam.pipeline_test.PipelineTest) ... ok
test_visit_entire_graph (apache_beam.pipeline_test.PipelineTest) ... ok
test_pickling (apache_beam.pipeline_test.RunnerApiTest) ... ok
test_simple (apache_beam.pipeline_test.RunnerApiTest)
Tests serializing, deserializing, and running a simple pipeline. ... ok
test_assingleton_multi_element (apache_beam.pvalue_test.PValueTest) ... ok
test_pvalue_expected_arguments (apache_beam.pvalue_test.PValueTest) ... ok
test_file_checksum_matchcer_invalid_sleep_time (apache_beam.testing.pipeline_verifiers_test.PipelineVerifiersTest) ... <https://builds.apache.org/job/beam_PostCommit_Python_Verify/ws/sdks/python/apache_beam/testing/pipeline_verifiers_test.py>:130: DeprecationWarning: BaseException.message has been deprecated as of Python 2.6
  self.assertEqual(cm.exception.message,
ok
test_file_checksum_matcher_read_failed (apache_beam.testing.pipeline_verifiers_test.PipelineVerifiersTest) ... ok
test_file_checksum_matcher_service_error (apache_beam.testing.pipeline_verifiers_test.PipelineVerifiersTest) ... SKIP: google-apitools is not installed
test_file_checksum_matcher_sleep_before_verify (apache_beam.testing.pipeline_verifiers_test.PipelineVerifiersTest) ... ok
test_file_checksum_matcher_success (apache_beam.testing.pipeline_verifiers_test.PipelineVerifiersTest) ... ok
test_pipeline_state_matcher_fails (apache_beam.testing.pipeline_verifiers_test.PipelineVerifiersTest)
Test PipelineStateMatcher fails when using default expected state ... ok
test_pipeline_state_matcher_given_state (apache_beam.testing.pipeline_verifiers_test.PipelineVerifiersTest)
Test PipelineStateMatcher successes when matches given state ... ok
test_pipeline_state_matcher_success (apache_beam.testing.pipeline_verifiers_test.PipelineVerifiersTest)
Test PipelineStateMatcher successes when using default expected state ... ok
test_append_extra_options (apache_beam.testing.test_pipeline_test.TestPipelineTest) ... ok
test_append_verifier_in_extra_opt (apache_beam.testing.test_pipeline_test.TestPipelineTest) ... ok
test_create_test_pipeline_options (apache_beam.testing.test_pipeline_test.TestPipelineTest) ... ok
test_empty_option_args_parsing (apache_beam.testing.test_pipeline_test.TestPipelineTest) ... ok
test_get_option (apache_beam.testing.test_pipeline_test.TestPipelineTest) ... ok
test_option_args_parsing (apache_beam.testing.test_pipeline_test.TestPipelineTest) ... ok
test_skip_IT (apache_beam.testing.test_pipeline_test.TestPipelineTest) ... SKIP: IT is skipped because --test-pipeline-options is not specified
test_basic_execution (apache_beam.testing.test_stream_test.TestStreamTest) ... ok
test_basic_test_stream (apache_beam.testing.test_stream_test.TestStreamTest) ... ok
test_gbk_execution (apache_beam.testing.test_stream_test.TestStreamTest) ... ok
test_test_stream_errors (apache_beam.testing.test_stream_test.TestStreamTest) ... ok
test_delete_files_fails_with_invalid_arg (apache_beam.testing.test_utils_test.TestUtilsTest) ... ok
test_delete_files_fails_with_io_error (apache_beam.testing.test_utils_test.TestUtilsTest) ... <https://builds.apache.org/job/beam_PostCommit_Python_Verify/ws/sdks/python/apache_beam/testing/test_utils_test.py>:52: DeprecationWarning: BaseException.message has been deprecated as of Python 2.6
  error.exception.message.startswith('Delete operation failed'))
ok
test_delete_files_succeeds (apache_beam.testing.test_utils_test.TestUtilsTest) ... ok
test_assert_that_fails (apache_beam.testing.util_test.UtilTest) ... ok
test_assert_that_fails_on_empty_expected (apache_beam.testing.util_test.UtilTest) ... ok
test_assert_that_fails_on_empty_input (apache_beam.testing.util_test.UtilTest) ... ok
test_assert_that_passes (apache_beam.testing.util_test.UtilTest) ... ok

----------------------------------------------------------------------
Ran 1317 tests in 308.525s

OK (skipped=258)
py27cython runtests: commands[9] | - find apache_beam -type f -name *.c -delete
py27cython runtests: commands[10] | - find apache_beam -type f -name *.so -delete
py27cython runtests: commands[11] | - find target/build -type f -name *.c -delete
/usr/bin/find: `target/build': No such file or directory
py27cython runtests: commands[12] | - find target/build -type f -name *.so -delete
/usr/bin/find: `target/build': No such file or directory
py27gcp create: <https://builds.apache.org/job/beam_PostCommit_Python_Verify/ws/sdks/python/target/.tox/py27gcp>
py27gcp installdeps: nose==1.3.7
py27gcp inst: <https://builds.apache.org/job/beam_PostCommit_Python_Verify/ws/sdks/python/target/.tox/dist/apache-beam-2.2.0.dev.zip>
py27gcp installed: apache-beam==2.2.0.dev0,avro==1.8.2,crcmod==1.7,dill==0.2.6,enum34==1.1.6,funcsigs==1.0.2,futures==3.1.1,grpcio==1.6.0,httplib2==0.9.2,mock==2.0.0,nose==1.3.7,oauth2client==3.0.0,pbr==3.1.1,protobuf==3.3.0,pyasn1==0.3.5,pyasn1-modules==0.1.4,PyYAML==3.12,rsa==3.4.2,six==1.11.0,typing==3.6.2
py27gcp runtests: PYTHONHASHSEED='989343293'
py27gcp runtests: commands[0] | pip install -e .[test,gcp]
Obtaining file://<https://builds.apache.org/job/beam_PostCommit_Python_Verify/ws/sdks/python>
Requirement already satisfied: avro<2.0.0,>=1.8.1 in ./target/.tox/py27gcp/lib/python2.7/site-packages (from apache-beam==2.2.0.dev0)
Requirement already satisfied: crcmod<2.0,>=1.7 in ./target/.tox/py27gcp/lib/python2.7/site-packages (from apache-beam==2.2.0.dev0)
Requirement already satisfied: dill==0.2.6 in ./target/.tox/py27gcp/lib/python2.7/site-packages (from apache-beam==2.2.0.dev0)
Requirement already satisfied: grpcio<2.0,>=1.0 in ./target/.tox/py27gcp/lib/python2.7/site-packages (from apache-beam==2.2.0.dev0)
Requirement already satisfied: httplib2<0.10,>=0.8 in ./target/.tox/py27gcp/lib/python2.7/site-packages (from apache-beam==2.2.0.dev0)
Requirement already satisfied: mock<3.0.0,>=1.0.1 in ./target/.tox/py27gcp/lib/python2.7/site-packages (from apache-beam==2.2.0.dev0)
Requirement already satisfied: oauth2client<4.0.0,>=2.0.1 in ./target/.tox/py27gcp/lib/python2.7/site-packages (from apache-beam==2.2.0.dev0)
Requirement already satisfied: protobuf<=3.3.0,>=3.2.0 in ./target/.tox/py27gcp/lib/python2.7/site-packages (from apache-beam==2.2.0.dev0)
Requirement already satisfied: pyyaml<4.0.0,>=3.12 in ./target/.tox/py27gcp/lib/python2.7/site-packages (from apache-beam==2.2.0.dev0)
Requirement already satisfied: typing<3.7.0,>=3.6.0 in ./target/.tox/py27gcp/lib/python2.7/site-packages (from apache-beam==2.2.0.dev0)
Collecting google-apitools<=0.5.11,>=0.5.10 (from apache-beam==2.2.0.dev0)
<https://builds.apache.org/job/beam_PostCommit_Python_Verify/ws/sdks/python/target/.tox/py27gcp/local/lib/python2.7/site-packages/pip/_vendor/requests/packages/urllib3/util/ssl_.py>:318: SNIMissingWarning: An HTTPS request has been made, but the SNI (Subject Name Indication) extension to TLS is not available on this platform. This may cause the server to present an incorrect TLS certificate, which can cause validation failures. You can upgrade to a newer version of Python to solve this. For more information, see https://urllib3.readthedocs.io/en/latest/security.html#snimissingwarning.
  SNIMissingWarning
<https://builds.apache.org/job/beam_PostCommit_Python_Verify/ws/sdks/python/target/.tox/py27gcp/local/lib/python2.7/site-packages/pip/_vendor/requests/packages/urllib3/util/ssl_.py>:122: InsecurePlatformWarning: A true SSLContext object is not available. This prevents urllib3 from configuring SSL appropriately and may cause certain SSL connections to fail. You can upgrade to a newer version of Python to solve this. For more information, see https://urllib3.readthedocs.io/en/latest/security.html#insecureplatformwarning.
  InsecurePlatformWarning
  Using cached google_apitools-0.5.11-py2-none-any.whl
Collecting proto-google-cloud-datastore-v1<=0.90.4,>=0.90.0 (from apache-beam==2.2.0.dev0)
Collecting googledatastore==7.0.1 (from apache-beam==2.2.0.dev0)
Collecting google-cloud-pubsub==0.26.0 (from apache-beam==2.2.0.dev0)
  Using cached google_cloud_pubsub-0.26.0-py2.py3-none-any.whl
Collecting google-cloud-bigquery==0.25.0 (from apache-beam==2.2.0.dev0)
  Using cached google_cloud_bigquery-0.25.0-py2.py3-none-any.whl
Collecting pyhamcrest<2.0,>=1.9 (from apache-beam==2.2.0.dev0)
  Using cached PyHamcrest-1.9.0-py2.py3-none-any.whl
Requirement already satisfied: six>=1.9 in ./target/.tox/py27gcp/lib/python2.7/site-packages (from apache-beam==2.2.0.dev0)
Requirement already satisfied: enum34>=1.0.4 in ./target/.tox/py27gcp/lib/python2.7/site-packages (from grpcio<2.0,>=1.0->apache-beam==2.2.0.dev0)
Requirement already satisfied: futures>=2.2.0 in ./target/.tox/py27gcp/lib/python2.7/site-packages (from grpcio<2.0,>=1.0->apache-beam==2.2.0.dev0)
Requirement already satisfied: pbr>=0.11 in ./target/.tox/py27gcp/lib/python2.7/site-packages (from mock<3.0.0,>=1.0.1->apache-beam==2.2.0.dev0)
Requirement already satisfied: funcsigs>=1; python_version < "3.3" in ./target/.tox/py27gcp/lib/python2.7/site-packages (from mock<3.0.0,>=1.0.1->apache-beam==2.2.0.dev0)
Requirement already satisfied: pyasn1>=0.1.7 in ./target/.tox/py27gcp/lib/python2.7/site-packages (from oauth2client<4.0.0,>=2.0.1->apache-beam==2.2.0.dev0)
Requirement already satisfied: pyasn1-modules>=0.0.5 in ./target/.tox/py27gcp/lib/python2.7/site-packages (from oauth2client<4.0.0,>=2.0.1->apache-beam==2.2.0.dev0)
Requirement already satisfied: rsa>=3.1.4 in ./target/.tox/py27gcp/lib/python2.7/site-packages (from oauth2client<4.0.0,>=2.0.1->apache-beam==2.2.0.dev0)
Requirement already satisfied: setuptools in ./target/.tox/py27gcp/lib/python2.7/site-packages (from protobuf<=3.3.0,>=3.2.0->apache-beam==2.2.0.dev0)
Collecting googleapis-common-protos<2.0dev,>=1.5.2 (from proto-google-cloud-datastore-v1<=0.90.4,>=0.90.0->apache-beam==2.2.0.dev0)
Collecting google-cloud-core<0.26dev,>=0.25.0 (from google-cloud-pubsub==0.26.0->apache-beam==2.2.0.dev0)
  Using cached google_cloud_core-0.25.0-py2.py3-none-any.whl
Collecting gapic-google-cloud-pubsub-v1<0.16dev,>=0.15.0 (from google-cloud-pubsub==0.26.0->apache-beam==2.2.0.dev0)
Collecting google-auth-httplib2 (from google-cloud-core<0.26dev,>=0.25.0->google-cloud-pubsub==0.26.0->apache-beam==2.2.0.dev0)
  Using cached google_auth_httplib2-0.0.2-py2.py3-none-any.whl
Collecting google-auth<2.0.0dev,>=0.4.0 (from google-cloud-core<0.26dev,>=0.25.0->google-cloud-pubsub==0.26.0->apache-beam==2.2.0.dev0)
  Using cached google_auth-1.1.0-py2.py3-none-any.whl
Collecting grpc-google-iam-v1<0.12dev,>=0.11.1 (from gapic-google-cloud-pubsub-v1<0.16dev,>=0.15.0->google-cloud-pubsub==0.26.0->apache-beam==2.2.0.dev0)
Collecting proto-google-cloud-pubsub-v1[grpc]<0.16dev,>=0.15.4 (from gapic-google-cloud-pubsub-v1<0.16dev,>=0.15.0->google-cloud-pubsub==0.26.0->apache-beam==2.2.0.dev0)
Collecting google-gax<0.16dev,>=0.15.7 (from gapic-google-cloud-pubsub-v1<0.16dev,>=0.15.0->google-cloud-pubsub==0.26.0->apache-beam==2.2.0.dev0)
Collecting cachetools>=2.0.0 (from google-auth<2.0.0dev,>=0.4.0->google-cloud-core<0.26dev,>=0.25.0->google-cloud-pubsub==0.26.0->apache-beam==2.2.0.dev0)
  Using cached cachetools-2.0.1-py2.py3-none-any.whl
Collecting requests<3.0dev,>=2.13.0 (from google-gax<0.16dev,>=0.15.7->gapic-google-cloud-pubsub-v1<0.16dev,>=0.15.0->google-cloud-pubsub==0.26.0->apache-beam==2.2.0.dev0)
  Using cached requests-2.18.4-py2.py3-none-any.whl
Collecting ply==3.8 (from google-gax<0.16dev,>=0.15.7->gapic-google-cloud-pubsub-v1<0.16dev,>=0.15.0->google-cloud-pubsub==0.26.0->apache-beam==2.2.0.dev0)
Collecting future<0.17dev,>=0.16.0 (from google-gax<0.16dev,>=0.15.7->gapic-google-cloud-pubsub-v1<0.16dev,>=0.15.0->google-cloud-pubsub==0.26.0->apache-beam==2.2.0.dev0)
Collecting urllib3<1.23,>=1.21.1 (from requests<3.0dev,>=2.13.0->google-gax<0.16dev,>=0.15.7->gapic-google-cloud-pubsub-v1<0.16dev,>=0.15.0->google-cloud-pubsub==0.26.0->apache-beam==2.2.0.dev0)
  Using cached urllib3-1.22-py2.py3-none-any.whl
Collecting certifi>=2017.4.17 (from requests<3.0dev,>=2.13.0->google-gax<0.16dev,>=0.15.7->gapic-google-cloud-pubsub-v1<0.16dev,>=0.15.0->google-cloud-pubsub==0.26.0->apache-beam==2.2.0.dev0)
  Using cached certifi-2017.7.27.1-py2.py3-none-any.whl
Collecting chardet<3.1.0,>=3.0.2 (from requests<3.0dev,>=2.13.0->google-gax<0.16dev,>=0.15.7->gapic-google-cloud-pubsub-v1<0.16dev,>=0.15.0->google-cloud-pubsub==0.26.0->apache-beam==2.2.0.dev0)
  Using cached chardet-3.0.4-py2.py3-none-any.whl
Collecting idna<2.7,>=2.5 (from requests<3.0dev,>=2.13.0->google-gax<0.16dev,>=0.15.7->gapic-google-cloud-pubsub-v1<0.16dev,>=0.15.0->google-cloud-pubsub==0.26.0->apache-beam==2.2.0.dev0)
  Using cached idna-2.6-py2.py3-none-any.whl
Installing collected packages: google-apitools, googleapis-common-protos, proto-google-cloud-datastore-v1, googledatastore, cachetools, google-auth, google-auth-httplib2, google-cloud-core, grpc-google-iam-v1, proto-google-cloud-pubsub-v1, urllib3, certifi, chardet, idna, requests, ply, future, google-gax, gapic-google-cloud-pubsub-v1, google-cloud-pubsub, google-cloud-bigquery, pyhamcrest, apache-beam
  Found existing installation: apache-beam 2.2.0.dev0
    Uninstalling apache-beam-2.2.0.dev0:
      Successfully uninstalled apache-beam-2.2.0.dev0
  Running setup.py develop for apache-beam
Successfully installed apache-beam cachetools-2.0.1 certifi-2017.7.27.1 chardet-3.0.4 future-0.16.0 gapic-google-cloud-pubsub-v1-0.15.4 google-apitools-0.5.11 google-auth-1.1.0 google-auth-httplib2-0.0.2 google-cloud-bigquery-0.25.0 google-cloud-core-0.25.0 google-cloud-pubsub-0.26.0 google-gax-0.15.14 googleapis-common-protos-1.5.2 googledatastore-7.0.1 grpc-google-iam-v1-0.11.3 idna-2.6 ply-3.8 proto-google-cloud-datastore-v1-0.90.4 proto-google-cloud-pubsub-v1-0.15.4 pyhamcrest-1.9.0 requests-2.18.4 urllib3-1.22
py27gcp runtests: commands[1] | python --version
Python 2.7.6
py27gcp runtests: commands[2] | - find apache_beam -type f -name *.pyc -delete
py27gcp runtests: commands[3] | python apache_beam/examples/complete/autocomplete_test.py
Traceback (most recent call last):
  File "apache_beam/examples/complete/autocomplete_test.py", line 22, in <module>
    import apache_beam as beam
  File "<https://builds.apache.org/job/beam_PostCommit_Python_Verify/ws/sdks/python/apache_beam/__init__.py",> line 87, in <module>
    from apache_beam import io
  File "<https://builds.apache.org/job/beam_PostCommit_Python_Verify/ws/sdks/python/apache_beam/io/__init__.py",> line 21, in <module>
    from apache_beam.io.avroio import *
  File "<https://builds.apache.org/job/beam_PostCommit_Python_Verify/ws/sdks/python/apache_beam/io/avroio.py",> line 56, in <module>
    from apache_beam.io import filebasedsink
  File "<https://builds.apache.org/job/beam_PostCommit_Python_Verify/ws/sdks/python/apache_beam/io/filebasedsink.py",> line 32, in <module>
    from apache_beam.io.filesystems import FileSystems
  File "<https://builds.apache.org/job/beam_PostCommit_Python_Verify/ws/sdks/python/apache_beam/io/filesystems.py",> line 30, in <module>
    from apache_beam.io.gcp.gcsfilesystem import GCSFileSystem
  File "<https://builds.apache.org/job/beam_PostCommit_Python_Verify/ws/sdks/python/apache_beam/io/gcp/gcsfilesystem.py",> line 27, in <module>
    from apache_beam.io.gcp import gcsio
  File "<https://builds.apache.org/job/beam_PostCommit_Python_Verify/ws/sdks/python/apache_beam/io/gcp/gcsio.py",> line 37, in <module>
    from apache_beam.utils import retry
  File "<https://builds.apache.org/job/beam_PostCommit_Python_Verify/ws/sdks/python/apache_beam/utils/retry.py",> line 40, in <module>
    from apitools.base.py.exceptions import HttpError
  File "<https://builds.apache.org/job/beam_PostCommit_Python_Verify/ws/sdks/python/target/.tox/py27gcp/local/lib/python2.7/site-packages/apitools/base/py/__init__.py",> line 21, in <module>
    from apitools.base.py.base_api import *
  File "<https://builds.apache.org/job/beam_PostCommit_Python_Verify/ws/sdks/python/target/.tox/py27gcp/local/lib/python2.7/site-packages/apitools/base/py/base_api.py",> line 31, in <module>
    from apitools.base.protorpclite import message_types
  File "<https://builds.apache.org/job/beam_PostCommit_Python_Verify/ws/sdks/python/target/.tox/py27gcp/local/lib/python2.7/site-packages/apitools/base/protorpclite/message_types.py",> line 25, in <module>
    from apitools.base.protorpclite import messages
  File "<https://builds.apache.org/job/beam_PostCommit_Python_Verify/ws/sdks/python/target/.tox/py27gcp/local/lib/python2.7/site-packages/apitools/base/protorpclite/messages.py",> line 1165, in <module>
    class Field(six.with_metaclass(_FieldMeta, object)):
TypeError: Error when calling the metaclass bases
    metaclass conflict: the metaclass of a derived class must be a (non-strict) subclass of the metaclasses of all its bases
ERROR: InvocationError: '<https://builds.apache.org/job/beam_PostCommit_Python_Verify/ws/sdks/python/target/.tox/py27gcp/bin/python> apache_beam/examples/complete/autocomplete_test.py'
___________________________________ summary ____________________________________
ERROR:   docs: commands failed
  lint: commands succeeded
  py27: commands succeeded
  py27cython: commands succeeded
ERROR:   py27gcp: commands failed
Build step 'Execute shell' marked build as failure
Not sending mail to unregistered user echauchot@gmail.com+jbonofre@apache.org

Jenkins build is back to normal : beam_PostCommit_Python_Verify #3164

Posted by Apache Jenkins Server <je...@builds.apache.org>.
See <https://builds.apache.org/job/beam_PostCommit_Python_Verify/3164/display/redirect?page=changes>


Build failed in Jenkins: beam_PostCommit_Python_Verify #3163

Posted by Apache Jenkins Server <je...@builds.apache.org>.
See <https://builds.apache.org/job/beam_PostCommit_Python_Verify/3163/display/redirect>

------------------------------------------
[...truncated 45.40 KB...]
Collecting mock<3.0.0,>=1.0.1 (from apache-beam==2.2.0.dev0)
  Using cached mock-2.0.0-py2.py3-none-any.whl
Collecting oauth2client<4.0.0,>=2.0.1 (from apache-beam==2.2.0.dev0)
Collecting protobuf<=3.3.0,>=3.2.0 (from apache-beam==2.2.0.dev0)
  Using cached protobuf-3.3.0-cp27-cp27mu-manylinux1_x86_64.whl
Collecting pyyaml<4.0.0,>=3.12 (from apache-beam==2.2.0.dev0)
Collecting typing<3.7.0,>=3.6.0 (from apache-beam==2.2.0.dev0)
  Using cached typing-3.6.2-py2-none-any.whl
Requirement already satisfied: enum34>=1.0.4 in ./target/.tox/py27cython/lib/python2.7/site-packages (from grpcio<2.0,>=1.0->apache-beam==2.2.0.dev0)
Requirement already satisfied: six>=1.5.2 in ./target/.tox/py27cython/lib/python2.7/site-packages (from grpcio<2.0,>=1.0->apache-beam==2.2.0.dev0)
Requirement already satisfied: futures>=2.2.0 in ./target/.tox/py27cython/lib/python2.7/site-packages (from grpcio<2.0,>=1.0->apache-beam==2.2.0.dev0)
Collecting funcsigs>=1; python_version < "3.3" (from mock<3.0.0,>=1.0.1->apache-beam==2.2.0.dev0)
  Using cached funcsigs-1.0.2-py2.py3-none-any.whl
Collecting pbr>=0.11 (from mock<3.0.0,>=1.0.1->apache-beam==2.2.0.dev0)
  Using cached pbr-3.1.1-py2.py3-none-any.whl
Collecting pyasn1>=0.1.7 (from oauth2client<4.0.0,>=2.0.1->apache-beam==2.2.0.dev0)
  Using cached pyasn1-0.3.5-py2.py3-none-any.whl
Collecting pyasn1-modules>=0.0.5 (from oauth2client<4.0.0,>=2.0.1->apache-beam==2.2.0.dev0)
  Using cached pyasn1_modules-0.1.4-py2.py3-none-any.whl
Collecting rsa>=3.1.4 (from oauth2client<4.0.0,>=2.0.1->apache-beam==2.2.0.dev0)
  Using cached rsa-3.4.2-py2.py3-none-any.whl
Requirement already satisfied: setuptools in ./target/.tox/py27cython/lib/python2.7/site-packages (from protobuf<=3.3.0,>=3.2.0->apache-beam==2.2.0.dev0)
Building wheels for collected packages: apache-beam
  Running setup.py bdist_wheel for apache-beam: started
  Running setup.py bdist_wheel for apache-beam: finished with status 'error'
  Complete output from command <https://builds.apache.org/job/beam_PostCommit_Python_Verify/ws/sdks/python/target/.tox/py27cython/bin/python> -u -c "import setuptools, tokenize;__file__='/tmp/pip-KnWc7E-build/setup.py';f=getattr(tokenize, 'open', open)(__file__);code=f.read().replace('\r\n', '\n');f.close();exec(compile(code, __file__, 'exec'))" bdist_wheel -d /tmp/tmp6P3z6Ppip-wheel- --python-tag cp27:
  <https://builds.apache.org/job/beam_PostCommit_Python_Verify/ws/sdks/python/target/.tox/py27cython/local/lib/python2.7/site-packages/setuptools/dist.py>:351: UserWarning: Normalizing '2.2.0.dev' to '2.2.0.dev0'
    normalized_version,
  running bdist_wheel
  running build
  running build_py
  Traceback (most recent call last):
    File "<string>", line 1, in <module>
    File "/tmp/pip-KnWc7E-build/setup.py", line 198, in <module>
      'test': generate_protos_first(test),
    File "/usr/lib/python2.7/distutils/core.py", line 151, in setup
      dist.run_commands()
    File "/usr/lib/python2.7/distutils/dist.py", line 953, in run_commands
      self.run_command(cmd)
    File "/usr/lib/python2.7/distutils/dist.py", line 972, in run_command
      cmd_obj.run()
    File "<https://builds.apache.org/job/beam_PostCommit_Python_Verify/ws/sdks/python/target/.tox/py27cython/local/lib/python2.7/site-packages/wheel/bdist_wheel.py",> line 204, in run
      self.run_command('build')
    File "/usr/lib/python2.7/distutils/cmd.py", line 326, in run_command
      self.distribution.run_command(command)
    File "/usr/lib/python2.7/distutils/dist.py", line 972, in run_command
      cmd_obj.run()
    File "/usr/lib/python2.7/distutils/command/build.py", line 128, in run
      self.run_command(cmd_name)
    File "/usr/lib/python2.7/distutils/cmd.py", line 326, in run_command
      self.distribution.run_command(command)
    File "/usr/lib/python2.7/distutils/dist.py", line 972, in run_command
      cmd_obj.run()
    File "/tmp/pip-KnWc7E-build/setup.py", line 138, in run
      gen_protos.generate_proto_files()
    File "gen_protos.py", line 65, in generate_proto_files
      'Not in apache git tree; unable to find proto definitions.')
  RuntimeError: Not in apache git tree; unable to find proto definitions.
  
  ----------------------------------------
  Failed building wheel for apache-beam
  Running setup.py clean for apache-beam
Failed to build apache-beam
Installing collected packages: avro, crcmod, dill, httplib2, funcsigs, pbr, mock, pyasn1, pyasn1-modules, rsa, oauth2client, protobuf, pyyaml, typing, apache-beam
  Found existing installation: protobuf 3.4.0
    Uninstalling protobuf-3.4.0:
      Successfully uninstalled protobuf-3.4.0
  Running setup.py install for apache-beam: started
    Running setup.py install for apache-beam: finished with status 'error'
    Complete output from command <https://builds.apache.org/job/beam_PostCommit_Python_Verify/ws/sdks/python/target/.tox/py27cython/bin/python> -u -c "import setuptools, tokenize;__file__='/tmp/pip-KnWc7E-build/setup.py';f=getattr(tokenize, 'open', open)(__file__);code=f.read().replace('\r\n', '\n');f.close();exec(compile(code, __file__, 'exec'))" install --record /tmp/pip-VLCMsM-record/install-record.txt --single-version-externally-managed --compile --install-headers <https://builds.apache.org/job/beam_PostCommit_Python_Verify/ws/sdks/python/target/.tox/py27cython/include/site/python2.7/apache-beam>:
    <https://builds.apache.org/job/beam_PostCommit_Python_Verify/ws/sdks/python/target/.tox/py27cython/local/lib/python2.7/site-packages/setuptools/dist.py>:351: UserWarning: Normalizing '2.2.0.dev' to '2.2.0.dev0'
      normalized_version,
    running install
    running build
    running build_py
    Traceback (most recent call last):
      File "<string>", line 1, in <module>
      File "/tmp/pip-KnWc7E-build/setup.py", line 198, in <module>
        'test': generate_protos_first(test),
      File "/usr/lib/python2.7/distutils/core.py", line 151, in setup
        dist.run_commands()
      File "/usr/lib/python2.7/distutils/dist.py", line 953, in run_commands
        self.run_command(cmd)
      File "/usr/lib/python2.7/distutils/dist.py", line 972, in run_command
        cmd_obj.run()
      File "<https://builds.apache.org/job/beam_PostCommit_Python_Verify/ws/sdks/python/target/.tox/py27cython/local/lib/python2.7/site-packages/setuptools/command/install.py",> line 61, in run
        return orig.install.run(self)
      File "/usr/lib/python2.7/distutils/command/install.py", line 601, in run
        self.run_command('build')
      File "/usr/lib/python2.7/distutils/cmd.py", line 326, in run_command
        self.distribution.run_command(command)
      File "/usr/lib/python2.7/distutils/dist.py", line 972, in run_command
        cmd_obj.run()
      File "/usr/lib/python2.7/distutils/command/build.py", line 128, in run
        self.run_command(cmd_name)
      File "/usr/lib/python2.7/distutils/cmd.py", line 326, in run_command
        self.distribution.run_command(command)
      File "/usr/lib/python2.7/distutils/dist.py", line 972, in run_command
        cmd_obj.run()
      File "/tmp/pip-KnWc7E-build/setup.py", line 138, in run
        gen_protos.generate_proto_files()
      File "gen_protos.py", line 65, in generate_proto_files
        'Not in apache git tree; unable to find proto definitions.')
    RuntimeError: Not in apache git tree; unable to find proto definitions.
    
    ----------------------------------------
Command "<https://builds.apache.org/job/beam_PostCommit_Python_Verify/ws/sdks/python/target/.tox/py27cython/bin/python> -u -c "import setuptools, tokenize;__file__='/tmp/pip-KnWc7E-build/setup.py';f=getattr(tokenize, 'open', open)(__file__);code=f.read().replace('\r\n', '\n');f.close();exec(compile(code, __file__, 'exec'))" install --record /tmp/pip-VLCMsM-record/install-record.txt --single-version-externally-managed --compile --install-headers <https://builds.apache.org/job/beam_PostCommit_Python_Verify/ws/sdks/python/target/.tox/py27cython/include/site/python2.7/apache-beam"> failed with error code 1 in /tmp/pip-KnWc7E-build/

py27cython installed: avro==1.8.2,crcmod==1.7,Cython==0.25.2,dill==0.2.6,enum34==1.1.6,funcsigs==1.0.2,futures==3.1.1,grpcio==1.6.0,grpcio-tools==1.3.5,httplib2==0.9.2,mock==2.0.0,nose==1.3.7,oauth2client==3.0.0,pbr==3.1.1,protobuf==3.3.0,pyasn1==0.3.5,pyasn1-modules==0.1.4,PyYAML==3.12,rsa==3.4.2,six==1.11.0,typing==3.6.2
py27gcp create: <https://builds.apache.org/job/beam_PostCommit_Python_Verify/ws/sdks/python/target/.tox/py27gcp>
py27gcp installdeps: nose==1.3.7
py27gcp inst: <https://builds.apache.org/job/beam_PostCommit_Python_Verify/ws/sdks/python/target/.tox/dist/apache-beam-2.2.0.dev.zip>
ERROR: invocation failed (exit code 1), logfile: <https://builds.apache.org/job/beam_PostCommit_Python_Verify/ws/sdks/python/target/.tox/py27gcp/log/py27gcp-2.log>
ERROR: actionid: py27gcp
msg: installpkg
cmdargs: [local('<https://builds.apache.org/job/beam_PostCommit_Python_Verify/ws/sdks/python/target/.tox/py27gcp/bin/pip'),> 'install', '<https://builds.apache.org/job/beam_PostCommit_Python_Verify/ws/sdks/python/target/.tox/dist/apache-beam-2.2.0.dev.zip']>
env: {'JENKINS_HOME': '/x1/jenkins/jenkins-home', 'BUILD_CAUSE': 'TIMERTRIGGER', 'GIT_COMMIT': 'c25bead5598d574fe5a277f4e67ab6e275492f47', 'HUDSON_URL': 'https://builds.apache.org/', 'BUILD_URL': 'https://builds.apache.org/job/beam_PostCommit_Python_Verify/3163/', 'GIT_PREVIOUS_COMMIT': 'c25bead5598d574fe5a277f4e67ab6e275492f47', 'BUILD_TAG': 'jenkins-beam_PostCommit_Python_Verify-3163', 'SSH_CLIENT': '62.210.60.235 55148 22', 'JENKINS_URL': 'https://builds.apache.org/', 'LOGNAME': 'jenkins', 'USER': 'jenkins', 'WORKSPACE': '<https://builds.apache.org/job/beam_PostCommit_Python_Verify/ws/',> 'HOME': '/home/jenkins', 'PATH': '<https://builds.apache.org/job/beam_PostCommit_Python_Verify/ws/sdks/python/target/.tox/py27gcp/bin>:/home/jenkins/tools/java/latest1.8/bin:/usr/local/sbin:/usr/local/bin:/usr/sbin:/usr/bin:/sbin:/bin:/usr/games:/usr/local/games', 'JOB_NAME': 'beam_PostCommit_Python_Verify', 'LANG': 'en_US.UTF-8', 'RUN_DISPLAY_URL': 'https://builds.apache.org/job/beam_PostCommit_Python_Verify/3163/display/redirect', 'VIRTUAL_ENV': '<https://builds.apache.org/job/beam_PostCommit_Python_Verify/ws/sdks/python/target/.tox/py27gcp',> 'SHELL': '/bin/bash', 'GIT_PREVIOUS_SUCCESSFUL_COMMIT': 'bd0facc469b2312dd7ca2e2a7161c5562cd58b36', 'SHLVL': '3', 'NLSPATH': '/usr/dt/lib/nls/msg/%L/%N.cat', 'GIT_AUTHOR_EMAIL': 'builds@apache.org', 'HUDSON_HOME': '/x1/jenkins/jenkins-home', 'NODE_LABELS': 'beam beam3', 'GIT_COMMITTER_EMAIL': 'builds@apache.org', 'BUILD_CAUSE_TIMERTRIGGER': 'true', 'PYTHONHASHSEED': '1993697186', 'JAVA_HOME': '/home/jenkins/tools/java/latest1.8', 'ROOT_BUILD_CAUSE': 'TIMERTRIGGER', 'BUILD_ID': '3163', 'BUILD_NUMBER': '3163', 'XDG_RUNTIME_DIR': '/run/user/9997', 'HUDSON_COOKIE': 'b6e90aed-5c0d-476b-a412-c3dcaac0d00e', 'JOB_URL': 'https://builds.apache.org/job/beam_PostCommit_Python_Verify/', 'TEST_HOST': 'beam3', 'GIT_BRANCH': 'origin/master', 'JOB_BASE_NAME': 'beam_PostCommit_Python_Verify', 'GIT_AUTHOR_NAME': 'jenkins', 'ROOT_BUILD_CAUSE_TIMERTRIGGER': 'true', 'GIT_COMMITTER_NAME': 'jenkins', 'XDG_SESSION_ID': '122', '_': '/home/jenkins/.local/bin//tox', 'sha1': 'master', 'COVERALLS_REPO_TOKEN': '****', 'JOB_DISPLAY_URL': 'https://builds.apache.org/job/beam_PostCommit_Python_Verify/display/redirect', 'HUDSON_SERVER_COOKIE': 'f4ebd1e6b0d976e8', 'EXECUTOR_NUMBER': '0', 'NODE_NAME': 'beam3', 'PWD': '<https://builds.apache.org/job/beam_PostCommit_Python_Verify/ws/',> 'SPARK_LOCAL_IP': '127.0.0.1', 'JENKINS_SERVER_COOKIE': 'f4ebd1e6b0d976e8', 'BUILD_DISPLAY_NAME': '#3163', 'XFILESEARCHPATH': '/usr/dt/app-defaults/%L/Dt', 'MAIL': '/var/mail/jenkins', 'SSH_CONNECTION': '62.210.60.235 55148 10.128.0.4 22', 'RUN_CHANGES_DISPLAY_URL': 'https://builds.apache.org/job/beam_PostCommit_Python_Verify/3163/display/redirect?page=changes', 'GIT_URL': 'https://github.com/apache/beam.git'}

Processing ./target/.tox/dist/apache-beam-2.2.0.dev.zip
Collecting avro<2.0.0,>=1.8.1 (from apache-beam==2.2.0.dev0)
Collecting crcmod<2.0,>=1.7 (from apache-beam==2.2.0.dev0)
Collecting dill==0.2.6 (from apache-beam==2.2.0.dev0)
Collecting grpcio<2.0,>=1.0 (from apache-beam==2.2.0.dev0)
  Using cached grpcio-1.6.0-cp27-cp27mu-manylinux1_x86_64.whl
Collecting httplib2<0.10,>=0.8 (from apache-beam==2.2.0.dev0)
Collecting mock<3.0.0,>=1.0.1 (from apache-beam==2.2.0.dev0)
  Using cached mock-2.0.0-py2.py3-none-any.whl
Collecting oauth2client<4.0.0,>=2.0.1 (from apache-beam==2.2.0.dev0)
Collecting protobuf<=3.3.0,>=3.2.0 (from apache-beam==2.2.0.dev0)
  Using cached protobuf-3.3.0-cp27-cp27mu-manylinux1_x86_64.whl
Collecting pyyaml<4.0.0,>=3.12 (from apache-beam==2.2.0.dev0)
Collecting typing<3.7.0,>=3.6.0 (from apache-beam==2.2.0.dev0)
  Using cached typing-3.6.2-py2-none-any.whl
Collecting enum34>=1.0.4 (from grpcio<2.0,>=1.0->apache-beam==2.2.0.dev0)
  Using cached enum34-1.1.6-py2-none-any.whl
Collecting six>=1.5.2 (from grpcio<2.0,>=1.0->apache-beam==2.2.0.dev0)
  Using cached six-1.11.0-py2.py3-none-any.whl
Collecting futures>=2.2.0 (from grpcio<2.0,>=1.0->apache-beam==2.2.0.dev0)
  Using cached futures-3.1.1-py2-none-any.whl
Collecting funcsigs>=1; python_version < "3.3" (from mock<3.0.0,>=1.0.1->apache-beam==2.2.0.dev0)
  Using cached funcsigs-1.0.2-py2.py3-none-any.whl
Collecting pbr>=0.11 (from mock<3.0.0,>=1.0.1->apache-beam==2.2.0.dev0)
  Using cached pbr-3.1.1-py2.py3-none-any.whl
Collecting pyasn1>=0.1.7 (from oauth2client<4.0.0,>=2.0.1->apache-beam==2.2.0.dev0)
  Using cached pyasn1-0.3.5-py2.py3-none-any.whl
Collecting pyasn1-modules>=0.0.5 (from oauth2client<4.0.0,>=2.0.1->apache-beam==2.2.0.dev0)
  Using cached pyasn1_modules-0.1.4-py2.py3-none-any.whl
Collecting rsa>=3.1.4 (from oauth2client<4.0.0,>=2.0.1->apache-beam==2.2.0.dev0)
  Using cached rsa-3.4.2-py2.py3-none-any.whl
Requirement already satisfied: setuptools in ./target/.tox/py27gcp/lib/python2.7/site-packages (from protobuf<=3.3.0,>=3.2.0->apache-beam==2.2.0.dev0)
Building wheels for collected packages: apache-beam
  Running setup.py bdist_wheel for apache-beam: started
  Running setup.py bdist_wheel for apache-beam: finished with status 'error'
  Complete output from command <https://builds.apache.org/job/beam_PostCommit_Python_Verify/ws/sdks/python/target/.tox/py27gcp/bin/python> -u -c "import setuptools, tokenize;__file__='/tmp/pip-fQY2X9-build/setup.py';f=getattr(tokenize, 'open', open)(__file__);code=f.read().replace('\r\n', '\n');f.close();exec(compile(code, __file__, 'exec'))" bdist_wheel -d /tmp/tmp3MZ9Jepip-wheel- --python-tag cp27:
  <https://builds.apache.org/job/beam_PostCommit_Python_Verify/ws/sdks/python/target/.tox/py27gcp/local/lib/python2.7/site-packages/setuptools/dist.py>:351: UserWarning: Normalizing '2.2.0.dev' to '2.2.0.dev0'
    normalized_version,
  running bdist_wheel
  running build
  running build_py
  gen_protos.py:46: UserWarning: Installing grpcio-tools is recommended for development.
    warnings.warn('Installing grpcio-tools is recommended for development.')
  Traceback (most recent call last):
    File "<string>", line 1, in <module>
    File "/tmp/pip-fQY2X9-build/setup.py", line 198, in <module>
      'test': generate_protos_first(test),
    File "/usr/lib/python2.7/distutils/core.py", line 151, in setup
      dist.run_commands()
    File "/usr/lib/python2.7/distutils/dist.py", line 953, in run_commands
      self.run_command(cmd)
    File "/usr/lib/python2.7/distutils/dist.py", line 972, in run_command
      cmd_obj.run()
    File "<https://builds.apache.org/job/beam_PostCommit_Python_Verify/ws/sdks/python/target/.tox/py27gcp/local/lib/python2.7/site-packages/wheel/bdist_wheel.py",> line 204, in run
      self.run_command('build')
    File "/usr/lib/python2.7/distutils/cmd.py", line 326, in run_command
      self.distribution.run_command(command)
    File "/usr/lib/python2.7/distutils/dist.py", line 972, in run_command
      cmd_obj.run()
    File "/usr/lib/python2.7/distutils/command/build.py", line 128, in run
      self.run_command(cmd_name)
    File "/usr/lib/python2.7/distutils/cmd.py", line 326, in run_command
      self.distribution.run_command(command)
    File "/usr/lib/python2.7/distutils/dist.py", line 972, in run_command
      cmd_obj.run()
    File "/tmp/pip-fQY2X9-build/setup.py", line 138, in run
      gen_protos.generate_proto_files()
    File "gen_protos.py", line 65, in generate_proto_files
      'Not in apache git tree; unable to find proto definitions.')
  RuntimeError: Not in apache git tree; unable to find proto definitions.
  
  ----------------------------------------
  Failed building wheel for apache-beam
  Running setup.py clean for apache-beam
Failed to build apache-beam
Installing collected packages: avro, crcmod, dill, enum34, six, futures, protobuf, grpcio, httplib2, funcsigs, pbr, mock, pyasn1, pyasn1-modules, rsa, oauth2client, pyyaml, typing, apache-beam
  Running setup.py install for apache-beam: started
    Running setup.py install for apache-beam: finished with status 'error'
    Complete output from command <https://builds.apache.org/job/beam_PostCommit_Python_Verify/ws/sdks/python/target/.tox/py27gcp/bin/python> -u -c "import setuptools, tokenize;__file__='/tmp/pip-fQY2X9-build/setup.py';f=getattr(tokenize, 'open', open)(__file__);code=f.read().replace('\r\n', '\n');f.close();exec(compile(code, __file__, 'exec'))" install --record /tmp/pip-Sw8wqM-record/install-record.txt --single-version-externally-managed --compile --install-headers <https://builds.apache.org/job/beam_PostCommit_Python_Verify/ws/sdks/python/target/.tox/py27gcp/include/site/python2.7/apache-beam>:
    <https://builds.apache.org/job/beam_PostCommit_Python_Verify/ws/sdks/python/target/.tox/py27gcp/local/lib/python2.7/site-packages/setuptools/dist.py>:351: UserWarning: Normalizing '2.2.0.dev' to '2.2.0.dev0'
      normalized_version,
    running install
    running build
    running build_py
    gen_protos.py:46: UserWarning: Installing grpcio-tools is recommended for development.
      warnings.warn('Installing grpcio-tools is recommended for development.')
    Traceback (most recent call last):
      File "<string>", line 1, in <module>
      File "/tmp/pip-fQY2X9-build/setup.py", line 198, in <module>
        'test': generate_protos_first(test),
      File "/usr/lib/python2.7/distutils/core.py", line 151, in setup
        dist.run_commands()
      File "/usr/lib/python2.7/distutils/dist.py", line 953, in run_commands
        self.run_command(cmd)
      File "/usr/lib/python2.7/distutils/dist.py", line 972, in run_command
        cmd_obj.run()
      File "<https://builds.apache.org/job/beam_PostCommit_Python_Verify/ws/sdks/python/target/.tox/py27gcp/local/lib/python2.7/site-packages/setuptools/command/install.py",> line 61, in run
        return orig.install.run(self)
      File "/usr/lib/python2.7/distutils/command/install.py", line 601, in run
        self.run_command('build')
      File "/usr/lib/python2.7/distutils/cmd.py", line 326, in run_command
        self.distribution.run_command(command)
      File "/usr/lib/python2.7/distutils/dist.py", line 972, in run_command
        cmd_obj.run()
      File "/usr/lib/python2.7/distutils/command/build.py", line 128, in run
        self.run_command(cmd_name)
      File "/usr/lib/python2.7/distutils/cmd.py", line 326, in run_command
        self.distribution.run_command(command)
      File "/usr/lib/python2.7/distutils/dist.py", line 972, in run_command
        cmd_obj.run()
      File "/tmp/pip-fQY2X9-build/setup.py", line 138, in run
        gen_protos.generate_proto_files()
      File "gen_protos.py", line 65, in generate_proto_files
        'Not in apache git tree; unable to find proto definitions.')
    RuntimeError: Not in apache git tree; unable to find proto definitions.
    
    ----------------------------------------
Command "<https://builds.apache.org/job/beam_PostCommit_Python_Verify/ws/sdks/python/target/.tox/py27gcp/bin/python> -u -c "import setuptools, tokenize;__file__='/tmp/pip-fQY2X9-build/setup.py';f=getattr(tokenize, 'open', open)(__file__);code=f.read().replace('\r\n', '\n');f.close();exec(compile(code, __file__, 'exec'))" install --record /tmp/pip-Sw8wqM-record/install-record.txt --single-version-externally-managed --compile --install-headers <https://builds.apache.org/job/beam_PostCommit_Python_Verify/ws/sdks/python/target/.tox/py27gcp/include/site/python2.7/apache-beam"> failed with error code 1 in /tmp/pip-fQY2X9-build/

py27gcp installed: avro==1.8.2,crcmod==1.7,dill==0.2.6,enum34==1.1.6,funcsigs==1.0.2,futures==3.1.1,grpcio==1.6.0,httplib2==0.9.2,mock==2.0.0,nose==1.3.7,oauth2client==3.0.0,pbr==3.1.1,protobuf==3.3.0,pyasn1==0.3.5,pyasn1-modules==0.1.4,PyYAML==3.12,rsa==3.4.2,six==1.11.0,typing==3.6.2
___________________________________ summary ____________________________________
ERROR:   docs: InvocationError: <https://builds.apache.org/job/beam_PostCommit_Python_Verify/ws/sdks/python/target/.tox/docs/bin/pip> install <https://builds.apache.org/job/beam_PostCommit_Python_Verify/ws/sdks/python/target/.tox/dist/apache-beam-2.2.0.dev.zip> (see <https://builds.apache.org/job/beam_PostCommit_Python_Verify/ws/sdks/python/target/.tox/docs/log/docs-2.log)>
ERROR:   lint: InvocationError: <https://builds.apache.org/job/beam_PostCommit_Python_Verify/ws/sdks/python/target/.tox/lint/bin/pip> install <https://builds.apache.org/job/beam_PostCommit_Python_Verify/ws/sdks/python/target/.tox/dist/apache-beam-2.2.0.dev.zip> (see <https://builds.apache.org/job/beam_PostCommit_Python_Verify/ws/sdks/python/target/.tox/lint/log/lint-2.log)>
ERROR:   py27: InvocationError: <https://builds.apache.org/job/beam_PostCommit_Python_Verify/ws/sdks/python/target/.tox/py27/bin/pip> install <https://builds.apache.org/job/beam_PostCommit_Python_Verify/ws/sdks/python/target/.tox/dist/apache-beam-2.2.0.dev.zip> (see <https://builds.apache.org/job/beam_PostCommit_Python_Verify/ws/sdks/python/target/.tox/py27/log/py27-2.log)>
ERROR:   py27cython: InvocationError: <https://builds.apache.org/job/beam_PostCommit_Python_Verify/ws/sdks/python/target/.tox/py27cython/bin/pip> install <https://builds.apache.org/job/beam_PostCommit_Python_Verify/ws/sdks/python/target/.tox/dist/apache-beam-2.2.0.dev.zip> (see <https://builds.apache.org/job/beam_PostCommit_Python_Verify/ws/sdks/python/target/.tox/py27cython/log/py27cython-2.log)>
ERROR:   py27gcp: InvocationError: <https://builds.apache.org/job/beam_PostCommit_Python_Verify/ws/sdks/python/target/.tox/py27gcp/bin/pip> install <https://builds.apache.org/job/beam_PostCommit_Python_Verify/ws/sdks/python/target/.tox/dist/apache-beam-2.2.0.dev.zip> (see <https://builds.apache.org/job/beam_PostCommit_Python_Verify/ws/sdks/python/target/.tox/py27gcp/log/py27gcp-2.log)>
Build step 'Execute shell' marked build as failure
Not sending mail to unregistered user klk@google.com
Not sending mail to unregistered user aljoscha.krettek@gmail.com
Not sending mail to unregistered user echauchot@gmail.com+jbonofre@apache.org
Not sending mail to unregistered user kirpichov@google.com

Build failed in Jenkins: beam_PostCommit_Python_Verify #3162

Posted by Apache Jenkins Server <je...@builds.apache.org>.
See <https://builds.apache.org/job/beam_PostCommit_Python_Verify/3162/display/redirect?page=changes>

Changes:

[klk] Move DoFnInfo to SDK util

[klk] Update Dataflow container version to 20170918

------------------------------------------
[...truncated 457.23 KB...]
test_getitem_duplicates_ignored (apache_beam.typehints.typehints_test.UnionHintTestCase) ... ok
test_getitem_must_be_valid_type_param (apache_beam.typehints.typehints_test.UnionHintTestCase) ... ok
test_getitem_must_be_valid_type_param_cant_be_object_instance (apache_beam.typehints.typehints_test.UnionHintTestCase) ... ok
test_getitem_nested_unions_flattened (apache_beam.typehints.typehints_test.UnionHintTestCase) ... ok
test_nested_compatibility (apache_beam.typehints.typehints_test.UnionHintTestCase) ... ok
test_union_hint_compatibility (apache_beam.typehints.typehints_test.UnionHintTestCase) ... ok
test_union_hint_enforcement_composite_type_in_union (apache_beam.typehints.typehints_test.UnionHintTestCase) ... ok
test_union_hint_enforcement_not_part_of_union (apache_beam.typehints.typehints_test.UnionHintTestCase) ... ok
test_union_hint_enforcement_part_of_union (apache_beam.typehints.typehints_test.UnionHintTestCase) ... ok
test_union_hint_repr (apache_beam.typehints.typehints_test.UnionHintTestCase) ... ok
test_deprecated_with_since_current (apache_beam.utils.annotations_test.AnnotationTests) ... ok
test_deprecated_with_since_current_message (apache_beam.utils.annotations_test.AnnotationTests) ... ok
test_deprecated_without_current (apache_beam.utils.annotations_test.AnnotationTests) ... ok
test_deprecated_without_since_should_fail (apache_beam.utils.annotations_test.AnnotationTests) ... ok
test_experimental_with_current (apache_beam.utils.annotations_test.AnnotationTests) ... ok
test_experimental_with_current_message (apache_beam.utils.annotations_test.AnnotationTests) ... ok
test_experimental_without_current (apache_beam.utils.annotations_test.AnnotationTests) ... ok
test_frequency (apache_beam.utils.annotations_test.AnnotationTests)
Tests that the filter 'once' is sufficient to print once per ... ok
test_equal_objects (apache_beam.utils.counters_test.CounterNameTest) ... ok
test_hash_two_objects (apache_beam.utils.counters_test.CounterNameTest) ... ok
test_method_forwarding_not_windows (apache_beam.utils.processes_test.Exec) ... ok
test_method_forwarding_windows (apache_beam.utils.processes_test.Exec) ... ok
test_call_two_objects (apache_beam.utils.retry_test.RetryStateTest) ... ok
test_single_failure (apache_beam.utils.retry_test.RetryStateTest) ... ok
test_two_failures (apache_beam.utils.retry_test.RetryStateTest) ... ok
test_log_calls_for_permanent_failure (apache_beam.utils.retry_test.RetryTest) ... ok
test_log_calls_for_transient_failure (apache_beam.utils.retry_test.RetryTest) ... ok
test_with_default_number_of_retries (apache_beam.utils.retry_test.RetryTest) ... ok
test_with_explicit_decorator (apache_beam.utils.retry_test.RetryTest) ... ok
test_with_explicit_initial_delay (apache_beam.utils.retry_test.RetryTest) ... ok
test_with_explicit_number_of_retries (apache_beam.utils.retry_test.RetryTest) ... ok
test_with_http_error_that_should_be_retried (apache_beam.utils.retry_test.RetryTest) ... SKIP: google-apitools is not installed
test_with_http_error_that_should_not_be_retried (apache_beam.utils.retry_test.RetryTest) ... SKIP: google-apitools is not installed
test_with_no_retry_decorator (apache_beam.utils.retry_test.RetryTest) ... ok
test_with_real_clock (apache_beam.utils.retry_test.RetryTest) ... ok
test_arithmetic (apache_beam.utils.timestamp_test.DurationTest) ... ok
test_of (apache_beam.utils.timestamp_test.DurationTest) ... ok
test_precision (apache_beam.utils.timestamp_test.DurationTest) ... ok
test_sort_order (apache_beam.utils.timestamp_test.DurationTest) ... ok
test_str (apache_beam.utils.timestamp_test.DurationTest) ... ok
test_arithmetic (apache_beam.utils.timestamp_test.TimestampTest) ... ok
test_of (apache_beam.utils.timestamp_test.TimestampTest) ... ok
test_precision (apache_beam.utils.timestamp_test.TimestampTest) ... ok
test_sort_order (apache_beam.utils.timestamp_test.TimestampTest) ... ok
test_str (apache_beam.utils.timestamp_test.TimestampTest) ... ok
test_utc_timestamp (apache_beam.utils.timestamp_test.TimestampTest) ... ok
test_equality (apache_beam.utils.windowed_value_test.WindowedValueTest) ... ok
test_hash (apache_beam.utils.windowed_value_test.WindowedValueTest) ... ok
test_pickle (apache_beam.utils.windowed_value_test.WindowedValueTest) ... ok
test_timestamps (apache_beam.utils.windowed_value_test.WindowedValueTest) ... ok
test_with_value (apache_beam.utils.windowed_value_test.WindowedValueTest) ... ok
test_retry_fork_graph (apache_beam.pipeline_test.DirectRunnerRetryTests) ... ok
test_element (apache_beam.pipeline_test.DoFnTest) ... ok
test_side_input_no_tag (apache_beam.pipeline_test.DoFnTest) ... ok
test_side_input_tagged (apache_beam.pipeline_test.DoFnTest) ... ok
test_timestamp_param (apache_beam.pipeline_test.DoFnTest) ... ok
test_window_param (apache_beam.pipeline_test.DoFnTest) ... ok
test_attribute_setting (apache_beam.pipeline_test.PipelineOptionsTest) ... ok
test_defaults (apache_beam.pipeline_test.PipelineOptionsTest) ... ok
test_dir (apache_beam.pipeline_test.PipelineOptionsTest) ... ok
test_flag_parsing (apache_beam.pipeline_test.PipelineOptionsTest) ... ok
test_keyword_parsing (apache_beam.pipeline_test.PipelineOptionsTest) ... ok
test_view_as (apache_beam.pipeline_test.PipelineOptionsTest) ... ok
test_aggregator_empty_input (apache_beam.pipeline_test.PipelineTest) ... ok
test_apply_custom_transform (apache_beam.pipeline_test.PipelineTest) ... ok
test_create (apache_beam.pipeline_test.PipelineTest) ... ok
test_create_singleton_pcollection (apache_beam.pipeline_test.PipelineTest) ... <https://builds.apache.org/job/beam_PostCommit_Python_Verify/ws/sdks/python/apache_beam/coders/typecoders.py>:134: UserWarning: Using fallback coder for typehint: List[int].
  warnings.warn('Using fallback coder for typehint: %r.' % typehint)
ok
test_flatmap_builtin (apache_beam.pipeline_test.PipelineTest) ... ok
test_memory_usage (apache_beam.pipeline_test.PipelineTest) ... ok
test_metrics_in_source (apache_beam.pipeline_test.PipelineTest) ... ok
test_pipeline_as_context (apache_beam.pipeline_test.PipelineTest) ... <https://builds.apache.org/job/beam_PostCommit_Python_Verify/ws/sdks/python/apache_beam/coders/typecoders.py>:134: UserWarning: Using fallback coder for typehint: <type 'exceptions.ValueError'>.
  warnings.warn('Using fallback coder for typehint: %r.' % typehint)
ok
test_ptransform_overrides (apache_beam.pipeline_test.PipelineTest) ... ok
test_read (apache_beam.pipeline_test.PipelineTest) ... ok
test_reuse_cloned_custom_transform_instance (apache_beam.pipeline_test.PipelineTest) ... ok
test_reuse_custom_transform_instance (apache_beam.pipeline_test.PipelineTest) ... <https://builds.apache.org/job/beam_PostCommit_Python_Verify/ws/sdks/python/apache_beam/pipeline_test.py>:210: DeprecationWarning: BaseException.message has been deprecated as of Python 2.6
  cm.exception.message,
ok
test_transform_no_super_init (apache_beam.pipeline_test.PipelineTest) ... ok
test_visit_entire_graph (apache_beam.pipeline_test.PipelineTest) ... ok
test_pickling (apache_beam.pipeline_test.RunnerApiTest) ... ok
test_simple (apache_beam.pipeline_test.RunnerApiTest)
Tests serializing, deserializing, and running a simple pipeline. ... ok
test_assingleton_multi_element (apache_beam.pvalue_test.PValueTest) ... ok
test_pvalue_expected_arguments (apache_beam.pvalue_test.PValueTest) ... ok
test_file_checksum_matchcer_invalid_sleep_time (apache_beam.testing.pipeline_verifiers_test.PipelineVerifiersTest) ... <https://builds.apache.org/job/beam_PostCommit_Python_Verify/ws/sdks/python/apache_beam/testing/pipeline_verifiers_test.py>:130: DeprecationWarning: BaseException.message has been deprecated as of Python 2.6
  self.assertEqual(cm.exception.message,
ok
test_file_checksum_matcher_read_failed (apache_beam.testing.pipeline_verifiers_test.PipelineVerifiersTest) ... ok
test_file_checksum_matcher_service_error (apache_beam.testing.pipeline_verifiers_test.PipelineVerifiersTest) ... SKIP: google-apitools is not installed
test_file_checksum_matcher_sleep_before_verify (apache_beam.testing.pipeline_verifiers_test.PipelineVerifiersTest) ... ok
test_file_checksum_matcher_success (apache_beam.testing.pipeline_verifiers_test.PipelineVerifiersTest) ... ok
test_pipeline_state_matcher_fails (apache_beam.testing.pipeline_verifiers_test.PipelineVerifiersTest)
Test PipelineStateMatcher fails when using default expected state ... ok
test_pipeline_state_matcher_given_state (apache_beam.testing.pipeline_verifiers_test.PipelineVerifiersTest)
Test PipelineStateMatcher successes when matches given state ... ok
test_pipeline_state_matcher_success (apache_beam.testing.pipeline_verifiers_test.PipelineVerifiersTest)
Test PipelineStateMatcher successes when using default expected state ... ok
test_append_extra_options (apache_beam.testing.test_pipeline_test.TestPipelineTest) ... ok
test_append_verifier_in_extra_opt (apache_beam.testing.test_pipeline_test.TestPipelineTest) ... ok
test_create_test_pipeline_options (apache_beam.testing.test_pipeline_test.TestPipelineTest) ... ok
test_empty_option_args_parsing (apache_beam.testing.test_pipeline_test.TestPipelineTest) ... ok
test_get_option (apache_beam.testing.test_pipeline_test.TestPipelineTest) ... ok
test_option_args_parsing (apache_beam.testing.test_pipeline_test.TestPipelineTest) ... ok
test_skip_IT (apache_beam.testing.test_pipeline_test.TestPipelineTest) ... SKIP: IT is skipped because --test-pipeline-options is not specified
test_basic_execution (apache_beam.testing.test_stream_test.TestStreamTest) ... ok
test_basic_test_stream (apache_beam.testing.test_stream_test.TestStreamTest) ... ok
test_gbk_execution (apache_beam.testing.test_stream_test.TestStreamTest) ... ok
test_test_stream_errors (apache_beam.testing.test_stream_test.TestStreamTest) ... ok
test_delete_files_fails_with_invalid_arg (apache_beam.testing.test_utils_test.TestUtilsTest) ... ok
test_delete_files_fails_with_io_error (apache_beam.testing.test_utils_test.TestUtilsTest) ... <https://builds.apache.org/job/beam_PostCommit_Python_Verify/ws/sdks/python/apache_beam/testing/test_utils_test.py>:52: DeprecationWarning: BaseException.message has been deprecated as of Python 2.6
  error.exception.message.startswith('Delete operation failed'))
ok
test_delete_files_succeeds (apache_beam.testing.test_utils_test.TestUtilsTest) ... ok
test_assert_that_fails (apache_beam.testing.util_test.UtilTest) ... ok
test_assert_that_fails_on_empty_expected (apache_beam.testing.util_test.UtilTest) ... ok
test_assert_that_fails_on_empty_input (apache_beam.testing.util_test.UtilTest) ... ok
test_assert_that_passes (apache_beam.testing.util_test.UtilTest) ... ok

----------------------------------------------------------------------
Ran 1317 tests in 335.383s

OK (skipped=258)
py27cython runtests: commands[9] | - find apache_beam -type f -name *.c -delete
py27cython runtests: commands[10] | - find apache_beam -type f -name *.so -delete
py27cython runtests: commands[11] | - find target/build -type f -name *.c -delete
/usr/bin/find: `target/build': No such file or directory
py27cython runtests: commands[12] | - find target/build -type f -name *.so -delete
/usr/bin/find: `target/build': No such file or directory
py27gcp create: <https://builds.apache.org/job/beam_PostCommit_Python_Verify/ws/sdks/python/target/.tox/py27gcp>
py27gcp installdeps: nose==1.3.7
py27gcp inst: <https://builds.apache.org/job/beam_PostCommit_Python_Verify/ws/sdks/python/target/.tox/dist/apache-beam-2.2.0.dev.zip>
py27gcp installed: apache-beam==2.2.0.dev0,avro==1.8.2,crcmod==1.7,dill==0.2.6,enum34==1.1.6,funcsigs==1.0.2,futures==3.1.1,grpcio==1.6.0,httplib2==0.9.2,mock==2.0.0,nose==1.3.7,oauth2client==3.0.0,pbr==3.1.1,protobuf==3.3.0,pyasn1==0.3.5,pyasn1-modules==0.1.4,PyYAML==3.12,rsa==3.4.2,six==1.11.0,typing==3.6.2
py27gcp runtests: PYTHONHASHSEED='3601681926'
py27gcp runtests: commands[0] | pip install -e .[test,gcp]
Obtaining file://<https://builds.apache.org/job/beam_PostCommit_Python_Verify/ws/sdks/python>
Requirement already satisfied: avro<2.0.0,>=1.8.1 in ./target/.tox/py27gcp/lib/python2.7/site-packages (from apache-beam==2.2.0.dev0)
Requirement already satisfied: crcmod<2.0,>=1.7 in ./target/.tox/py27gcp/lib/python2.7/site-packages (from apache-beam==2.2.0.dev0)
Requirement already satisfied: dill==0.2.6 in ./target/.tox/py27gcp/lib/python2.7/site-packages (from apache-beam==2.2.0.dev0)
Requirement already satisfied: grpcio<2.0,>=1.0 in ./target/.tox/py27gcp/lib/python2.7/site-packages (from apache-beam==2.2.0.dev0)
Requirement already satisfied: httplib2<0.10,>=0.8 in ./target/.tox/py27gcp/lib/python2.7/site-packages (from apache-beam==2.2.0.dev0)
Requirement already satisfied: mock<3.0.0,>=1.0.1 in ./target/.tox/py27gcp/lib/python2.7/site-packages (from apache-beam==2.2.0.dev0)
Requirement already satisfied: oauth2client<4.0.0,>=2.0.1 in ./target/.tox/py27gcp/lib/python2.7/site-packages (from apache-beam==2.2.0.dev0)
Requirement already satisfied: protobuf<=3.3.0,>=3.2.0 in ./target/.tox/py27gcp/lib/python2.7/site-packages (from apache-beam==2.2.0.dev0)
Requirement already satisfied: pyyaml<4.0.0,>=3.12 in ./target/.tox/py27gcp/lib/python2.7/site-packages (from apache-beam==2.2.0.dev0)
Requirement already satisfied: typing<3.7.0,>=3.6.0 in ./target/.tox/py27gcp/lib/python2.7/site-packages (from apache-beam==2.2.0.dev0)
Collecting google-apitools<=0.5.11,>=0.5.10 (from apache-beam==2.2.0.dev0)
<https://builds.apache.org/job/beam_PostCommit_Python_Verify/ws/sdks/python/target/.tox/py27gcp/local/lib/python2.7/site-packages/pip/_vendor/requests/packages/urllib3/util/ssl_.py>:318: SNIMissingWarning: An HTTPS request has been made, but the SNI (Subject Name Indication) extension to TLS is not available on this platform. This may cause the server to present an incorrect TLS certificate, which can cause validation failures. You can upgrade to a newer version of Python to solve this. For more information, see https://urllib3.readthedocs.io/en/latest/security.html#snimissingwarning.
  SNIMissingWarning
<https://builds.apache.org/job/beam_PostCommit_Python_Verify/ws/sdks/python/target/.tox/py27gcp/local/lib/python2.7/site-packages/pip/_vendor/requests/packages/urllib3/util/ssl_.py>:122: InsecurePlatformWarning: A true SSLContext object is not available. This prevents urllib3 from configuring SSL appropriately and may cause certain SSL connections to fail. You can upgrade to a newer version of Python to solve this. For more information, see https://urllib3.readthedocs.io/en/latest/security.html#insecureplatformwarning.
  InsecurePlatformWarning
  Using cached google_apitools-0.5.11-py2-none-any.whl
Collecting proto-google-cloud-datastore-v1<=0.90.4,>=0.90.0 (from apache-beam==2.2.0.dev0)
Collecting googledatastore==7.0.1 (from apache-beam==2.2.0.dev0)
Collecting google-cloud-pubsub==0.26.0 (from apache-beam==2.2.0.dev0)
  Using cached google_cloud_pubsub-0.26.0-py2.py3-none-any.whl
Collecting google-cloud-bigquery==0.25.0 (from apache-beam==2.2.0.dev0)
  Using cached google_cloud_bigquery-0.25.0-py2.py3-none-any.whl
Collecting pyhamcrest<2.0,>=1.9 (from apache-beam==2.2.0.dev0)
  Using cached PyHamcrest-1.9.0-py2.py3-none-any.whl
Requirement already satisfied: six>=1.9 in ./target/.tox/py27gcp/lib/python2.7/site-packages (from apache-beam==2.2.0.dev0)
Requirement already satisfied: futures>=2.2.0 in ./target/.tox/py27gcp/lib/python2.7/site-packages (from grpcio<2.0,>=1.0->apache-beam==2.2.0.dev0)
Requirement already satisfied: enum34>=1.0.4 in ./target/.tox/py27gcp/lib/python2.7/site-packages (from grpcio<2.0,>=1.0->apache-beam==2.2.0.dev0)
Requirement already satisfied: funcsigs>=1; python_version < "3.3" in ./target/.tox/py27gcp/lib/python2.7/site-packages (from mock<3.0.0,>=1.0.1->apache-beam==2.2.0.dev0)
Requirement already satisfied: pbr>=0.11 in ./target/.tox/py27gcp/lib/python2.7/site-packages (from mock<3.0.0,>=1.0.1->apache-beam==2.2.0.dev0)
Requirement already satisfied: pyasn1-modules>=0.0.5 in ./target/.tox/py27gcp/lib/python2.7/site-packages (from oauth2client<4.0.0,>=2.0.1->apache-beam==2.2.0.dev0)
Requirement already satisfied: rsa>=3.1.4 in ./target/.tox/py27gcp/lib/python2.7/site-packages (from oauth2client<4.0.0,>=2.0.1->apache-beam==2.2.0.dev0)
Requirement already satisfied: pyasn1>=0.1.7 in ./target/.tox/py27gcp/lib/python2.7/site-packages (from oauth2client<4.0.0,>=2.0.1->apache-beam==2.2.0.dev0)
Requirement already satisfied: setuptools in ./target/.tox/py27gcp/lib/python2.7/site-packages (from protobuf<=3.3.0,>=3.2.0->apache-beam==2.2.0.dev0)
Collecting googleapis-common-protos<2.0dev,>=1.5.2 (from proto-google-cloud-datastore-v1<=0.90.4,>=0.90.0->apache-beam==2.2.0.dev0)
Collecting google-cloud-core<0.26dev,>=0.25.0 (from google-cloud-pubsub==0.26.0->apache-beam==2.2.0.dev0)
  Using cached google_cloud_core-0.25.0-py2.py3-none-any.whl
Collecting gapic-google-cloud-pubsub-v1<0.16dev,>=0.15.0 (from google-cloud-pubsub==0.26.0->apache-beam==2.2.0.dev0)
Collecting google-auth<2.0.0dev,>=0.4.0 (from google-cloud-core<0.26dev,>=0.25.0->google-cloud-pubsub==0.26.0->apache-beam==2.2.0.dev0)
  Using cached google_auth-1.1.0-py2.py3-none-any.whl
Collecting google-auth-httplib2 (from google-cloud-core<0.26dev,>=0.25.0->google-cloud-pubsub==0.26.0->apache-beam==2.2.0.dev0)
  Using cached google_auth_httplib2-0.0.2-py2.py3-none-any.whl
Collecting google-gax<0.16dev,>=0.15.7 (from gapic-google-cloud-pubsub-v1<0.16dev,>=0.15.0->google-cloud-pubsub==0.26.0->apache-beam==2.2.0.dev0)
Collecting proto-google-cloud-pubsub-v1[grpc]<0.16dev,>=0.15.4 (from gapic-google-cloud-pubsub-v1<0.16dev,>=0.15.0->google-cloud-pubsub==0.26.0->apache-beam==2.2.0.dev0)
Collecting grpc-google-iam-v1<0.12dev,>=0.11.1 (from gapic-google-cloud-pubsub-v1<0.16dev,>=0.15.0->google-cloud-pubsub==0.26.0->apache-beam==2.2.0.dev0)
Collecting cachetools>=2.0.0 (from google-auth<2.0.0dev,>=0.4.0->google-cloud-core<0.26dev,>=0.25.0->google-cloud-pubsub==0.26.0->apache-beam==2.2.0.dev0)
  Using cached cachetools-2.0.1-py2.py3-none-any.whl
Collecting ply==3.8 (from google-gax<0.16dev,>=0.15.7->gapic-google-cloud-pubsub-v1<0.16dev,>=0.15.0->google-cloud-pubsub==0.26.0->apache-beam==2.2.0.dev0)
Collecting requests<3.0dev,>=2.13.0 (from google-gax<0.16dev,>=0.15.7->gapic-google-cloud-pubsub-v1<0.16dev,>=0.15.0->google-cloud-pubsub==0.26.0->apache-beam==2.2.0.dev0)
  Using cached requests-2.18.4-py2.py3-none-any.whl
Collecting future<0.17dev,>=0.16.0 (from google-gax<0.16dev,>=0.15.7->gapic-google-cloud-pubsub-v1<0.16dev,>=0.15.0->google-cloud-pubsub==0.26.0->apache-beam==2.2.0.dev0)
Collecting urllib3<1.23,>=1.21.1 (from requests<3.0dev,>=2.13.0->google-gax<0.16dev,>=0.15.7->gapic-google-cloud-pubsub-v1<0.16dev,>=0.15.0->google-cloud-pubsub==0.26.0->apache-beam==2.2.0.dev0)
  Using cached urllib3-1.22-py2.py3-none-any.whl
Collecting idna<2.7,>=2.5 (from requests<3.0dev,>=2.13.0->google-gax<0.16dev,>=0.15.7->gapic-google-cloud-pubsub-v1<0.16dev,>=0.15.0->google-cloud-pubsub==0.26.0->apache-beam==2.2.0.dev0)
  Using cached idna-2.6-py2.py3-none-any.whl
Collecting chardet<3.1.0,>=3.0.2 (from requests<3.0dev,>=2.13.0->google-gax<0.16dev,>=0.15.7->gapic-google-cloud-pubsub-v1<0.16dev,>=0.15.0->google-cloud-pubsub==0.26.0->apache-beam==2.2.0.dev0)
  Using cached chardet-3.0.4-py2.py3-none-any.whl
Collecting certifi>=2017.4.17 (from requests<3.0dev,>=2.13.0->google-gax<0.16dev,>=0.15.7->gapic-google-cloud-pubsub-v1<0.16dev,>=0.15.0->google-cloud-pubsub==0.26.0->apache-beam==2.2.0.dev0)
  Using cached certifi-2017.7.27.1-py2.py3-none-any.whl
Installing collected packages: google-apitools, googleapis-common-protos, proto-google-cloud-datastore-v1, googledatastore, cachetools, google-auth, google-auth-httplib2, google-cloud-core, ply, urllib3, idna, chardet, certifi, requests, future, google-gax, proto-google-cloud-pubsub-v1, grpc-google-iam-v1, gapic-google-cloud-pubsub-v1, google-cloud-pubsub, google-cloud-bigquery, pyhamcrest, apache-beam
  Found existing installation: apache-beam 2.2.0.dev0
    Uninstalling apache-beam-2.2.0.dev0:
      Successfully uninstalled apache-beam-2.2.0.dev0
  Running setup.py develop for apache-beam
Successfully installed apache-beam cachetools-2.0.1 certifi-2017.7.27.1 chardet-3.0.4 future-0.16.0 gapic-google-cloud-pubsub-v1-0.15.4 google-apitools-0.5.11 google-auth-1.1.0 google-auth-httplib2-0.0.2 google-cloud-bigquery-0.25.0 google-cloud-core-0.25.0 google-cloud-pubsub-0.26.0 google-gax-0.15.15 googleapis-common-protos-1.5.2 googledatastore-7.0.1 grpc-google-iam-v1-0.11.3 idna-2.6 ply-3.8 proto-google-cloud-datastore-v1-0.90.4 proto-google-cloud-pubsub-v1-0.15.4 pyhamcrest-1.9.0 requests-2.18.4 urllib3-1.22
py27gcp runtests: commands[1] | python --version
Python 2.7.6
py27gcp runtests: commands[2] | - find apache_beam -type f -name *.pyc -delete
py27gcp runtests: commands[3] | python apache_beam/examples/complete/autocomplete_test.py
Traceback (most recent call last):
  File "apache_beam/examples/complete/autocomplete_test.py", line 22, in <module>
    import apache_beam as beam
  File "<https://builds.apache.org/job/beam_PostCommit_Python_Verify/ws/sdks/python/apache_beam/__init__.py",> line 87, in <module>
    from apache_beam import io
  File "<https://builds.apache.org/job/beam_PostCommit_Python_Verify/ws/sdks/python/apache_beam/io/__init__.py",> line 21, in <module>
    from apache_beam.io.avroio import *
  File "<https://builds.apache.org/job/beam_PostCommit_Python_Verify/ws/sdks/python/apache_beam/io/avroio.py",> line 56, in <module>
    from apache_beam.io import filebasedsink
  File "<https://builds.apache.org/job/beam_PostCommit_Python_Verify/ws/sdks/python/apache_beam/io/filebasedsink.py",> line 32, in <module>
    from apache_beam.io.filesystems import FileSystems
  File "<https://builds.apache.org/job/beam_PostCommit_Python_Verify/ws/sdks/python/apache_beam/io/filesystems.py",> line 30, in <module>
    from apache_beam.io.gcp.gcsfilesystem import GCSFileSystem
  File "<https://builds.apache.org/job/beam_PostCommit_Python_Verify/ws/sdks/python/apache_beam/io/gcp/gcsfilesystem.py",> line 27, in <module>
    from apache_beam.io.gcp import gcsio
  File "<https://builds.apache.org/job/beam_PostCommit_Python_Verify/ws/sdks/python/apache_beam/io/gcp/gcsio.py",> line 37, in <module>
    from apache_beam.utils import retry
  File "<https://builds.apache.org/job/beam_PostCommit_Python_Verify/ws/sdks/python/apache_beam/utils/retry.py",> line 40, in <module>
    from apitools.base.py.exceptions import HttpError
  File "<https://builds.apache.org/job/beam_PostCommit_Python_Verify/ws/sdks/python/target/.tox/py27gcp/local/lib/python2.7/site-packages/apitools/base/py/__init__.py",> line 21, in <module>
    from apitools.base.py.base_api import *
  File "<https://builds.apache.org/job/beam_PostCommit_Python_Verify/ws/sdks/python/target/.tox/py27gcp/local/lib/python2.7/site-packages/apitools/base/py/base_api.py",> line 31, in <module>
    from apitools.base.protorpclite import message_types
  File "<https://builds.apache.org/job/beam_PostCommit_Python_Verify/ws/sdks/python/target/.tox/py27gcp/local/lib/python2.7/site-packages/apitools/base/protorpclite/message_types.py",> line 25, in <module>
    from apitools.base.protorpclite import messages
  File "<https://builds.apache.org/job/beam_PostCommit_Python_Verify/ws/sdks/python/target/.tox/py27gcp/local/lib/python2.7/site-packages/apitools/base/protorpclite/messages.py",> line 1165, in <module>
    class Field(six.with_metaclass(_FieldMeta, object)):
TypeError: Error when calling the metaclass bases
    metaclass conflict: the metaclass of a derived class must be a (non-strict) subclass of the metaclasses of all its bases
ERROR: InvocationError: '<https://builds.apache.org/job/beam_PostCommit_Python_Verify/ws/sdks/python/target/.tox/py27gcp/bin/python> apache_beam/examples/complete/autocomplete_test.py'
___________________________________ summary ____________________________________
ERROR:   docs: commands failed
  lint: commands succeeded
  py27: commands succeeded
  py27cython: commands succeeded
ERROR:   py27gcp: commands failed
Build step 'Execute shell' marked build as failure
Not sending mail to unregistered user klk@google.com
Not sending mail to unregistered user aljoscha.krettek@gmail.com
Not sending mail to unregistered user echauchot@gmail.com+jbonofre@apache.org
Not sending mail to unregistered user kirpichov@google.com

Build failed in Jenkins: beam_PostCommit_Python_Verify #3161

Posted by Apache Jenkins Server <je...@builds.apache.org>.
See <https://builds.apache.org/job/beam_PostCommit_Python_Verify/3161/display/redirect?page=changes>

Changes:

[aljoscha.krettek] [BEAM-2948] Register default FileSystems in StreamOperator.setup()

------------------------------------------
[...truncated 459.31 KB...]
test_type_check_valid_simple_types (apache_beam.typehints.typehints_test.TupleHintTestCase) ... ok
test_getitem_duplicates_ignored (apache_beam.typehints.typehints_test.UnionHintTestCase) ... ok
test_getitem_must_be_valid_type_param (apache_beam.typehints.typehints_test.UnionHintTestCase) ... ok
test_getitem_must_be_valid_type_param_cant_be_object_instance (apache_beam.typehints.typehints_test.UnionHintTestCase) ... ok
test_getitem_nested_unions_flattened (apache_beam.typehints.typehints_test.UnionHintTestCase) ... ok
test_nested_compatibility (apache_beam.typehints.typehints_test.UnionHintTestCase) ... ok
test_union_hint_compatibility (apache_beam.typehints.typehints_test.UnionHintTestCase) ... ok
test_union_hint_enforcement_composite_type_in_union (apache_beam.typehints.typehints_test.UnionHintTestCase) ... ok
test_union_hint_enforcement_not_part_of_union (apache_beam.typehints.typehints_test.UnionHintTestCase) ... ok
test_union_hint_enforcement_part_of_union (apache_beam.typehints.typehints_test.UnionHintTestCase) ... ok
test_union_hint_repr (apache_beam.typehints.typehints_test.UnionHintTestCase) ... ok
test_deprecated_with_since_current (apache_beam.utils.annotations_test.AnnotationTests) ... ok
test_deprecated_with_since_current_message (apache_beam.utils.annotations_test.AnnotationTests) ... ok
test_deprecated_without_current (apache_beam.utils.annotations_test.AnnotationTests) ... ok
test_deprecated_without_since_should_fail (apache_beam.utils.annotations_test.AnnotationTests) ... ok
test_experimental_with_current (apache_beam.utils.annotations_test.AnnotationTests) ... ok
test_experimental_with_current_message (apache_beam.utils.annotations_test.AnnotationTests) ... ok
test_experimental_without_current (apache_beam.utils.annotations_test.AnnotationTests) ... ok
test_frequency (apache_beam.utils.annotations_test.AnnotationTests)
Tests that the filter 'once' is sufficient to print once per ... ok
test_equal_objects (apache_beam.utils.counters_test.CounterNameTest) ... ok
test_hash_two_objects (apache_beam.utils.counters_test.CounterNameTest) ... ok
test_method_forwarding_not_windows (apache_beam.utils.processes_test.Exec) ... ok
test_method_forwarding_windows (apache_beam.utils.processes_test.Exec) ... ok
test_call_two_objects (apache_beam.utils.retry_test.RetryStateTest) ... ok
test_single_failure (apache_beam.utils.retry_test.RetryStateTest) ... ok
test_two_failures (apache_beam.utils.retry_test.RetryStateTest) ... ok
test_log_calls_for_permanent_failure (apache_beam.utils.retry_test.RetryTest) ... ok
test_log_calls_for_transient_failure (apache_beam.utils.retry_test.RetryTest) ... ok
test_with_default_number_of_retries (apache_beam.utils.retry_test.RetryTest) ... ok
test_with_explicit_decorator (apache_beam.utils.retry_test.RetryTest) ... ok
test_with_explicit_initial_delay (apache_beam.utils.retry_test.RetryTest) ... ok
test_with_explicit_number_of_retries (apache_beam.utils.retry_test.RetryTest) ... ok
test_with_http_error_that_should_be_retried (apache_beam.utils.retry_test.RetryTest) ... SKIP: google-apitools is not installed
test_with_http_error_that_should_not_be_retried (apache_beam.utils.retry_test.RetryTest) ... SKIP: google-apitools is not installed
test_with_no_retry_decorator (apache_beam.utils.retry_test.RetryTest) ... ok
test_with_real_clock (apache_beam.utils.retry_test.RetryTest) ... ok
test_arithmetic (apache_beam.utils.timestamp_test.DurationTest) ... ok
test_of (apache_beam.utils.timestamp_test.DurationTest) ... ok
test_precision (apache_beam.utils.timestamp_test.DurationTest) ... ok
test_sort_order (apache_beam.utils.timestamp_test.DurationTest) ... ok
test_str (apache_beam.utils.timestamp_test.DurationTest) ... ok
test_arithmetic (apache_beam.utils.timestamp_test.TimestampTest) ... ok
test_of (apache_beam.utils.timestamp_test.TimestampTest) ... ok
test_precision (apache_beam.utils.timestamp_test.TimestampTest) ... ok
test_sort_order (apache_beam.utils.timestamp_test.TimestampTest) ... ok
test_str (apache_beam.utils.timestamp_test.TimestampTest) ... ok
test_utc_timestamp (apache_beam.utils.timestamp_test.TimestampTest) ... ok
test_equality (apache_beam.utils.windowed_value_test.WindowedValueTest) ... ok
test_hash (apache_beam.utils.windowed_value_test.WindowedValueTest) ... ok
test_pickle (apache_beam.utils.windowed_value_test.WindowedValueTest) ... ok
test_timestamps (apache_beam.utils.windowed_value_test.WindowedValueTest) ... ok
test_with_value (apache_beam.utils.windowed_value_test.WindowedValueTest) ... ok
test_retry_fork_graph (apache_beam.pipeline_test.DirectRunnerRetryTests) ... ok
test_element (apache_beam.pipeline_test.DoFnTest) ... ok
test_side_input_no_tag (apache_beam.pipeline_test.DoFnTest) ... ok
test_side_input_tagged (apache_beam.pipeline_test.DoFnTest) ... ok
test_timestamp_param (apache_beam.pipeline_test.DoFnTest) ... ok
test_window_param (apache_beam.pipeline_test.DoFnTest) ... ok
test_attribute_setting (apache_beam.pipeline_test.PipelineOptionsTest) ... ok
test_defaults (apache_beam.pipeline_test.PipelineOptionsTest) ... ok
test_dir (apache_beam.pipeline_test.PipelineOptionsTest) ... ok
test_flag_parsing (apache_beam.pipeline_test.PipelineOptionsTest) ... ok
test_keyword_parsing (apache_beam.pipeline_test.PipelineOptionsTest) ... ok
test_view_as (apache_beam.pipeline_test.PipelineOptionsTest) ... ok
test_aggregator_empty_input (apache_beam.pipeline_test.PipelineTest) ... ok
test_apply_custom_transform (apache_beam.pipeline_test.PipelineTest) ... ok
test_create (apache_beam.pipeline_test.PipelineTest) ... ok
test_create_singleton_pcollection (apache_beam.pipeline_test.PipelineTest) ... <https://builds.apache.org/job/beam_PostCommit_Python_Verify/ws/sdks/python/apache_beam/coders/typecoders.py>:134: UserWarning: Using fallback coder for typehint: List[int].
  warnings.warn('Using fallback coder for typehint: %r.' % typehint)
ok
test_flatmap_builtin (apache_beam.pipeline_test.PipelineTest) ... ok
test_memory_usage (apache_beam.pipeline_test.PipelineTest) ... ok
test_metrics_in_source (apache_beam.pipeline_test.PipelineTest) ... ok
test_pipeline_as_context (apache_beam.pipeline_test.PipelineTest) ... <https://builds.apache.org/job/beam_PostCommit_Python_Verify/ws/sdks/python/apache_beam/coders/typecoders.py>:134: UserWarning: Using fallback coder for typehint: <type 'exceptions.ValueError'>.
  warnings.warn('Using fallback coder for typehint: %r.' % typehint)
ok
test_ptransform_overrides (apache_beam.pipeline_test.PipelineTest) ... ok
test_read (apache_beam.pipeline_test.PipelineTest) ... ok
test_reuse_cloned_custom_transform_instance (apache_beam.pipeline_test.PipelineTest) ... ok
test_reuse_custom_transform_instance (apache_beam.pipeline_test.PipelineTest) ... <https://builds.apache.org/job/beam_PostCommit_Python_Verify/ws/sdks/python/apache_beam/pipeline_test.py>:210: DeprecationWarning: BaseException.message has been deprecated as of Python 2.6
  cm.exception.message,
ok
test_transform_no_super_init (apache_beam.pipeline_test.PipelineTest) ... ok
test_visit_entire_graph (apache_beam.pipeline_test.PipelineTest) ... ok
test_pickling (apache_beam.pipeline_test.RunnerApiTest) ... ok
test_simple (apache_beam.pipeline_test.RunnerApiTest)
Tests serializing, deserializing, and running a simple pipeline. ... ok
test_assingleton_multi_element (apache_beam.pvalue_test.PValueTest) ... ok
test_pvalue_expected_arguments (apache_beam.pvalue_test.PValueTest) ... ok
test_file_checksum_matchcer_invalid_sleep_time (apache_beam.testing.pipeline_verifiers_test.PipelineVerifiersTest) ... <https://builds.apache.org/job/beam_PostCommit_Python_Verify/ws/sdks/python/apache_beam/testing/pipeline_verifiers_test.py>:130: DeprecationWarning: BaseException.message has been deprecated as of Python 2.6
  self.assertEqual(cm.exception.message,
ok
test_file_checksum_matcher_read_failed (apache_beam.testing.pipeline_verifiers_test.PipelineVerifiersTest) ... ok
test_file_checksum_matcher_service_error (apache_beam.testing.pipeline_verifiers_test.PipelineVerifiersTest) ... SKIP: google-apitools is not installed
test_file_checksum_matcher_sleep_before_verify (apache_beam.testing.pipeline_verifiers_test.PipelineVerifiersTest) ... ok
test_file_checksum_matcher_success (apache_beam.testing.pipeline_verifiers_test.PipelineVerifiersTest) ... ok
test_pipeline_state_matcher_fails (apache_beam.testing.pipeline_verifiers_test.PipelineVerifiersTest)
Test PipelineStateMatcher fails when using default expected state ... ok
test_pipeline_state_matcher_given_state (apache_beam.testing.pipeline_verifiers_test.PipelineVerifiersTest)
Test PipelineStateMatcher successes when matches given state ... ok
test_pipeline_state_matcher_success (apache_beam.testing.pipeline_verifiers_test.PipelineVerifiersTest)
Test PipelineStateMatcher successes when using default expected state ... ok
test_append_extra_options (apache_beam.testing.test_pipeline_test.TestPipelineTest) ... ok
test_append_verifier_in_extra_opt (apache_beam.testing.test_pipeline_test.TestPipelineTest) ... ok
test_create_test_pipeline_options (apache_beam.testing.test_pipeline_test.TestPipelineTest) ... ok
test_empty_option_args_parsing (apache_beam.testing.test_pipeline_test.TestPipelineTest) ... ok
test_get_option (apache_beam.testing.test_pipeline_test.TestPipelineTest) ... ok
test_option_args_parsing (apache_beam.testing.test_pipeline_test.TestPipelineTest) ... ok
test_skip_IT (apache_beam.testing.test_pipeline_test.TestPipelineTest) ... SKIP: IT is skipped because --test-pipeline-options is not specified
test_basic_execution (apache_beam.testing.test_stream_test.TestStreamTest) ... ok
test_basic_test_stream (apache_beam.testing.test_stream_test.TestStreamTest) ... ok
test_gbk_execution (apache_beam.testing.test_stream_test.TestStreamTest) ... ok
test_test_stream_errors (apache_beam.testing.test_stream_test.TestStreamTest) ... ok
test_delete_files_fails_with_invalid_arg (apache_beam.testing.test_utils_test.TestUtilsTest) ... ok
test_delete_files_fails_with_io_error (apache_beam.testing.test_utils_test.TestUtilsTest) ... <https://builds.apache.org/job/beam_PostCommit_Python_Verify/ws/sdks/python/apache_beam/testing/test_utils_test.py>:52: DeprecationWarning: BaseException.message has been deprecated as of Python 2.6
  error.exception.message.startswith('Delete operation failed'))
ok
test_delete_files_succeeds (apache_beam.testing.test_utils_test.TestUtilsTest) ... ok
test_assert_that_fails (apache_beam.testing.util_test.UtilTest) ... ok
test_assert_that_fails_on_empty_expected (apache_beam.testing.util_test.UtilTest) ... ok
test_assert_that_fails_on_empty_input (apache_beam.testing.util_test.UtilTest) ... ok
test_assert_that_passes (apache_beam.testing.util_test.UtilTest) ... ok

----------------------------------------------------------------------
Ran 1317 tests in 270.223s

OK (skipped=258)
py27cython runtests: commands[9] | - find apache_beam -type f -name *.c -delete
py27cython runtests: commands[10] | - find apache_beam -type f -name *.so -delete
py27cython runtests: commands[11] | - find target/build -type f -name *.c -delete
/usr/bin/find: `target/build': No such file or directory
py27cython runtests: commands[12] | - find target/build -type f -name *.so -delete
/usr/bin/find: `target/build': No such file or directory
py27gcp create: <https://builds.apache.org/job/beam_PostCommit_Python_Verify/ws/sdks/python/target/.tox/py27gcp>
py27gcp installdeps: nose==1.3.7
py27gcp inst: <https://builds.apache.org/job/beam_PostCommit_Python_Verify/ws/sdks/python/target/.tox/dist/apache-beam-2.2.0.dev.zip>
py27gcp installed: apache-beam==2.2.0.dev0,avro==1.8.2,crcmod==1.7,dill==0.2.6,enum34==1.1.6,funcsigs==1.0.2,futures==3.1.1,grpcio==1.6.0,httplib2==0.9.2,mock==2.0.0,nose==1.3.7,oauth2client==3.0.0,pbr==3.1.1,protobuf==3.3.0,pyasn1==0.3.5,pyasn1-modules==0.1.4,PyYAML==3.12,rsa==3.4.2,six==1.11.0,typing==3.6.2
py27gcp runtests: PYTHONHASHSEED='2462991075'
py27gcp runtests: commands[0] | pip install -e .[test,gcp]
Obtaining file://<https://builds.apache.org/job/beam_PostCommit_Python_Verify/ws/sdks/python>
Requirement already satisfied: avro<2.0.0,>=1.8.1 in ./target/.tox/py27gcp/lib/python2.7/site-packages (from apache-beam==2.2.0.dev0)
Requirement already satisfied: crcmod<2.0,>=1.7 in ./target/.tox/py27gcp/lib/python2.7/site-packages (from apache-beam==2.2.0.dev0)
Requirement already satisfied: dill==0.2.6 in ./target/.tox/py27gcp/lib/python2.7/site-packages (from apache-beam==2.2.0.dev0)
Requirement already satisfied: grpcio<2.0,>=1.0 in ./target/.tox/py27gcp/lib/python2.7/site-packages (from apache-beam==2.2.0.dev0)
Requirement already satisfied: httplib2<0.10,>=0.8 in ./target/.tox/py27gcp/lib/python2.7/site-packages (from apache-beam==2.2.0.dev0)
Requirement already satisfied: mock<3.0.0,>=1.0.1 in ./target/.tox/py27gcp/lib/python2.7/site-packages (from apache-beam==2.2.0.dev0)
Requirement already satisfied: oauth2client<4.0.0,>=2.0.1 in ./target/.tox/py27gcp/lib/python2.7/site-packages (from apache-beam==2.2.0.dev0)
Requirement already satisfied: protobuf<=3.3.0,>=3.2.0 in ./target/.tox/py27gcp/lib/python2.7/site-packages (from apache-beam==2.2.0.dev0)
Requirement already satisfied: pyyaml<4.0.0,>=3.12 in ./target/.tox/py27gcp/lib/python2.7/site-packages (from apache-beam==2.2.0.dev0)
Requirement already satisfied: typing<3.7.0,>=3.6.0 in ./target/.tox/py27gcp/lib/python2.7/site-packages (from apache-beam==2.2.0.dev0)
Collecting google-apitools<=0.5.11,>=0.5.10 (from apache-beam==2.2.0.dev0)
<https://builds.apache.org/job/beam_PostCommit_Python_Verify/ws/sdks/python/target/.tox/py27gcp/local/lib/python2.7/site-packages/pip/_vendor/requests/packages/urllib3/util/ssl_.py>:318: SNIMissingWarning: An HTTPS request has been made, but the SNI (Subject Name Indication) extension to TLS is not available on this platform. This may cause the server to present an incorrect TLS certificate, which can cause validation failures. You can upgrade to a newer version of Python to solve this. For more information, see https://urllib3.readthedocs.io/en/latest/security.html#snimissingwarning.
  SNIMissingWarning
<https://builds.apache.org/job/beam_PostCommit_Python_Verify/ws/sdks/python/target/.tox/py27gcp/local/lib/python2.7/site-packages/pip/_vendor/requests/packages/urllib3/util/ssl_.py>:122: InsecurePlatformWarning: A true SSLContext object is not available. This prevents urllib3 from configuring SSL appropriately and may cause certain SSL connections to fail. You can upgrade to a newer version of Python to solve this. For more information, see https://urllib3.readthedocs.io/en/latest/security.html#insecureplatformwarning.
  InsecurePlatformWarning
  Using cached google_apitools-0.5.11-py2-none-any.whl
Collecting proto-google-cloud-datastore-v1<=0.90.4,>=0.90.0 (from apache-beam==2.2.0.dev0)
Collecting googledatastore==7.0.1 (from apache-beam==2.2.0.dev0)
Collecting google-cloud-pubsub==0.26.0 (from apache-beam==2.2.0.dev0)
  Using cached google_cloud_pubsub-0.26.0-py2.py3-none-any.whl
Collecting google-cloud-bigquery==0.25.0 (from apache-beam==2.2.0.dev0)
  Using cached google_cloud_bigquery-0.25.0-py2.py3-none-any.whl
Collecting pyhamcrest<2.0,>=1.9 (from apache-beam==2.2.0.dev0)
  Using cached PyHamcrest-1.9.0-py2.py3-none-any.whl
Requirement already satisfied: six>=1.9 in ./target/.tox/py27gcp/lib/python2.7/site-packages (from apache-beam==2.2.0.dev0)
Requirement already satisfied: enum34>=1.0.4 in ./target/.tox/py27gcp/lib/python2.7/site-packages (from grpcio<2.0,>=1.0->apache-beam==2.2.0.dev0)
Requirement already satisfied: futures>=2.2.0 in ./target/.tox/py27gcp/lib/python2.7/site-packages (from grpcio<2.0,>=1.0->apache-beam==2.2.0.dev0)
Requirement already satisfied: pbr>=0.11 in ./target/.tox/py27gcp/lib/python2.7/site-packages (from mock<3.0.0,>=1.0.1->apache-beam==2.2.0.dev0)
Requirement already satisfied: funcsigs>=1; python_version < "3.3" in ./target/.tox/py27gcp/lib/python2.7/site-packages (from mock<3.0.0,>=1.0.1->apache-beam==2.2.0.dev0)
Requirement already satisfied: pyasn1-modules>=0.0.5 in ./target/.tox/py27gcp/lib/python2.7/site-packages (from oauth2client<4.0.0,>=2.0.1->apache-beam==2.2.0.dev0)
Requirement already satisfied: pyasn1>=0.1.7 in ./target/.tox/py27gcp/lib/python2.7/site-packages (from oauth2client<4.0.0,>=2.0.1->apache-beam==2.2.0.dev0)
Requirement already satisfied: rsa>=3.1.4 in ./target/.tox/py27gcp/lib/python2.7/site-packages (from oauth2client<4.0.0,>=2.0.1->apache-beam==2.2.0.dev0)
Requirement already satisfied: setuptools in ./target/.tox/py27gcp/lib/python2.7/site-packages (from protobuf<=3.3.0,>=3.2.0->apache-beam==2.2.0.dev0)
Collecting googleapis-common-protos<2.0dev,>=1.5.2 (from proto-google-cloud-datastore-v1<=0.90.4,>=0.90.0->apache-beam==2.2.0.dev0)
Collecting gapic-google-cloud-pubsub-v1<0.16dev,>=0.15.0 (from google-cloud-pubsub==0.26.0->apache-beam==2.2.0.dev0)
Collecting google-cloud-core<0.26dev,>=0.25.0 (from google-cloud-pubsub==0.26.0->apache-beam==2.2.0.dev0)
  Using cached google_cloud_core-0.25.0-py2.py3-none-any.whl
Collecting grpc-google-iam-v1<0.12dev,>=0.11.1 (from gapic-google-cloud-pubsub-v1<0.16dev,>=0.15.0->google-cloud-pubsub==0.26.0->apache-beam==2.2.0.dev0)
Collecting google-gax<0.16dev,>=0.15.7 (from gapic-google-cloud-pubsub-v1<0.16dev,>=0.15.0->google-cloud-pubsub==0.26.0->apache-beam==2.2.0.dev0)
Collecting proto-google-cloud-pubsub-v1[grpc]<0.16dev,>=0.15.4 (from gapic-google-cloud-pubsub-v1<0.16dev,>=0.15.0->google-cloud-pubsub==0.26.0->apache-beam==2.2.0.dev0)
Collecting google-auth-httplib2 (from google-cloud-core<0.26dev,>=0.25.0->google-cloud-pubsub==0.26.0->apache-beam==2.2.0.dev0)
  Using cached google_auth_httplib2-0.0.2-py2.py3-none-any.whl
Collecting google-auth<2.0.0dev,>=0.4.0 (from google-cloud-core<0.26dev,>=0.25.0->google-cloud-pubsub==0.26.0->apache-beam==2.2.0.dev0)
  Using cached google_auth-1.1.0-py2.py3-none-any.whl
Collecting ply==3.8 (from google-gax<0.16dev,>=0.15.7->gapic-google-cloud-pubsub-v1<0.16dev,>=0.15.0->google-cloud-pubsub==0.26.0->apache-beam==2.2.0.dev0)
Collecting future<0.17dev,>=0.16.0 (from google-gax<0.16dev,>=0.15.7->gapic-google-cloud-pubsub-v1<0.16dev,>=0.15.0->google-cloud-pubsub==0.26.0->apache-beam==2.2.0.dev0)
Collecting requests<3.0dev,>=2.13.0 (from google-gax<0.16dev,>=0.15.7->gapic-google-cloud-pubsub-v1<0.16dev,>=0.15.0->google-cloud-pubsub==0.26.0->apache-beam==2.2.0.dev0)
  Using cached requests-2.18.4-py2.py3-none-any.whl
Collecting cachetools>=2.0.0 (from google-auth<2.0.0dev,>=0.4.0->google-cloud-core<0.26dev,>=0.25.0->google-cloud-pubsub==0.26.0->apache-beam==2.2.0.dev0)
  Using cached cachetools-2.0.1-py2.py3-none-any.whl
Collecting chardet<3.1.0,>=3.0.2 (from requests<3.0dev,>=2.13.0->google-gax<0.16dev,>=0.15.7->gapic-google-cloud-pubsub-v1<0.16dev,>=0.15.0->google-cloud-pubsub==0.26.0->apache-beam==2.2.0.dev0)
  Using cached chardet-3.0.4-py2.py3-none-any.whl
Collecting idna<2.7,>=2.5 (from requests<3.0dev,>=2.13.0->google-gax<0.16dev,>=0.15.7->gapic-google-cloud-pubsub-v1<0.16dev,>=0.15.0->google-cloud-pubsub==0.26.0->apache-beam==2.2.0.dev0)
  Using cached idna-2.6-py2.py3-none-any.whl
Collecting urllib3<1.23,>=1.21.1 (from requests<3.0dev,>=2.13.0->google-gax<0.16dev,>=0.15.7->gapic-google-cloud-pubsub-v1<0.16dev,>=0.15.0->google-cloud-pubsub==0.26.0->apache-beam==2.2.0.dev0)
  Using cached urllib3-1.22-py2.py3-none-any.whl
Collecting certifi>=2017.4.17 (from requests<3.0dev,>=2.13.0->google-gax<0.16dev,>=0.15.7->gapic-google-cloud-pubsub-v1<0.16dev,>=0.15.0->google-cloud-pubsub==0.26.0->apache-beam==2.2.0.dev0)
  Using cached certifi-2017.7.27.1-py2.py3-none-any.whl
Installing collected packages: google-apitools, googleapis-common-protos, proto-google-cloud-datastore-v1, googledatastore, grpc-google-iam-v1, ply, cachetools, google-auth, future, chardet, idna, urllib3, certifi, requests, google-gax, proto-google-cloud-pubsub-v1, gapic-google-cloud-pubsub-v1, google-auth-httplib2, google-cloud-core, google-cloud-pubsub, google-cloud-bigquery, pyhamcrest, apache-beam
  Found existing installation: apache-beam 2.2.0.dev0
    Uninstalling apache-beam-2.2.0.dev0:
      Successfully uninstalled apache-beam-2.2.0.dev0
  Running setup.py develop for apache-beam
Successfully installed apache-beam cachetools-2.0.1 certifi-2017.7.27.1 chardet-3.0.4 future-0.16.0 gapic-google-cloud-pubsub-v1-0.15.4 google-apitools-0.5.11 google-auth-1.1.0 google-auth-httplib2-0.0.2 google-cloud-bigquery-0.25.0 google-cloud-core-0.25.0 google-cloud-pubsub-0.26.0 google-gax-0.15.15 googleapis-common-protos-1.5.2 googledatastore-7.0.1 grpc-google-iam-v1-0.11.3 idna-2.6 ply-3.8 proto-google-cloud-datastore-v1-0.90.4 proto-google-cloud-pubsub-v1-0.15.4 pyhamcrest-1.9.0 requests-2.18.4 urllib3-1.22
py27gcp runtests: commands[1] | python --version
Python 2.7.6
py27gcp runtests: commands[2] | - find apache_beam -type f -name *.pyc -delete
py27gcp runtests: commands[3] | python apache_beam/examples/complete/autocomplete_test.py
Traceback (most recent call last):
  File "apache_beam/examples/complete/autocomplete_test.py", line 22, in <module>
    import apache_beam as beam
  File "<https://builds.apache.org/job/beam_PostCommit_Python_Verify/ws/sdks/python/apache_beam/__init__.py",> line 87, in <module>
    from apache_beam import io
  File "<https://builds.apache.org/job/beam_PostCommit_Python_Verify/ws/sdks/python/apache_beam/io/__init__.py",> line 21, in <module>
    from apache_beam.io.avroio import *
  File "<https://builds.apache.org/job/beam_PostCommit_Python_Verify/ws/sdks/python/apache_beam/io/avroio.py",> line 56, in <module>
    from apache_beam.io import filebasedsink
  File "<https://builds.apache.org/job/beam_PostCommit_Python_Verify/ws/sdks/python/apache_beam/io/filebasedsink.py",> line 32, in <module>
    from apache_beam.io.filesystems import FileSystems
  File "<https://builds.apache.org/job/beam_PostCommit_Python_Verify/ws/sdks/python/apache_beam/io/filesystems.py",> line 30, in <module>
    from apache_beam.io.gcp.gcsfilesystem import GCSFileSystem
  File "<https://builds.apache.org/job/beam_PostCommit_Python_Verify/ws/sdks/python/apache_beam/io/gcp/gcsfilesystem.py",> line 27, in <module>
    from apache_beam.io.gcp import gcsio
  File "<https://builds.apache.org/job/beam_PostCommit_Python_Verify/ws/sdks/python/apache_beam/io/gcp/gcsio.py",> line 37, in <module>
    from apache_beam.utils import retry
  File "<https://builds.apache.org/job/beam_PostCommit_Python_Verify/ws/sdks/python/apache_beam/utils/retry.py",> line 40, in <module>
    from apitools.base.py.exceptions import HttpError
  File "<https://builds.apache.org/job/beam_PostCommit_Python_Verify/ws/sdks/python/target/.tox/py27gcp/local/lib/python2.7/site-packages/apitools/base/py/__init__.py",> line 21, in <module>
    from apitools.base.py.base_api import *
  File "<https://builds.apache.org/job/beam_PostCommit_Python_Verify/ws/sdks/python/target/.tox/py27gcp/local/lib/python2.7/site-packages/apitools/base/py/base_api.py",> line 31, in <module>
    from apitools.base.protorpclite import message_types
  File "<https://builds.apache.org/job/beam_PostCommit_Python_Verify/ws/sdks/python/target/.tox/py27gcp/local/lib/python2.7/site-packages/apitools/base/protorpclite/message_types.py",> line 25, in <module>
    from apitools.base.protorpclite import messages
  File "<https://builds.apache.org/job/beam_PostCommit_Python_Verify/ws/sdks/python/target/.tox/py27gcp/local/lib/python2.7/site-packages/apitools/base/protorpclite/messages.py",> line 1165, in <module>
    class Field(six.with_metaclass(_FieldMeta, object)):
TypeError: Error when calling the metaclass bases
    metaclass conflict: the metaclass of a derived class must be a (non-strict) subclass of the metaclasses of all its bases
ERROR: InvocationError: '<https://builds.apache.org/job/beam_PostCommit_Python_Verify/ws/sdks/python/target/.tox/py27gcp/bin/python> apache_beam/examples/complete/autocomplete_test.py'
___________________________________ summary ____________________________________
ERROR:   docs: commands failed
  lint: commands succeeded
  py27: commands succeeded
  py27cython: commands succeeded
ERROR:   py27gcp: commands failed
Build step 'Execute shell' marked build as failure
Not sending mail to unregistered user echauchot@gmail.com+jbonofre@apache.org
Not sending mail to unregistered user kirpichov@google.com
Not sending mail to unregistered user aljoscha.krettek@gmail.com

Build failed in Jenkins: beam_PostCommit_Python_Verify #3160

Posted by Apache Jenkins Server <je...@builds.apache.org>.
See <https://builds.apache.org/job/beam_PostCommit_Python_Verify/3160/display/redirect>

------------------------------------------
[...truncated 44.07 KB...]
Requirement already satisfied: grpcio<2.0,>=1.0 in ./target/.tox/py27cython/lib/python2.7/site-packages (from apache-beam==2.2.0.dev0)
Collecting httplib2<0.10,>=0.8 (from apache-beam==2.2.0.dev0)
Collecting mock<3.0.0,>=1.0.1 (from apache-beam==2.2.0.dev0)
  Using cached mock-2.0.0-py2.py3-none-any.whl
Collecting oauth2client<4.0.0,>=2.0.1 (from apache-beam==2.2.0.dev0)
Collecting protobuf<=3.3.0,>=3.2.0 (from apache-beam==2.2.0.dev0)
  Using cached protobuf-3.3.0-cp27-cp27mu-manylinux1_x86_64.whl
Collecting pyyaml<4.0.0,>=3.12 (from apache-beam==2.2.0.dev0)
Collecting typing<3.7.0,>=3.6.0 (from apache-beam==2.2.0.dev0)
  Using cached typing-3.6.2-py2-none-any.whl
Requirement already satisfied: six>=1.5.2 in ./target/.tox/py27cython/lib/python2.7/site-packages (from grpcio<2.0,>=1.0->apache-beam==2.2.0.dev0)
Requirement already satisfied: futures>=2.2.0 in ./target/.tox/py27cython/lib/python2.7/site-packages (from grpcio<2.0,>=1.0->apache-beam==2.2.0.dev0)
Requirement already satisfied: enum34>=1.0.4 in ./target/.tox/py27cython/lib/python2.7/site-packages (from grpcio<2.0,>=1.0->apache-beam==2.2.0.dev0)
Collecting funcsigs>=1; python_version < "3.3" (from mock<3.0.0,>=1.0.1->apache-beam==2.2.0.dev0)
  Using cached funcsigs-1.0.2-py2.py3-none-any.whl
Collecting pbr>=0.11 (from mock<3.0.0,>=1.0.1->apache-beam==2.2.0.dev0)
  Using cached pbr-3.1.1-py2.py3-none-any.whl
Collecting pyasn1-modules>=0.0.5 (from oauth2client<4.0.0,>=2.0.1->apache-beam==2.2.0.dev0)
  Using cached pyasn1_modules-0.1.4-py2.py3-none-any.whl
Collecting pyasn1>=0.1.7 (from oauth2client<4.0.0,>=2.0.1->apache-beam==2.2.0.dev0)
  Using cached pyasn1-0.3.5-py2.py3-none-any.whl
Collecting rsa>=3.1.4 (from oauth2client<4.0.0,>=2.0.1->apache-beam==2.2.0.dev0)
  Using cached rsa-3.4.2-py2.py3-none-any.whl
Requirement already satisfied: setuptools in ./target/.tox/py27cython/lib/python2.7/site-packages (from protobuf<=3.3.0,>=3.2.0->apache-beam==2.2.0.dev0)
Building wheels for collected packages: apache-beam
  Running setup.py bdist_wheel for apache-beam: started
  Running setup.py bdist_wheel for apache-beam: finished with status 'error'
  Complete output from command <https://builds.apache.org/job/beam_PostCommit_Python_Verify/ws/sdks/python/target/.tox/py27cython/bin/python> -u -c "import setuptools, tokenize;__file__='/tmp/pip-2DZBCb-build/setup.py';f=getattr(tokenize, 'open', open)(__file__);code=f.read().replace('\r\n', '\n');f.close();exec(compile(code, __file__, 'exec'))" bdist_wheel -d /tmp/tmpMpDHsupip-wheel- --python-tag cp27:
  <https://builds.apache.org/job/beam_PostCommit_Python_Verify/ws/sdks/python/target/.tox/py27cython/local/lib/python2.7/site-packages/setuptools/dist.py>:351: UserWarning: Normalizing '2.2.0.dev' to '2.2.0.dev0'
    normalized_version,
  running bdist_wheel
  running build
  running build_py
  Traceback (most recent call last):
    File "<string>", line 1, in <module>
    File "/tmp/pip-2DZBCb-build/setup.py", line 198, in <module>
      'test': generate_protos_first(test),
    File "/usr/lib/python2.7/distutils/core.py", line 151, in setup
      dist.run_commands()
    File "/usr/lib/python2.7/distutils/dist.py", line 953, in run_commands
      self.run_command(cmd)
    File "/usr/lib/python2.7/distutils/dist.py", line 972, in run_command
      cmd_obj.run()
    File "<https://builds.apache.org/job/beam_PostCommit_Python_Verify/ws/sdks/python/target/.tox/py27cython/local/lib/python2.7/site-packages/wheel/bdist_wheel.py",> line 204, in run
      self.run_command('build')
    File "/usr/lib/python2.7/distutils/cmd.py", line 326, in run_command
      self.distribution.run_command(command)
    File "/usr/lib/python2.7/distutils/dist.py", line 972, in run_command
      cmd_obj.run()
    File "/usr/lib/python2.7/distutils/command/build.py", line 128, in run
      self.run_command(cmd_name)
    File "/usr/lib/python2.7/distutils/cmd.py", line 326, in run_command
      self.distribution.run_command(command)
    File "/usr/lib/python2.7/distutils/dist.py", line 972, in run_command
      cmd_obj.run()
    File "/tmp/pip-2DZBCb-build/setup.py", line 138, in run
      gen_protos.generate_proto_files()
    File "gen_protos.py", line 65, in generate_proto_files
      'Not in apache git tree; unable to find proto definitions.')
  RuntimeError: Not in apache git tree; unable to find proto definitions.
  
  ----------------------------------------
  Failed building wheel for apache-beam
  Running setup.py clean for apache-beam
Failed to build apache-beam
Installing collected packages: avro, crcmod, dill, httplib2, funcsigs, pbr, mock, pyasn1, pyasn1-modules, rsa, oauth2client, protobuf, pyyaml, typing, apache-beam
  Found existing installation: protobuf 3.4.0
    Uninstalling protobuf-3.4.0:
      Successfully uninstalled protobuf-3.4.0
  Running setup.py install for apache-beam: started
    Running setup.py install for apache-beam: finished with status 'error'
    Complete output from command <https://builds.apache.org/job/beam_PostCommit_Python_Verify/ws/sdks/python/target/.tox/py27cython/bin/python> -u -c "import setuptools, tokenize;__file__='/tmp/pip-2DZBCb-build/setup.py';f=getattr(tokenize, 'open', open)(__file__);code=f.read().replace('\r\n', '\n');f.close();exec(compile(code, __file__, 'exec'))" install --record /tmp/pip-C7QDn1-record/install-record.txt --single-version-externally-managed --compile --install-headers <https://builds.apache.org/job/beam_PostCommit_Python_Verify/ws/sdks/python/target/.tox/py27cython/include/site/python2.7/apache-beam>:
    <https://builds.apache.org/job/beam_PostCommit_Python_Verify/ws/sdks/python/target/.tox/py27cython/local/lib/python2.7/site-packages/setuptools/dist.py>:351: UserWarning: Normalizing '2.2.0.dev' to '2.2.0.dev0'
      normalized_version,
    running install
    running build
    running build_py
    Traceback (most recent call last):
      File "<string>", line 1, in <module>
      File "/tmp/pip-2DZBCb-build/setup.py", line 198, in <module>
        'test': generate_protos_first(test),
      File "/usr/lib/python2.7/distutils/core.py", line 151, in setup
        dist.run_commands()
      File "/usr/lib/python2.7/distutils/dist.py", line 953, in run_commands
        self.run_command(cmd)
      File "/usr/lib/python2.7/distutils/dist.py", line 972, in run_command
        cmd_obj.run()
      File "<https://builds.apache.org/job/beam_PostCommit_Python_Verify/ws/sdks/python/target/.tox/py27cython/local/lib/python2.7/site-packages/setuptools/command/install.py",> line 61, in run
        return orig.install.run(self)
      File "/usr/lib/python2.7/distutils/command/install.py", line 601, in run
        self.run_command('build')
      File "/usr/lib/python2.7/distutils/cmd.py", line 326, in run_command
        self.distribution.run_command(command)
      File "/usr/lib/python2.7/distutils/dist.py", line 972, in run_command
        cmd_obj.run()
      File "/usr/lib/python2.7/distutils/command/build.py", line 128, in run
        self.run_command(cmd_name)
      File "/usr/lib/python2.7/distutils/cmd.py", line 326, in run_command
        self.distribution.run_command(command)
      File "/usr/lib/python2.7/distutils/dist.py", line 972, in run_command
        cmd_obj.run()
      File "/tmp/pip-2DZBCb-build/setup.py", line 138, in run
        gen_protos.generate_proto_files()
      File "gen_protos.py", line 65, in generate_proto_files
        'Not in apache git tree; unable to find proto definitions.')
    RuntimeError: Not in apache git tree; unable to find proto definitions.
    
    ----------------------------------------
Command "<https://builds.apache.org/job/beam_PostCommit_Python_Verify/ws/sdks/python/target/.tox/py27cython/bin/python> -u -c "import setuptools, tokenize;__file__='/tmp/pip-2DZBCb-build/setup.py';f=getattr(tokenize, 'open', open)(__file__);code=f.read().replace('\r\n', '\n');f.close();exec(compile(code, __file__, 'exec'))" install --record /tmp/pip-C7QDn1-record/install-record.txt --single-version-externally-managed --compile --install-headers <https://builds.apache.org/job/beam_PostCommit_Python_Verify/ws/sdks/python/target/.tox/py27cython/include/site/python2.7/apache-beam"> failed with error code 1 in /tmp/pip-2DZBCb-build/

py27cython installed: avro==1.8.2,crcmod==1.7,Cython==0.25.2,dill==0.2.6,enum34==1.1.6,funcsigs==1.0.2,futures==3.1.1,grpcio==1.6.0,grpcio-tools==1.3.5,httplib2==0.9.2,mock==2.0.0,nose==1.3.7,oauth2client==3.0.0,pbr==3.1.1,protobuf==3.3.0,pyasn1==0.3.5,pyasn1-modules==0.1.4,PyYAML==3.12,rsa==3.4.2,six==1.11.0,typing==3.6.2
py27gcp create: <https://builds.apache.org/job/beam_PostCommit_Python_Verify/ws/sdks/python/target/.tox/py27gcp>
py27gcp installdeps: nose==1.3.7
py27gcp inst: <https://builds.apache.org/job/beam_PostCommit_Python_Verify/ws/sdks/python/target/.tox/dist/apache-beam-2.2.0.dev.zip>
ERROR: invocation failed (exit code 1), logfile: <https://builds.apache.org/job/beam_PostCommit_Python_Verify/ws/sdks/python/target/.tox/py27gcp/log/py27gcp-2.log>
ERROR: actionid: py27gcp
msg: installpkg
cmdargs: [local('<https://builds.apache.org/job/beam_PostCommit_Python_Verify/ws/sdks/python/target/.tox/py27gcp/bin/pip'),> 'install', '<https://builds.apache.org/job/beam_PostCommit_Python_Verify/ws/sdks/python/target/.tox/dist/apache-beam-2.2.0.dev.zip']>
env: {'JENKINS_HOME': '/x1/jenkins/jenkins-home', 'BUILD_CAUSE': 'TIMERTRIGGER', 'GIT_COMMIT': 'fdd99650d4e92cbbc0121949c882e920cf9c89a7', 'HUDSON_URL': 'https://builds.apache.org/', 'BUILD_URL': 'https://builds.apache.org/job/beam_PostCommit_Python_Verify/3160/', 'GIT_PREVIOUS_COMMIT': 'fdd99650d4e92cbbc0121949c882e920cf9c89a7', 'BUILD_TAG': 'jenkins-beam_PostCommit_Python_Verify-3160', 'SSH_CLIENT': '62.210.60.235 55148 22', 'JENKINS_URL': 'https://builds.apache.org/', 'LOGNAME': 'jenkins', 'USER': 'jenkins', 'WORKSPACE': '<https://builds.apache.org/job/beam_PostCommit_Python_Verify/ws/',> 'HOME': '/home/jenkins', 'PATH': '<https://builds.apache.org/job/beam_PostCommit_Python_Verify/ws/sdks/python/target/.tox/py27gcp/bin>:/home/jenkins/tools/java/latest1.8/bin:/usr/local/sbin:/usr/local/bin:/usr/sbin:/usr/bin:/sbin:/bin:/usr/games:/usr/local/games', 'JOB_NAME': 'beam_PostCommit_Python_Verify', 'LANG': 'en_US.UTF-8', 'RUN_DISPLAY_URL': 'https://builds.apache.org/job/beam_PostCommit_Python_Verify/3160/display/redirect', 'VIRTUAL_ENV': '<https://builds.apache.org/job/beam_PostCommit_Python_Verify/ws/sdks/python/target/.tox/py27gcp',> 'SHELL': '/bin/bash', 'GIT_PREVIOUS_SUCCESSFUL_COMMIT': 'bd0facc469b2312dd7ca2e2a7161c5562cd58b36', 'SHLVL': '3', 'NLSPATH': '/usr/dt/lib/nls/msg/%L/%N.cat', 'GIT_AUTHOR_EMAIL': 'builds@apache.org', 'HUDSON_HOME': '/x1/jenkins/jenkins-home', 'NODE_LABELS': 'beam beam3', 'GIT_COMMITTER_EMAIL': 'builds@apache.org', 'BUILD_CAUSE_TIMERTRIGGER': 'true', 'PYTHONHASHSEED': '477364063', 'JAVA_HOME': '/home/jenkins/tools/java/latest1.8', 'ROOT_BUILD_CAUSE': 'TIMERTRIGGER', 'BUILD_ID': '3160', 'BUILD_NUMBER': '3160', 'XDG_RUNTIME_DIR': '/run/user/9997', 'HUDSON_COOKIE': 'b2599dac-8de1-436a-8ade-7f4d87ee8108', 'JOB_URL': 'https://builds.apache.org/job/beam_PostCommit_Python_Verify/', 'TEST_HOST': 'beam3', 'GIT_BRANCH': 'origin/master', 'JOB_BASE_NAME': 'beam_PostCommit_Python_Verify', 'GIT_AUTHOR_NAME': 'jenkins', 'ROOT_BUILD_CAUSE_TIMERTRIGGER': 'true', 'GIT_COMMITTER_NAME': 'jenkins', 'XDG_SESSION_ID': '122', '_': '/home/jenkins/.local/bin//tox', 'sha1': 'master', 'COVERALLS_REPO_TOKEN': '****', 'JOB_DISPLAY_URL': 'https://builds.apache.org/job/beam_PostCommit_Python_Verify/display/redirect', 'HUDSON_SERVER_COOKIE': 'f4ebd1e6b0d976e8', 'EXECUTOR_NUMBER': '1', 'NODE_NAME': 'beam3', 'PWD': '<https://builds.apache.org/job/beam_PostCommit_Python_Verify/ws/',> 'SPARK_LOCAL_IP': '127.0.0.1', 'JENKINS_SERVER_COOKIE': 'f4ebd1e6b0d976e8', 'BUILD_DISPLAY_NAME': '#3160', 'XFILESEARCHPATH': '/usr/dt/app-defaults/%L/Dt', 'MAIL': '/var/mail/jenkins', 'SSH_CONNECTION': '62.210.60.235 55148 10.128.0.4 22', 'RUN_CHANGES_DISPLAY_URL': 'https://builds.apache.org/job/beam_PostCommit_Python_Verify/3160/display/redirect?page=changes', 'GIT_URL': 'https://github.com/apache/beam.git'}

Processing ./target/.tox/dist/apache-beam-2.2.0.dev.zip
Collecting avro<2.0.0,>=1.8.1 (from apache-beam==2.2.0.dev0)
Collecting crcmod<2.0,>=1.7 (from apache-beam==2.2.0.dev0)
Collecting dill==0.2.6 (from apache-beam==2.2.0.dev0)
Collecting grpcio<2.0,>=1.0 (from apache-beam==2.2.0.dev0)
  Using cached grpcio-1.6.0-cp27-cp27mu-manylinux1_x86_64.whl
Collecting httplib2<0.10,>=0.8 (from apache-beam==2.2.0.dev0)
Collecting mock<3.0.0,>=1.0.1 (from apache-beam==2.2.0.dev0)
  Using cached mock-2.0.0-py2.py3-none-any.whl
Collecting oauth2client<4.0.0,>=2.0.1 (from apache-beam==2.2.0.dev0)
Collecting protobuf<=3.3.0,>=3.2.0 (from apache-beam==2.2.0.dev0)
  Using cached protobuf-3.3.0-cp27-cp27mu-manylinux1_x86_64.whl
Collecting pyyaml<4.0.0,>=3.12 (from apache-beam==2.2.0.dev0)
Collecting typing<3.7.0,>=3.6.0 (from apache-beam==2.2.0.dev0)
  Using cached typing-3.6.2-py2-none-any.whl
Collecting six>=1.5.2 (from grpcio<2.0,>=1.0->apache-beam==2.2.0.dev0)
  Using cached six-1.11.0-py2.py3-none-any.whl
Collecting futures>=2.2.0 (from grpcio<2.0,>=1.0->apache-beam==2.2.0.dev0)
  Using cached futures-3.1.1-py2-none-any.whl
Collecting enum34>=1.0.4 (from grpcio<2.0,>=1.0->apache-beam==2.2.0.dev0)
  Using cached enum34-1.1.6-py2-none-any.whl
Collecting funcsigs>=1; python_version < "3.3" (from mock<3.0.0,>=1.0.1->apache-beam==2.2.0.dev0)
  Using cached funcsigs-1.0.2-py2.py3-none-any.whl
Collecting pbr>=0.11 (from mock<3.0.0,>=1.0.1->apache-beam==2.2.0.dev0)
  Using cached pbr-3.1.1-py2.py3-none-any.whl
Collecting pyasn1-modules>=0.0.5 (from oauth2client<4.0.0,>=2.0.1->apache-beam==2.2.0.dev0)
  Using cached pyasn1_modules-0.1.4-py2.py3-none-any.whl
Collecting pyasn1>=0.1.7 (from oauth2client<4.0.0,>=2.0.1->apache-beam==2.2.0.dev0)
  Using cached pyasn1-0.3.5-py2.py3-none-any.whl
Collecting rsa>=3.1.4 (from oauth2client<4.0.0,>=2.0.1->apache-beam==2.2.0.dev0)
  Using cached rsa-3.4.2-py2.py3-none-any.whl
Requirement already satisfied: setuptools in ./target/.tox/py27gcp/lib/python2.7/site-packages (from protobuf<=3.3.0,>=3.2.0->apache-beam==2.2.0.dev0)
Building wheels for collected packages: apache-beam
  Running setup.py bdist_wheel for apache-beam: started
  Running setup.py bdist_wheel for apache-beam: finished with status 'error'
  Complete output from command <https://builds.apache.org/job/beam_PostCommit_Python_Verify/ws/sdks/python/target/.tox/py27gcp/bin/python> -u -c "import setuptools, tokenize;__file__='/tmp/pip-lPFyqk-build/setup.py';f=getattr(tokenize, 'open', open)(__file__);code=f.read().replace('\r\n', '\n');f.close();exec(compile(code, __file__, 'exec'))" bdist_wheel -d /tmp/tmpmYzqO9pip-wheel- --python-tag cp27:
  <https://builds.apache.org/job/beam_PostCommit_Python_Verify/ws/sdks/python/target/.tox/py27gcp/local/lib/python2.7/site-packages/setuptools/dist.py>:351: UserWarning: Normalizing '2.2.0.dev' to '2.2.0.dev0'
    normalized_version,
  running bdist_wheel
  running build
  running build_py
  gen_protos.py:46: UserWarning: Installing grpcio-tools is recommended for development.
    warnings.warn('Installing grpcio-tools is recommended for development.')
  Traceback (most recent call last):
    File "<string>", line 1, in <module>
    File "/tmp/pip-lPFyqk-build/setup.py", line 198, in <module>
      'test': generate_protos_first(test),
    File "/usr/lib/python2.7/distutils/core.py", line 151, in setup
      dist.run_commands()
    File "/usr/lib/python2.7/distutils/dist.py", line 953, in run_commands
      self.run_command(cmd)
    File "/usr/lib/python2.7/distutils/dist.py", line 972, in run_command
      cmd_obj.run()
    File "<https://builds.apache.org/job/beam_PostCommit_Python_Verify/ws/sdks/python/target/.tox/py27gcp/local/lib/python2.7/site-packages/wheel/bdist_wheel.py",> line 204, in run
      self.run_command('build')
    File "/usr/lib/python2.7/distutils/cmd.py", line 326, in run_command
      self.distribution.run_command(command)
    File "/usr/lib/python2.7/distutils/dist.py", line 972, in run_command
      cmd_obj.run()
    File "/usr/lib/python2.7/distutils/command/build.py", line 128, in run
      self.run_command(cmd_name)
    File "/usr/lib/python2.7/distutils/cmd.py", line 326, in run_command
      self.distribution.run_command(command)
    File "/usr/lib/python2.7/distutils/dist.py", line 972, in run_command
      cmd_obj.run()
    File "/tmp/pip-lPFyqk-build/setup.py", line 138, in run
      gen_protos.generate_proto_files()
    File "gen_protos.py", line 65, in generate_proto_files
      'Not in apache git tree; unable to find proto definitions.')
  RuntimeError: Not in apache git tree; unable to find proto definitions.
  
  ----------------------------------------
  Failed building wheel for apache-beam
  Running setup.py clean for apache-beam
Failed to build apache-beam
Installing collected packages: avro, crcmod, dill, six, futures, protobuf, enum34, grpcio, httplib2, funcsigs, pbr, mock, pyasn1, pyasn1-modules, rsa, oauth2client, pyyaml, typing, apache-beam
  Running setup.py install for apache-beam: started
    Running setup.py install for apache-beam: finished with status 'error'
    Complete output from command <https://builds.apache.org/job/beam_PostCommit_Python_Verify/ws/sdks/python/target/.tox/py27gcp/bin/python> -u -c "import setuptools, tokenize;__file__='/tmp/pip-lPFyqk-build/setup.py';f=getattr(tokenize, 'open', open)(__file__);code=f.read().replace('\r\n', '\n');f.close();exec(compile(code, __file__, 'exec'))" install --record /tmp/pip-oljaew-record/install-record.txt --single-version-externally-managed --compile --install-headers <https://builds.apache.org/job/beam_PostCommit_Python_Verify/ws/sdks/python/target/.tox/py27gcp/include/site/python2.7/apache-beam>:
    <https://builds.apache.org/job/beam_PostCommit_Python_Verify/ws/sdks/python/target/.tox/py27gcp/local/lib/python2.7/site-packages/setuptools/dist.py>:351: UserWarning: Normalizing '2.2.0.dev' to '2.2.0.dev0'
      normalized_version,
    running install
    running build
    running build_py
    gen_protos.py:46: UserWarning: Installing grpcio-tools is recommended for development.
      warnings.warn('Installing grpcio-tools is recommended for development.')
    Traceback (most recent call last):
      File "<string>", line 1, in <module>
      File "/tmp/pip-lPFyqk-build/setup.py", line 198, in <module>
        'test': generate_protos_first(test),
      File "/usr/lib/python2.7/distutils/core.py", line 151, in setup
        dist.run_commands()
      File "/usr/lib/python2.7/distutils/dist.py", line 953, in run_commands
        self.run_command(cmd)
      File "/usr/lib/python2.7/distutils/dist.py", line 972, in run_command
        cmd_obj.run()
      File "<https://builds.apache.org/job/beam_PostCommit_Python_Verify/ws/sdks/python/target/.tox/py27gcp/local/lib/python2.7/site-packages/setuptools/command/install.py",> line 61, in run
        return orig.install.run(self)
      File "/usr/lib/python2.7/distutils/command/install.py", line 601, in run
        self.run_command('build')
      File "/usr/lib/python2.7/distutils/cmd.py", line 326, in run_command
        self.distribution.run_command(command)
      File "/usr/lib/python2.7/distutils/dist.py", line 972, in run_command
        cmd_obj.run()
      File "/usr/lib/python2.7/distutils/command/build.py", line 128, in run
        self.run_command(cmd_name)
      File "/usr/lib/python2.7/distutils/cmd.py", line 326, in run_command
        self.distribution.run_command(command)
      File "/usr/lib/python2.7/distutils/dist.py", line 972, in run_command
        cmd_obj.run()
      File "/tmp/pip-lPFyqk-build/setup.py", line 138, in run
        gen_protos.generate_proto_files()
      File "gen_protos.py", line 65, in generate_proto_files
        'Not in apache git tree; unable to find proto definitions.')
    RuntimeError: Not in apache git tree; unable to find proto definitions.
    
    ----------------------------------------
Command "<https://builds.apache.org/job/beam_PostCommit_Python_Verify/ws/sdks/python/target/.tox/py27gcp/bin/python> -u -c "import setuptools, tokenize;__file__='/tmp/pip-lPFyqk-build/setup.py';f=getattr(tokenize, 'open', open)(__file__);code=f.read().replace('\r\n', '\n');f.close();exec(compile(code, __file__, 'exec'))" install --record /tmp/pip-oljaew-record/install-record.txt --single-version-externally-managed --compile --install-headers <https://builds.apache.org/job/beam_PostCommit_Python_Verify/ws/sdks/python/target/.tox/py27gcp/include/site/python2.7/apache-beam"> failed with error code 1 in /tmp/pip-lPFyqk-build/

py27gcp installed: avro==1.8.2,crcmod==1.7,dill==0.2.6,enum34==1.1.6,funcsigs==1.0.2,futures==3.1.1,grpcio==1.6.0,httplib2==0.9.2,mock==2.0.0,nose==1.3.7,oauth2client==3.0.0,pbr==3.1.1,protobuf==3.3.0,pyasn1==0.3.5,pyasn1-modules==0.1.4,PyYAML==3.12,rsa==3.4.2,six==1.11.0,typing==3.6.2
___________________________________ summary ____________________________________
ERROR:   docs: InvocationError: <https://builds.apache.org/job/beam_PostCommit_Python_Verify/ws/sdks/python/target/.tox/docs/bin/pip> install <https://builds.apache.org/job/beam_PostCommit_Python_Verify/ws/sdks/python/target/.tox/dist/apache-beam-2.2.0.dev.zip> (see <https://builds.apache.org/job/beam_PostCommit_Python_Verify/ws/sdks/python/target/.tox/docs/log/docs-2.log)>
ERROR:   lint: InvocationError: <https://builds.apache.org/job/beam_PostCommit_Python_Verify/ws/sdks/python/target/.tox/lint/bin/pip> install <https://builds.apache.org/job/beam_PostCommit_Python_Verify/ws/sdks/python/target/.tox/dist/apache-beam-2.2.0.dev.zip> (see <https://builds.apache.org/job/beam_PostCommit_Python_Verify/ws/sdks/python/target/.tox/lint/log/lint-2.log)>
ERROR:   py27: InvocationError: <https://builds.apache.org/job/beam_PostCommit_Python_Verify/ws/sdks/python/target/.tox/py27/bin/pip> install <https://builds.apache.org/job/beam_PostCommit_Python_Verify/ws/sdks/python/target/.tox/dist/apache-beam-2.2.0.dev.zip> (see <https://builds.apache.org/job/beam_PostCommit_Python_Verify/ws/sdks/python/target/.tox/py27/log/py27-2.log)>
ERROR:   py27cython: InvocationError: <https://builds.apache.org/job/beam_PostCommit_Python_Verify/ws/sdks/python/target/.tox/py27cython/bin/pip> install <https://builds.apache.org/job/beam_PostCommit_Python_Verify/ws/sdks/python/target/.tox/dist/apache-beam-2.2.0.dev.zip> (see <https://builds.apache.org/job/beam_PostCommit_Python_Verify/ws/sdks/python/target/.tox/py27cython/log/py27cython-2.log)>
ERROR:   py27gcp: InvocationError: <https://builds.apache.org/job/beam_PostCommit_Python_Verify/ws/sdks/python/target/.tox/py27gcp/bin/pip> install <https://builds.apache.org/job/beam_PostCommit_Python_Verify/ws/sdks/python/target/.tox/dist/apache-beam-2.2.0.dev.zip> (see <https://builds.apache.org/job/beam_PostCommit_Python_Verify/ws/sdks/python/target/.tox/py27gcp/log/py27gcp-2.log)>
Build step 'Execute shell' marked build as failure
Not sending mail to unregistered user echauchot@gmail.com+jbonofre@apache.org
Not sending mail to unregistered user kirpichov@google.com

Build failed in Jenkins: beam_PostCommit_Python_Verify #3159

Posted by Apache Jenkins Server <je...@builds.apache.org>.
See <https://builds.apache.org/job/beam_PostCommit_Python_Verify/3159/display/redirect>

------------------------------------------
[...truncated 44.08 KB...]
Requirement already satisfied: grpcio<2.0,>=1.0 in ./target/.tox/py27cython/lib/python2.7/site-packages (from apache-beam==2.2.0.dev0)
Collecting httplib2<0.10,>=0.8 (from apache-beam==2.2.0.dev0)
Collecting mock<3.0.0,>=1.0.1 (from apache-beam==2.2.0.dev0)
  Using cached mock-2.0.0-py2.py3-none-any.whl
Collecting oauth2client<4.0.0,>=2.0.1 (from apache-beam==2.2.0.dev0)
Collecting protobuf<=3.3.0,>=3.2.0 (from apache-beam==2.2.0.dev0)
  Using cached protobuf-3.3.0-cp27-cp27mu-manylinux1_x86_64.whl
Collecting pyyaml<4.0.0,>=3.12 (from apache-beam==2.2.0.dev0)
Collecting typing<3.7.0,>=3.6.0 (from apache-beam==2.2.0.dev0)
  Using cached typing-3.6.2-py2-none-any.whl
Requirement already satisfied: six>=1.5.2 in ./target/.tox/py27cython/lib/python2.7/site-packages (from grpcio<2.0,>=1.0->apache-beam==2.2.0.dev0)
Requirement already satisfied: futures>=2.2.0 in ./target/.tox/py27cython/lib/python2.7/site-packages (from grpcio<2.0,>=1.0->apache-beam==2.2.0.dev0)
Requirement already satisfied: enum34>=1.0.4 in ./target/.tox/py27cython/lib/python2.7/site-packages (from grpcio<2.0,>=1.0->apache-beam==2.2.0.dev0)
Collecting funcsigs>=1; python_version < "3.3" (from mock<3.0.0,>=1.0.1->apache-beam==2.2.0.dev0)
  Using cached funcsigs-1.0.2-py2.py3-none-any.whl
Collecting pbr>=0.11 (from mock<3.0.0,>=1.0.1->apache-beam==2.2.0.dev0)
  Using cached pbr-3.1.1-py2.py3-none-any.whl
Collecting rsa>=3.1.4 (from oauth2client<4.0.0,>=2.0.1->apache-beam==2.2.0.dev0)
  Using cached rsa-3.4.2-py2.py3-none-any.whl
Collecting pyasn1-modules>=0.0.5 (from oauth2client<4.0.0,>=2.0.1->apache-beam==2.2.0.dev0)
  Using cached pyasn1_modules-0.1.4-py2.py3-none-any.whl
Collecting pyasn1>=0.1.7 (from oauth2client<4.0.0,>=2.0.1->apache-beam==2.2.0.dev0)
  Using cached pyasn1-0.3.5-py2.py3-none-any.whl
Requirement already satisfied: setuptools in ./target/.tox/py27cython/lib/python2.7/site-packages (from protobuf<=3.3.0,>=3.2.0->apache-beam==2.2.0.dev0)
Building wheels for collected packages: apache-beam
  Running setup.py bdist_wheel for apache-beam: started
  Running setup.py bdist_wheel for apache-beam: finished with status 'error'
  Complete output from command <https://builds.apache.org/job/beam_PostCommit_Python_Verify/ws/sdks/python/target/.tox/py27cython/bin/python> -u -c "import setuptools, tokenize;__file__='/tmp/pip-cMMyc_-build/setup.py';f=getattr(tokenize, 'open', open)(__file__);code=f.read().replace('\r\n', '\n');f.close();exec(compile(code, __file__, 'exec'))" bdist_wheel -d /tmp/tmp2m5fgepip-wheel- --python-tag cp27:
  <https://builds.apache.org/job/beam_PostCommit_Python_Verify/ws/sdks/python/target/.tox/py27cython/local/lib/python2.7/site-packages/setuptools/dist.py>:351: UserWarning: Normalizing '2.2.0.dev' to '2.2.0.dev0'
    normalized_version,
  running bdist_wheel
  running build
  running build_py
  Traceback (most recent call last):
    File "<string>", line 1, in <module>
    File "/tmp/pip-cMMyc_-build/setup.py", line 198, in <module>
      'test': generate_protos_first(test),
    File "/usr/lib/python2.7/distutils/core.py", line 151, in setup
      dist.run_commands()
    File "/usr/lib/python2.7/distutils/dist.py", line 953, in run_commands
      self.run_command(cmd)
    File "/usr/lib/python2.7/distutils/dist.py", line 972, in run_command
      cmd_obj.run()
    File "<https://builds.apache.org/job/beam_PostCommit_Python_Verify/ws/sdks/python/target/.tox/py27cython/local/lib/python2.7/site-packages/wheel/bdist_wheel.py",> line 204, in run
      self.run_command('build')
    File "/usr/lib/python2.7/distutils/cmd.py", line 326, in run_command
      self.distribution.run_command(command)
    File "/usr/lib/python2.7/distutils/dist.py", line 972, in run_command
      cmd_obj.run()
    File "/usr/lib/python2.7/distutils/command/build.py", line 128, in run
      self.run_command(cmd_name)
    File "/usr/lib/python2.7/distutils/cmd.py", line 326, in run_command
      self.distribution.run_command(command)
    File "/usr/lib/python2.7/distutils/dist.py", line 972, in run_command
      cmd_obj.run()
    File "/tmp/pip-cMMyc_-build/setup.py", line 138, in run
      gen_protos.generate_proto_files()
    File "gen_protos.py", line 65, in generate_proto_files
      'Not in apache git tree; unable to find proto definitions.')
  RuntimeError: Not in apache git tree; unable to find proto definitions.
  
  ----------------------------------------
  Failed building wheel for apache-beam
  Running setup.py clean for apache-beam
Failed to build apache-beam
Installing collected packages: avro, crcmod, dill, httplib2, funcsigs, pbr, mock, pyasn1, rsa, pyasn1-modules, oauth2client, protobuf, pyyaml, typing, apache-beam
  Found existing installation: protobuf 3.4.0
    Uninstalling protobuf-3.4.0:
      Successfully uninstalled protobuf-3.4.0
  Running setup.py install for apache-beam: started
    Running setup.py install for apache-beam: finished with status 'error'
    Complete output from command <https://builds.apache.org/job/beam_PostCommit_Python_Verify/ws/sdks/python/target/.tox/py27cython/bin/python> -u -c "import setuptools, tokenize;__file__='/tmp/pip-cMMyc_-build/setup.py';f=getattr(tokenize, 'open', open)(__file__);code=f.read().replace('\r\n', '\n');f.close();exec(compile(code, __file__, 'exec'))" install --record /tmp/pip-_Iwe1l-record/install-record.txt --single-version-externally-managed --compile --install-headers <https://builds.apache.org/job/beam_PostCommit_Python_Verify/ws/sdks/python/target/.tox/py27cython/include/site/python2.7/apache-beam>:
    <https://builds.apache.org/job/beam_PostCommit_Python_Verify/ws/sdks/python/target/.tox/py27cython/local/lib/python2.7/site-packages/setuptools/dist.py>:351: UserWarning: Normalizing '2.2.0.dev' to '2.2.0.dev0'
      normalized_version,
    running install
    running build
    running build_py
    Traceback (most recent call last):
      File "<string>", line 1, in <module>
      File "/tmp/pip-cMMyc_-build/setup.py", line 198, in <module>
        'test': generate_protos_first(test),
      File "/usr/lib/python2.7/distutils/core.py", line 151, in setup
        dist.run_commands()
      File "/usr/lib/python2.7/distutils/dist.py", line 953, in run_commands
        self.run_command(cmd)
      File "/usr/lib/python2.7/distutils/dist.py", line 972, in run_command
        cmd_obj.run()
      File "<https://builds.apache.org/job/beam_PostCommit_Python_Verify/ws/sdks/python/target/.tox/py27cython/local/lib/python2.7/site-packages/setuptools/command/install.py",> line 61, in run
        return orig.install.run(self)
      File "/usr/lib/python2.7/distutils/command/install.py", line 601, in run
        self.run_command('build')
      File "/usr/lib/python2.7/distutils/cmd.py", line 326, in run_command
        self.distribution.run_command(command)
      File "/usr/lib/python2.7/distutils/dist.py", line 972, in run_command
        cmd_obj.run()
      File "/usr/lib/python2.7/distutils/command/build.py", line 128, in run
        self.run_command(cmd_name)
      File "/usr/lib/python2.7/distutils/cmd.py", line 326, in run_command
        self.distribution.run_command(command)
      File "/usr/lib/python2.7/distutils/dist.py", line 972, in run_command
        cmd_obj.run()
      File "/tmp/pip-cMMyc_-build/setup.py", line 138, in run
        gen_protos.generate_proto_files()
      File "gen_protos.py", line 65, in generate_proto_files
        'Not in apache git tree; unable to find proto definitions.')
    RuntimeError: Not in apache git tree; unable to find proto definitions.
    
    ----------------------------------------
Command "<https://builds.apache.org/job/beam_PostCommit_Python_Verify/ws/sdks/python/target/.tox/py27cython/bin/python> -u -c "import setuptools, tokenize;__file__='/tmp/pip-cMMyc_-build/setup.py';f=getattr(tokenize, 'open', open)(__file__);code=f.read().replace('\r\n', '\n');f.close();exec(compile(code, __file__, 'exec'))" install --record /tmp/pip-_Iwe1l-record/install-record.txt --single-version-externally-managed --compile --install-headers <https://builds.apache.org/job/beam_PostCommit_Python_Verify/ws/sdks/python/target/.tox/py27cython/include/site/python2.7/apache-beam"> failed with error code 1 in /tmp/pip-cMMyc_-build/

py27cython installed: avro==1.8.2,crcmod==1.7,Cython==0.25.2,dill==0.2.6,enum34==1.1.6,funcsigs==1.0.2,futures==3.1.1,grpcio==1.6.0,grpcio-tools==1.3.5,httplib2==0.9.2,mock==2.0.0,nose==1.3.7,oauth2client==3.0.0,pbr==3.1.1,protobuf==3.3.0,pyasn1==0.3.5,pyasn1-modules==0.1.4,PyYAML==3.12,rsa==3.4.2,six==1.11.0,typing==3.6.2
py27gcp create: <https://builds.apache.org/job/beam_PostCommit_Python_Verify/ws/sdks/python/target/.tox/py27gcp>
py27gcp installdeps: nose==1.3.7
py27gcp inst: <https://builds.apache.org/job/beam_PostCommit_Python_Verify/ws/sdks/python/target/.tox/dist/apache-beam-2.2.0.dev.zip>
ERROR: invocation failed (exit code 1), logfile: <https://builds.apache.org/job/beam_PostCommit_Python_Verify/ws/sdks/python/target/.tox/py27gcp/log/py27gcp-2.log>
ERROR: actionid: py27gcp
msg: installpkg
cmdargs: [local('<https://builds.apache.org/job/beam_PostCommit_Python_Verify/ws/sdks/python/target/.tox/py27gcp/bin/pip'),> 'install', '<https://builds.apache.org/job/beam_PostCommit_Python_Verify/ws/sdks/python/target/.tox/dist/apache-beam-2.2.0.dev.zip']>
env: {'JENKINS_HOME': '/x1/jenkins/jenkins-home', 'BUILD_CAUSE': 'TIMERTRIGGER', 'GIT_COMMIT': 'fdd99650d4e92cbbc0121949c882e920cf9c89a7', 'HUDSON_URL': 'https://builds.apache.org/', 'BUILD_URL': 'https://builds.apache.org/job/beam_PostCommit_Python_Verify/3159/', 'GIT_PREVIOUS_COMMIT': 'fdd99650d4e92cbbc0121949c882e920cf9c89a7', 'BUILD_TAG': 'jenkins-beam_PostCommit_Python_Verify-3159', 'SSH_CLIENT': '62.210.60.235 55148 22', 'JENKINS_URL': 'https://builds.apache.org/', 'LOGNAME': 'jenkins', 'USER': 'jenkins', 'WORKSPACE': '<https://builds.apache.org/job/beam_PostCommit_Python_Verify/ws/',> 'HOME': '/home/jenkins', 'PATH': '<https://builds.apache.org/job/beam_PostCommit_Python_Verify/ws/sdks/python/target/.tox/py27gcp/bin>:/home/jenkins/tools/java/latest1.8/bin:/usr/local/sbin:/usr/local/bin:/usr/sbin:/usr/bin:/sbin:/bin:/usr/games:/usr/local/games', 'JOB_NAME': 'beam_PostCommit_Python_Verify', 'LANG': 'en_US.UTF-8', 'RUN_DISPLAY_URL': 'https://builds.apache.org/job/beam_PostCommit_Python_Verify/3159/display/redirect', 'VIRTUAL_ENV': '<https://builds.apache.org/job/beam_PostCommit_Python_Verify/ws/sdks/python/target/.tox/py27gcp',> 'SHELL': '/bin/bash', 'GIT_PREVIOUS_SUCCESSFUL_COMMIT': 'bd0facc469b2312dd7ca2e2a7161c5562cd58b36', 'SHLVL': '3', 'NLSPATH': '/usr/dt/lib/nls/msg/%L/%N.cat', 'GIT_AUTHOR_EMAIL': 'builds@apache.org', 'HUDSON_HOME': '/x1/jenkins/jenkins-home', 'NODE_LABELS': 'beam beam3', 'GIT_COMMITTER_EMAIL': 'builds@apache.org', 'BUILD_CAUSE_TIMERTRIGGER': 'true', 'PYTHONHASHSEED': '3568254697', 'JAVA_HOME': '/home/jenkins/tools/java/latest1.8', 'ROOT_BUILD_CAUSE': 'TIMERTRIGGER', 'BUILD_ID': '3159', 'BUILD_NUMBER': '3159', 'XDG_RUNTIME_DIR': '/run/user/9997', 'HUDSON_COOKIE': 'cf65de2c-60e1-407c-bfcf-9aea61d8d3ca', 'JOB_URL': 'https://builds.apache.org/job/beam_PostCommit_Python_Verify/', 'TEST_HOST': 'beam3', 'GIT_BRANCH': 'origin/master', 'JOB_BASE_NAME': 'beam_PostCommit_Python_Verify', 'GIT_AUTHOR_NAME': 'jenkins', 'ROOT_BUILD_CAUSE_TIMERTRIGGER': 'true', 'GIT_COMMITTER_NAME': 'jenkins', 'XDG_SESSION_ID': '122', '_': '/home/jenkins/.local/bin//tox', 'sha1': 'master', 'COVERALLS_REPO_TOKEN': '****', 'JOB_DISPLAY_URL': 'https://builds.apache.org/job/beam_PostCommit_Python_Verify/display/redirect', 'HUDSON_SERVER_COOKIE': 'f4ebd1e6b0d976e8', 'EXECUTOR_NUMBER': '0', 'NODE_NAME': 'beam3', 'PWD': '<https://builds.apache.org/job/beam_PostCommit_Python_Verify/ws/',> 'SPARK_LOCAL_IP': '127.0.0.1', 'JENKINS_SERVER_COOKIE': 'f4ebd1e6b0d976e8', 'BUILD_DISPLAY_NAME': '#3159', 'XFILESEARCHPATH': '/usr/dt/app-defaults/%L/Dt', 'MAIL': '/var/mail/jenkins', 'SSH_CONNECTION': '62.210.60.235 55148 10.128.0.4 22', 'RUN_CHANGES_DISPLAY_URL': 'https://builds.apache.org/job/beam_PostCommit_Python_Verify/3159/display/redirect?page=changes', 'GIT_URL': 'https://github.com/apache/beam.git'}

Processing ./target/.tox/dist/apache-beam-2.2.0.dev.zip
Collecting avro<2.0.0,>=1.8.1 (from apache-beam==2.2.0.dev0)
Collecting crcmod<2.0,>=1.7 (from apache-beam==2.2.0.dev0)
Collecting dill==0.2.6 (from apache-beam==2.2.0.dev0)
Collecting grpcio<2.0,>=1.0 (from apache-beam==2.2.0.dev0)
  Using cached grpcio-1.6.0-cp27-cp27mu-manylinux1_x86_64.whl
Collecting httplib2<0.10,>=0.8 (from apache-beam==2.2.0.dev0)
Collecting mock<3.0.0,>=1.0.1 (from apache-beam==2.2.0.dev0)
  Using cached mock-2.0.0-py2.py3-none-any.whl
Collecting oauth2client<4.0.0,>=2.0.1 (from apache-beam==2.2.0.dev0)
Collecting protobuf<=3.3.0,>=3.2.0 (from apache-beam==2.2.0.dev0)
  Using cached protobuf-3.3.0-cp27-cp27mu-manylinux1_x86_64.whl
Collecting pyyaml<4.0.0,>=3.12 (from apache-beam==2.2.0.dev0)
Collecting typing<3.7.0,>=3.6.0 (from apache-beam==2.2.0.dev0)
  Using cached typing-3.6.2-py2-none-any.whl
Collecting six>=1.5.2 (from grpcio<2.0,>=1.0->apache-beam==2.2.0.dev0)
  Using cached six-1.11.0-py2.py3-none-any.whl
Collecting futures>=2.2.0 (from grpcio<2.0,>=1.0->apache-beam==2.2.0.dev0)
  Using cached futures-3.1.1-py2-none-any.whl
Collecting enum34>=1.0.4 (from grpcio<2.0,>=1.0->apache-beam==2.2.0.dev0)
  Using cached enum34-1.1.6-py2-none-any.whl
Collecting funcsigs>=1; python_version < "3.3" (from mock<3.0.0,>=1.0.1->apache-beam==2.2.0.dev0)
  Using cached funcsigs-1.0.2-py2.py3-none-any.whl
Collecting pbr>=0.11 (from mock<3.0.0,>=1.0.1->apache-beam==2.2.0.dev0)
  Using cached pbr-3.1.1-py2.py3-none-any.whl
Collecting rsa>=3.1.4 (from oauth2client<4.0.0,>=2.0.1->apache-beam==2.2.0.dev0)
  Using cached rsa-3.4.2-py2.py3-none-any.whl
Collecting pyasn1-modules>=0.0.5 (from oauth2client<4.0.0,>=2.0.1->apache-beam==2.2.0.dev0)
  Using cached pyasn1_modules-0.1.4-py2.py3-none-any.whl
Collecting pyasn1>=0.1.7 (from oauth2client<4.0.0,>=2.0.1->apache-beam==2.2.0.dev0)
  Using cached pyasn1-0.3.5-py2.py3-none-any.whl
Requirement already satisfied: setuptools in ./target/.tox/py27gcp/lib/python2.7/site-packages (from protobuf<=3.3.0,>=3.2.0->apache-beam==2.2.0.dev0)
Building wheels for collected packages: apache-beam
  Running setup.py bdist_wheel for apache-beam: started
  Running setup.py bdist_wheel for apache-beam: finished with status 'error'
  Complete output from command <https://builds.apache.org/job/beam_PostCommit_Python_Verify/ws/sdks/python/target/.tox/py27gcp/bin/python> -u -c "import setuptools, tokenize;__file__='/tmp/pip-HERtrW-build/setup.py';f=getattr(tokenize, 'open', open)(__file__);code=f.read().replace('\r\n', '\n');f.close();exec(compile(code, __file__, 'exec'))" bdist_wheel -d /tmp/tmp11QNpmpip-wheel- --python-tag cp27:
  <https://builds.apache.org/job/beam_PostCommit_Python_Verify/ws/sdks/python/target/.tox/py27gcp/local/lib/python2.7/site-packages/setuptools/dist.py>:351: UserWarning: Normalizing '2.2.0.dev' to '2.2.0.dev0'
    normalized_version,
  running bdist_wheel
  running build
  running build_py
  gen_protos.py:46: UserWarning: Installing grpcio-tools is recommended for development.
    warnings.warn('Installing grpcio-tools is recommended for development.')
  Traceback (most recent call last):
    File "<string>", line 1, in <module>
    File "/tmp/pip-HERtrW-build/setup.py", line 198, in <module>
      'test': generate_protos_first(test),
    File "/usr/lib/python2.7/distutils/core.py", line 151, in setup
      dist.run_commands()
    File "/usr/lib/python2.7/distutils/dist.py", line 953, in run_commands
      self.run_command(cmd)
    File "/usr/lib/python2.7/distutils/dist.py", line 972, in run_command
      cmd_obj.run()
    File "<https://builds.apache.org/job/beam_PostCommit_Python_Verify/ws/sdks/python/target/.tox/py27gcp/local/lib/python2.7/site-packages/wheel/bdist_wheel.py",> line 204, in run
      self.run_command('build')
    File "/usr/lib/python2.7/distutils/cmd.py", line 326, in run_command
      self.distribution.run_command(command)
    File "/usr/lib/python2.7/distutils/dist.py", line 972, in run_command
      cmd_obj.run()
    File "/usr/lib/python2.7/distutils/command/build.py", line 128, in run
      self.run_command(cmd_name)
    File "/usr/lib/python2.7/distutils/cmd.py", line 326, in run_command
      self.distribution.run_command(command)
    File "/usr/lib/python2.7/distutils/dist.py", line 972, in run_command
      cmd_obj.run()
    File "/tmp/pip-HERtrW-build/setup.py", line 138, in run
      gen_protos.generate_proto_files()
    File "gen_protos.py", line 65, in generate_proto_files
      'Not in apache git tree; unable to find proto definitions.')
  RuntimeError: Not in apache git tree; unable to find proto definitions.
  
  ----------------------------------------
  Failed building wheel for apache-beam
  Running setup.py clean for apache-beam
Failed to build apache-beam
Installing collected packages: avro, crcmod, dill, six, protobuf, futures, enum34, grpcio, httplib2, funcsigs, pbr, mock, pyasn1, rsa, pyasn1-modules, oauth2client, pyyaml, typing, apache-beam
  Running setup.py install for apache-beam: started
    Running setup.py install for apache-beam: finished with status 'error'
    Complete output from command <https://builds.apache.org/job/beam_PostCommit_Python_Verify/ws/sdks/python/target/.tox/py27gcp/bin/python> -u -c "import setuptools, tokenize;__file__='/tmp/pip-HERtrW-build/setup.py';f=getattr(tokenize, 'open', open)(__file__);code=f.read().replace('\r\n', '\n');f.close();exec(compile(code, __file__, 'exec'))" install --record /tmp/pip-oEIDkA-record/install-record.txt --single-version-externally-managed --compile --install-headers <https://builds.apache.org/job/beam_PostCommit_Python_Verify/ws/sdks/python/target/.tox/py27gcp/include/site/python2.7/apache-beam>:
    <https://builds.apache.org/job/beam_PostCommit_Python_Verify/ws/sdks/python/target/.tox/py27gcp/local/lib/python2.7/site-packages/setuptools/dist.py>:351: UserWarning: Normalizing '2.2.0.dev' to '2.2.0.dev0'
      normalized_version,
    running install
    running build
    running build_py
    gen_protos.py:46: UserWarning: Installing grpcio-tools is recommended for development.
      warnings.warn('Installing grpcio-tools is recommended for development.')
    Traceback (most recent call last):
      File "<string>", line 1, in <module>
      File "/tmp/pip-HERtrW-build/setup.py", line 198, in <module>
        'test': generate_protos_first(test),
      File "/usr/lib/python2.7/distutils/core.py", line 151, in setup
        dist.run_commands()
      File "/usr/lib/python2.7/distutils/dist.py", line 953, in run_commands
        self.run_command(cmd)
      File "/usr/lib/python2.7/distutils/dist.py", line 972, in run_command
        cmd_obj.run()
      File "<https://builds.apache.org/job/beam_PostCommit_Python_Verify/ws/sdks/python/target/.tox/py27gcp/local/lib/python2.7/site-packages/setuptools/command/install.py",> line 61, in run
        return orig.install.run(self)
      File "/usr/lib/python2.7/distutils/command/install.py", line 601, in run
        self.run_command('build')
      File "/usr/lib/python2.7/distutils/cmd.py", line 326, in run_command
        self.distribution.run_command(command)
      File "/usr/lib/python2.7/distutils/dist.py", line 972, in run_command
        cmd_obj.run()
      File "/usr/lib/python2.7/distutils/command/build.py", line 128, in run
        self.run_command(cmd_name)
      File "/usr/lib/python2.7/distutils/cmd.py", line 326, in run_command
        self.distribution.run_command(command)
      File "/usr/lib/python2.7/distutils/dist.py", line 972, in run_command
        cmd_obj.run()
      File "/tmp/pip-HERtrW-build/setup.py", line 138, in run
        gen_protos.generate_proto_files()
      File "gen_protos.py", line 65, in generate_proto_files
        'Not in apache git tree; unable to find proto definitions.')
    RuntimeError: Not in apache git tree; unable to find proto definitions.
    
    ----------------------------------------
Command "<https://builds.apache.org/job/beam_PostCommit_Python_Verify/ws/sdks/python/target/.tox/py27gcp/bin/python> -u -c "import setuptools, tokenize;__file__='/tmp/pip-HERtrW-build/setup.py';f=getattr(tokenize, 'open', open)(__file__);code=f.read().replace('\r\n', '\n');f.close();exec(compile(code, __file__, 'exec'))" install --record /tmp/pip-oEIDkA-record/install-record.txt --single-version-externally-managed --compile --install-headers <https://builds.apache.org/job/beam_PostCommit_Python_Verify/ws/sdks/python/target/.tox/py27gcp/include/site/python2.7/apache-beam"> failed with error code 1 in /tmp/pip-HERtrW-build/

py27gcp installed: avro==1.8.2,crcmod==1.7,dill==0.2.6,enum34==1.1.6,funcsigs==1.0.2,futures==3.1.1,grpcio==1.6.0,httplib2==0.9.2,mock==2.0.0,nose==1.3.7,oauth2client==3.0.0,pbr==3.1.1,protobuf==3.3.0,pyasn1==0.3.5,pyasn1-modules==0.1.4,PyYAML==3.12,rsa==3.4.2,six==1.11.0,typing==3.6.2
___________________________________ summary ____________________________________
ERROR:   docs: InvocationError: <https://builds.apache.org/job/beam_PostCommit_Python_Verify/ws/sdks/python/target/.tox/docs/bin/pip> install <https://builds.apache.org/job/beam_PostCommit_Python_Verify/ws/sdks/python/target/.tox/dist/apache-beam-2.2.0.dev.zip> (see <https://builds.apache.org/job/beam_PostCommit_Python_Verify/ws/sdks/python/target/.tox/docs/log/docs-2.log)>
ERROR:   lint: InvocationError: <https://builds.apache.org/job/beam_PostCommit_Python_Verify/ws/sdks/python/target/.tox/lint/bin/pip> install <https://builds.apache.org/job/beam_PostCommit_Python_Verify/ws/sdks/python/target/.tox/dist/apache-beam-2.2.0.dev.zip> (see <https://builds.apache.org/job/beam_PostCommit_Python_Verify/ws/sdks/python/target/.tox/lint/log/lint-2.log)>
ERROR:   py27: InvocationError: <https://builds.apache.org/job/beam_PostCommit_Python_Verify/ws/sdks/python/target/.tox/py27/bin/pip> install <https://builds.apache.org/job/beam_PostCommit_Python_Verify/ws/sdks/python/target/.tox/dist/apache-beam-2.2.0.dev.zip> (see <https://builds.apache.org/job/beam_PostCommit_Python_Verify/ws/sdks/python/target/.tox/py27/log/py27-2.log)>
ERROR:   py27cython: InvocationError: <https://builds.apache.org/job/beam_PostCommit_Python_Verify/ws/sdks/python/target/.tox/py27cython/bin/pip> install <https://builds.apache.org/job/beam_PostCommit_Python_Verify/ws/sdks/python/target/.tox/dist/apache-beam-2.2.0.dev.zip> (see <https://builds.apache.org/job/beam_PostCommit_Python_Verify/ws/sdks/python/target/.tox/py27cython/log/py27cython-2.log)>
ERROR:   py27gcp: InvocationError: <https://builds.apache.org/job/beam_PostCommit_Python_Verify/ws/sdks/python/target/.tox/py27gcp/bin/pip> install <https://builds.apache.org/job/beam_PostCommit_Python_Verify/ws/sdks/python/target/.tox/dist/apache-beam-2.2.0.dev.zip> (see <https://builds.apache.org/job/beam_PostCommit_Python_Verify/ws/sdks/python/target/.tox/py27gcp/log/py27gcp-2.log)>
Build step 'Execute shell' marked build as failure
Not sending mail to unregistered user echauchot@gmail.com+jbonofre@apache.org
Not sending mail to unregistered user kirpichov@google.com

Build failed in Jenkins: beam_PostCommit_Python_Verify #3158

Posted by Apache Jenkins Server <je...@builds.apache.org>.
See <https://builds.apache.org/job/beam_PostCommit_Python_Verify/3158/display/redirect>

------------------------------------------
[...truncated 458.24 KB...]
test_type_check_valid_simple_type_arbitrary_length (apache_beam.typehints.typehints_test.TupleHintTestCase) ... ok
test_type_check_valid_simple_types (apache_beam.typehints.typehints_test.TupleHintTestCase) ... ok
test_getitem_duplicates_ignored (apache_beam.typehints.typehints_test.UnionHintTestCase) ... ok
test_getitem_must_be_valid_type_param (apache_beam.typehints.typehints_test.UnionHintTestCase) ... ok
test_getitem_must_be_valid_type_param_cant_be_object_instance (apache_beam.typehints.typehints_test.UnionHintTestCase) ... ok
test_getitem_nested_unions_flattened (apache_beam.typehints.typehints_test.UnionHintTestCase) ... ok
test_nested_compatibility (apache_beam.typehints.typehints_test.UnionHintTestCase) ... ok
test_union_hint_compatibility (apache_beam.typehints.typehints_test.UnionHintTestCase) ... ok
test_union_hint_enforcement_composite_type_in_union (apache_beam.typehints.typehints_test.UnionHintTestCase) ... ok
test_union_hint_enforcement_not_part_of_union (apache_beam.typehints.typehints_test.UnionHintTestCase) ... ok
test_union_hint_enforcement_part_of_union (apache_beam.typehints.typehints_test.UnionHintTestCase) ... ok
test_union_hint_repr (apache_beam.typehints.typehints_test.UnionHintTestCase) ... ok
test_deprecated_with_since_current (apache_beam.utils.annotations_test.AnnotationTests) ... ok
test_deprecated_with_since_current_message (apache_beam.utils.annotations_test.AnnotationTests) ... ok
test_deprecated_without_current (apache_beam.utils.annotations_test.AnnotationTests) ... ok
test_deprecated_without_since_should_fail (apache_beam.utils.annotations_test.AnnotationTests) ... ok
test_experimental_with_current (apache_beam.utils.annotations_test.AnnotationTests) ... ok
test_experimental_with_current_message (apache_beam.utils.annotations_test.AnnotationTests) ... ok
test_experimental_without_current (apache_beam.utils.annotations_test.AnnotationTests) ... ok
test_frequency (apache_beam.utils.annotations_test.AnnotationTests)
Tests that the filter 'once' is sufficient to print once per ... ok
test_equal_objects (apache_beam.utils.counters_test.CounterNameTest) ... ok
test_hash_two_objects (apache_beam.utils.counters_test.CounterNameTest) ... ok
test_method_forwarding_not_windows (apache_beam.utils.processes_test.Exec) ... ok
test_method_forwarding_windows (apache_beam.utils.processes_test.Exec) ... ok
test_call_two_objects (apache_beam.utils.retry_test.RetryStateTest) ... ok
test_single_failure (apache_beam.utils.retry_test.RetryStateTest) ... ok
test_two_failures (apache_beam.utils.retry_test.RetryStateTest) ... ok
test_log_calls_for_permanent_failure (apache_beam.utils.retry_test.RetryTest) ... ok
test_log_calls_for_transient_failure (apache_beam.utils.retry_test.RetryTest) ... ok
test_with_default_number_of_retries (apache_beam.utils.retry_test.RetryTest) ... ok
test_with_explicit_decorator (apache_beam.utils.retry_test.RetryTest) ... ok
test_with_explicit_initial_delay (apache_beam.utils.retry_test.RetryTest) ... ok
test_with_explicit_number_of_retries (apache_beam.utils.retry_test.RetryTest) ... ok
test_with_http_error_that_should_be_retried (apache_beam.utils.retry_test.RetryTest) ... SKIP: google-apitools is not installed
test_with_http_error_that_should_not_be_retried (apache_beam.utils.retry_test.RetryTest) ... SKIP: google-apitools is not installed
test_with_no_retry_decorator (apache_beam.utils.retry_test.RetryTest) ... ok
test_with_real_clock (apache_beam.utils.retry_test.RetryTest) ... ok
test_arithmetic (apache_beam.utils.timestamp_test.DurationTest) ... ok
test_of (apache_beam.utils.timestamp_test.DurationTest) ... ok
test_precision (apache_beam.utils.timestamp_test.DurationTest) ... ok
test_sort_order (apache_beam.utils.timestamp_test.DurationTest) ... ok
test_str (apache_beam.utils.timestamp_test.DurationTest) ... ok
test_arithmetic (apache_beam.utils.timestamp_test.TimestampTest) ... ok
test_of (apache_beam.utils.timestamp_test.TimestampTest) ... ok
test_precision (apache_beam.utils.timestamp_test.TimestampTest) ... ok
test_sort_order (apache_beam.utils.timestamp_test.TimestampTest) ... ok
test_str (apache_beam.utils.timestamp_test.TimestampTest) ... ok
test_utc_timestamp (apache_beam.utils.timestamp_test.TimestampTest) ... ok
test_equality (apache_beam.utils.windowed_value_test.WindowedValueTest) ... ok
test_hash (apache_beam.utils.windowed_value_test.WindowedValueTest) ... ok
test_pickle (apache_beam.utils.windowed_value_test.WindowedValueTest) ... ok
test_timestamps (apache_beam.utils.windowed_value_test.WindowedValueTest) ... ok
test_with_value (apache_beam.utils.windowed_value_test.WindowedValueTest) ... ok
test_retry_fork_graph (apache_beam.pipeline_test.DirectRunnerRetryTests) ... ok
test_element (apache_beam.pipeline_test.DoFnTest) ... ok
test_side_input_no_tag (apache_beam.pipeline_test.DoFnTest) ... ok
test_side_input_tagged (apache_beam.pipeline_test.DoFnTest) ... ok
test_timestamp_param (apache_beam.pipeline_test.DoFnTest) ... ok
test_window_param (apache_beam.pipeline_test.DoFnTest) ... ok
test_attribute_setting (apache_beam.pipeline_test.PipelineOptionsTest) ... ok
test_defaults (apache_beam.pipeline_test.PipelineOptionsTest) ... ok
test_dir (apache_beam.pipeline_test.PipelineOptionsTest) ... ok
test_flag_parsing (apache_beam.pipeline_test.PipelineOptionsTest) ... ok
test_keyword_parsing (apache_beam.pipeline_test.PipelineOptionsTest) ... ok
test_view_as (apache_beam.pipeline_test.PipelineOptionsTest) ... ok
test_aggregator_empty_input (apache_beam.pipeline_test.PipelineTest) ... ok
test_apply_custom_transform (apache_beam.pipeline_test.PipelineTest) ... ok
test_create (apache_beam.pipeline_test.PipelineTest) ... ok
test_create_singleton_pcollection (apache_beam.pipeline_test.PipelineTest) ... <https://builds.apache.org/job/beam_PostCommit_Python_Verify/ws/sdks/python/apache_beam/coders/typecoders.py>:134: UserWarning: Using fallback coder for typehint: List[int].
  warnings.warn('Using fallback coder for typehint: %r.' % typehint)
ok
test_flatmap_builtin (apache_beam.pipeline_test.PipelineTest) ... ok
test_memory_usage (apache_beam.pipeline_test.PipelineTest) ... ok
test_metrics_in_source (apache_beam.pipeline_test.PipelineTest) ... ok
test_pipeline_as_context (apache_beam.pipeline_test.PipelineTest) ... <https://builds.apache.org/job/beam_PostCommit_Python_Verify/ws/sdks/python/apache_beam/coders/typecoders.py>:134: UserWarning: Using fallback coder for typehint: <type 'exceptions.ValueError'>.
  warnings.warn('Using fallback coder for typehint: %r.' % typehint)
ok
test_ptransform_overrides (apache_beam.pipeline_test.PipelineTest) ... ok
test_read (apache_beam.pipeline_test.PipelineTest) ... ok
test_reuse_cloned_custom_transform_instance (apache_beam.pipeline_test.PipelineTest) ... ok
test_reuse_custom_transform_instance (apache_beam.pipeline_test.PipelineTest) ... <https://builds.apache.org/job/beam_PostCommit_Python_Verify/ws/sdks/python/apache_beam/pipeline_test.py>:210: DeprecationWarning: BaseException.message has been deprecated as of Python 2.6
  cm.exception.message,
ok
test_transform_no_super_init (apache_beam.pipeline_test.PipelineTest) ... ok
test_visit_entire_graph (apache_beam.pipeline_test.PipelineTest) ... ok
test_pickling (apache_beam.pipeline_test.RunnerApiTest) ... ok
test_simple (apache_beam.pipeline_test.RunnerApiTest)
Tests serializing, deserializing, and running a simple pipeline. ... ok
test_assingleton_multi_element (apache_beam.pvalue_test.PValueTest) ... ok
test_pvalue_expected_arguments (apache_beam.pvalue_test.PValueTest) ... ok
test_file_checksum_matchcer_invalid_sleep_time (apache_beam.testing.pipeline_verifiers_test.PipelineVerifiersTest) ... <https://builds.apache.org/job/beam_PostCommit_Python_Verify/ws/sdks/python/apache_beam/testing/pipeline_verifiers_test.py>:130: DeprecationWarning: BaseException.message has been deprecated as of Python 2.6
  self.assertEqual(cm.exception.message,
ok
test_file_checksum_matcher_read_failed (apache_beam.testing.pipeline_verifiers_test.PipelineVerifiersTest) ... ok
test_file_checksum_matcher_service_error (apache_beam.testing.pipeline_verifiers_test.PipelineVerifiersTest) ... SKIP: google-apitools is not installed
test_file_checksum_matcher_sleep_before_verify (apache_beam.testing.pipeline_verifiers_test.PipelineVerifiersTest) ... ok
test_file_checksum_matcher_success (apache_beam.testing.pipeline_verifiers_test.PipelineVerifiersTest) ... ok
test_pipeline_state_matcher_fails (apache_beam.testing.pipeline_verifiers_test.PipelineVerifiersTest)
Test PipelineStateMatcher fails when using default expected state ... ok
test_pipeline_state_matcher_given_state (apache_beam.testing.pipeline_verifiers_test.PipelineVerifiersTest)
Test PipelineStateMatcher successes when matches given state ... ok
test_pipeline_state_matcher_success (apache_beam.testing.pipeline_verifiers_test.PipelineVerifiersTest)
Test PipelineStateMatcher successes when using default expected state ... ok
test_append_extra_options (apache_beam.testing.test_pipeline_test.TestPipelineTest) ... ok
test_append_verifier_in_extra_opt (apache_beam.testing.test_pipeline_test.TestPipelineTest) ... ok
test_create_test_pipeline_options (apache_beam.testing.test_pipeline_test.TestPipelineTest) ... ok
test_empty_option_args_parsing (apache_beam.testing.test_pipeline_test.TestPipelineTest) ... ok
test_get_option (apache_beam.testing.test_pipeline_test.TestPipelineTest) ... ok
test_option_args_parsing (apache_beam.testing.test_pipeline_test.TestPipelineTest) ... ok
test_skip_IT (apache_beam.testing.test_pipeline_test.TestPipelineTest) ... SKIP: IT is skipped because --test-pipeline-options is not specified
test_basic_execution (apache_beam.testing.test_stream_test.TestStreamTest) ... ok
test_basic_test_stream (apache_beam.testing.test_stream_test.TestStreamTest) ... ok
test_gbk_execution (apache_beam.testing.test_stream_test.TestStreamTest) ... ok
test_test_stream_errors (apache_beam.testing.test_stream_test.TestStreamTest) ... ok
test_delete_files_fails_with_invalid_arg (apache_beam.testing.test_utils_test.TestUtilsTest) ... ok
test_delete_files_fails_with_io_error (apache_beam.testing.test_utils_test.TestUtilsTest) ... <https://builds.apache.org/job/beam_PostCommit_Python_Verify/ws/sdks/python/apache_beam/testing/test_utils_test.py>:52: DeprecationWarning: BaseException.message has been deprecated as of Python 2.6
  error.exception.message.startswith('Delete operation failed'))
ok
test_delete_files_succeeds (apache_beam.testing.test_utils_test.TestUtilsTest) ... ok
test_assert_that_fails (apache_beam.testing.util_test.UtilTest) ... ok
test_assert_that_fails_on_empty_expected (apache_beam.testing.util_test.UtilTest) ... ok
test_assert_that_fails_on_empty_input (apache_beam.testing.util_test.UtilTest) ... ok
test_assert_that_passes (apache_beam.testing.util_test.UtilTest) ... ok

----------------------------------------------------------------------
Ran 1317 tests in 146.547s

OK (skipped=258)
py27cython runtests: commands[9] | - find apache_beam -type f -name *.c -delete
py27cython runtests: commands[10] | - find apache_beam -type f -name *.so -delete
py27cython runtests: commands[11] | - find target/build -type f -name *.c -delete
/usr/bin/find: `target/build': No such file or directory
py27cython runtests: commands[12] | - find target/build -type f -name *.so -delete
/usr/bin/find: `target/build': No such file or directory
py27gcp create: <https://builds.apache.org/job/beam_PostCommit_Python_Verify/ws/sdks/python/target/.tox/py27gcp>
py27gcp installdeps: nose==1.3.7
py27gcp inst: <https://builds.apache.org/job/beam_PostCommit_Python_Verify/ws/sdks/python/target/.tox/dist/apache-beam-2.2.0.dev.zip>
py27gcp installed: apache-beam==2.2.0.dev0,avro==1.8.2,crcmod==1.7,dill==0.2.6,enum34==1.1.6,funcsigs==1.0.2,futures==3.1.1,grpcio==1.6.0,httplib2==0.9.2,mock==2.0.0,nose==1.3.7,oauth2client==3.0.0,pbr==3.1.1,protobuf==3.3.0,pyasn1==0.3.5,pyasn1-modules==0.1.4,PyYAML==3.12,rsa==3.4.2,six==1.11.0,typing==3.6.2
py27gcp runtests: PYTHONHASHSEED='2066288836'
py27gcp runtests: commands[0] | pip install -e .[test,gcp]
Obtaining file://<https://builds.apache.org/job/beam_PostCommit_Python_Verify/ws/sdks/python>
Requirement already satisfied: avro<2.0.0,>=1.8.1 in ./target/.tox/py27gcp/lib/python2.7/site-packages (from apache-beam==2.2.0.dev0)
Requirement already satisfied: crcmod<2.0,>=1.7 in ./target/.tox/py27gcp/lib/python2.7/site-packages (from apache-beam==2.2.0.dev0)
Requirement already satisfied: dill==0.2.6 in ./target/.tox/py27gcp/lib/python2.7/site-packages (from apache-beam==2.2.0.dev0)
Requirement already satisfied: grpcio<2.0,>=1.0 in ./target/.tox/py27gcp/lib/python2.7/site-packages (from apache-beam==2.2.0.dev0)
Requirement already satisfied: httplib2<0.10,>=0.8 in ./target/.tox/py27gcp/lib/python2.7/site-packages (from apache-beam==2.2.0.dev0)
Requirement already satisfied: mock<3.0.0,>=1.0.1 in ./target/.tox/py27gcp/lib/python2.7/site-packages (from apache-beam==2.2.0.dev0)
Requirement already satisfied: oauth2client<4.0.0,>=2.0.1 in ./target/.tox/py27gcp/lib/python2.7/site-packages (from apache-beam==2.2.0.dev0)
Requirement already satisfied: protobuf<=3.3.0,>=3.2.0 in ./target/.tox/py27gcp/lib/python2.7/site-packages (from apache-beam==2.2.0.dev0)
Requirement already satisfied: pyyaml<4.0.0,>=3.12 in ./target/.tox/py27gcp/lib/python2.7/site-packages (from apache-beam==2.2.0.dev0)
Requirement already satisfied: typing<3.7.0,>=3.6.0 in ./target/.tox/py27gcp/lib/python2.7/site-packages (from apache-beam==2.2.0.dev0)
Collecting google-apitools<=0.5.11,>=0.5.10 (from apache-beam==2.2.0.dev0)
<https://builds.apache.org/job/beam_PostCommit_Python_Verify/ws/sdks/python/target/.tox/py27gcp/local/lib/python2.7/site-packages/pip/_vendor/requests/packages/urllib3/util/ssl_.py>:318: SNIMissingWarning: An HTTPS request has been made, but the SNI (Subject Name Indication) extension to TLS is not available on this platform. This may cause the server to present an incorrect TLS certificate, which can cause validation failures. You can upgrade to a newer version of Python to solve this. For more information, see https://urllib3.readthedocs.io/en/latest/security.html#snimissingwarning.
  SNIMissingWarning
<https://builds.apache.org/job/beam_PostCommit_Python_Verify/ws/sdks/python/target/.tox/py27gcp/local/lib/python2.7/site-packages/pip/_vendor/requests/packages/urllib3/util/ssl_.py>:122: InsecurePlatformWarning: A true SSLContext object is not available. This prevents urllib3 from configuring SSL appropriately and may cause certain SSL connections to fail. You can upgrade to a newer version of Python to solve this. For more information, see https://urllib3.readthedocs.io/en/latest/security.html#insecureplatformwarning.
  InsecurePlatformWarning
  Using cached google_apitools-0.5.11-py2-none-any.whl
Collecting proto-google-cloud-datastore-v1<=0.90.4,>=0.90.0 (from apache-beam==2.2.0.dev0)
Collecting googledatastore==7.0.1 (from apache-beam==2.2.0.dev0)
Collecting google-cloud-pubsub==0.26.0 (from apache-beam==2.2.0.dev0)
  Using cached google_cloud_pubsub-0.26.0-py2.py3-none-any.whl
Collecting google-cloud-bigquery==0.25.0 (from apache-beam==2.2.0.dev0)
  Using cached google_cloud_bigquery-0.25.0-py2.py3-none-any.whl
Collecting pyhamcrest<2.0,>=1.9 (from apache-beam==2.2.0.dev0)
  Using cached PyHamcrest-1.9.0-py2.py3-none-any.whl
Requirement already satisfied: six>=1.9 in ./target/.tox/py27gcp/lib/python2.7/site-packages (from apache-beam==2.2.0.dev0)
Requirement already satisfied: futures>=2.2.0 in ./target/.tox/py27gcp/lib/python2.7/site-packages (from grpcio<2.0,>=1.0->apache-beam==2.2.0.dev0)
Requirement already satisfied: enum34>=1.0.4 in ./target/.tox/py27gcp/lib/python2.7/site-packages (from grpcio<2.0,>=1.0->apache-beam==2.2.0.dev0)
Requirement already satisfied: funcsigs>=1; python_version < "3.3" in ./target/.tox/py27gcp/lib/python2.7/site-packages (from mock<3.0.0,>=1.0.1->apache-beam==2.2.0.dev0)
Requirement already satisfied: pbr>=0.11 in ./target/.tox/py27gcp/lib/python2.7/site-packages (from mock<3.0.0,>=1.0.1->apache-beam==2.2.0.dev0)
Requirement already satisfied: rsa>=3.1.4 in ./target/.tox/py27gcp/lib/python2.7/site-packages (from oauth2client<4.0.0,>=2.0.1->apache-beam==2.2.0.dev0)
Requirement already satisfied: pyasn1-modules>=0.0.5 in ./target/.tox/py27gcp/lib/python2.7/site-packages (from oauth2client<4.0.0,>=2.0.1->apache-beam==2.2.0.dev0)
Requirement already satisfied: pyasn1>=0.1.7 in ./target/.tox/py27gcp/lib/python2.7/site-packages (from oauth2client<4.0.0,>=2.0.1->apache-beam==2.2.0.dev0)
Requirement already satisfied: setuptools in ./target/.tox/py27gcp/lib/python2.7/site-packages (from protobuf<=3.3.0,>=3.2.0->apache-beam==2.2.0.dev0)
Collecting googleapis-common-protos<2.0dev,>=1.5.2 (from proto-google-cloud-datastore-v1<=0.90.4,>=0.90.0->apache-beam==2.2.0.dev0)
Collecting google-cloud-core<0.26dev,>=0.25.0 (from google-cloud-pubsub==0.26.0->apache-beam==2.2.0.dev0)
  Using cached google_cloud_core-0.25.0-py2.py3-none-any.whl
Collecting gapic-google-cloud-pubsub-v1<0.16dev,>=0.15.0 (from google-cloud-pubsub==0.26.0->apache-beam==2.2.0.dev0)
Collecting google-auth-httplib2 (from google-cloud-core<0.26dev,>=0.25.0->google-cloud-pubsub==0.26.0->apache-beam==2.2.0.dev0)
  Using cached google_auth_httplib2-0.0.2-py2.py3-none-any.whl
Collecting google-auth<2.0.0dev,>=0.4.0 (from google-cloud-core<0.26dev,>=0.25.0->google-cloud-pubsub==0.26.0->apache-beam==2.2.0.dev0)
  Using cached google_auth-1.1.0-py2.py3-none-any.whl
Collecting grpc-google-iam-v1<0.12dev,>=0.11.1 (from gapic-google-cloud-pubsub-v1<0.16dev,>=0.15.0->google-cloud-pubsub==0.26.0->apache-beam==2.2.0.dev0)
Collecting google-gax<0.16dev,>=0.15.7 (from gapic-google-cloud-pubsub-v1<0.16dev,>=0.15.0->google-cloud-pubsub==0.26.0->apache-beam==2.2.0.dev0)
Collecting proto-google-cloud-pubsub-v1[grpc]<0.16dev,>=0.15.4 (from gapic-google-cloud-pubsub-v1<0.16dev,>=0.15.0->google-cloud-pubsub==0.26.0->apache-beam==2.2.0.dev0)
Collecting cachetools>=2.0.0 (from google-auth<2.0.0dev,>=0.4.0->google-cloud-core<0.26dev,>=0.25.0->google-cloud-pubsub==0.26.0->apache-beam==2.2.0.dev0)
  Using cached cachetools-2.0.1-py2.py3-none-any.whl
Collecting future<0.17dev,>=0.16.0 (from google-gax<0.16dev,>=0.15.7->gapic-google-cloud-pubsub-v1<0.16dev,>=0.15.0->google-cloud-pubsub==0.26.0->apache-beam==2.2.0.dev0)
Collecting ply==3.8 (from google-gax<0.16dev,>=0.15.7->gapic-google-cloud-pubsub-v1<0.16dev,>=0.15.0->google-cloud-pubsub==0.26.0->apache-beam==2.2.0.dev0)
Collecting requests<3.0dev,>=2.13.0 (from google-gax<0.16dev,>=0.15.7->gapic-google-cloud-pubsub-v1<0.16dev,>=0.15.0->google-cloud-pubsub==0.26.0->apache-beam==2.2.0.dev0)
  Using cached requests-2.18.4-py2.py3-none-any.whl
Collecting certifi>=2017.4.17 (from requests<3.0dev,>=2.13.0->google-gax<0.16dev,>=0.15.7->gapic-google-cloud-pubsub-v1<0.16dev,>=0.15.0->google-cloud-pubsub==0.26.0->apache-beam==2.2.0.dev0)
  Using cached certifi-2017.7.27.1-py2.py3-none-any.whl
Collecting urllib3<1.23,>=1.21.1 (from requests<3.0dev,>=2.13.0->google-gax<0.16dev,>=0.15.7->gapic-google-cloud-pubsub-v1<0.16dev,>=0.15.0->google-cloud-pubsub==0.26.0->apache-beam==2.2.0.dev0)
  Using cached urllib3-1.22-py2.py3-none-any.whl
Collecting idna<2.7,>=2.5 (from requests<3.0dev,>=2.13.0->google-gax<0.16dev,>=0.15.7->gapic-google-cloud-pubsub-v1<0.16dev,>=0.15.0->google-cloud-pubsub==0.26.0->apache-beam==2.2.0.dev0)
  Using cached idna-2.6-py2.py3-none-any.whl
Collecting chardet<3.1.0,>=3.0.2 (from requests<3.0dev,>=2.13.0->google-gax<0.16dev,>=0.15.7->gapic-google-cloud-pubsub-v1<0.16dev,>=0.15.0->google-cloud-pubsub==0.26.0->apache-beam==2.2.0.dev0)
  Using cached chardet-3.0.4-py2.py3-none-any.whl
Installing collected packages: google-apitools, googleapis-common-protos, proto-google-cloud-datastore-v1, googledatastore, cachetools, google-auth, google-auth-httplib2, google-cloud-core, grpc-google-iam-v1, future, ply, certifi, urllib3, idna, chardet, requests, google-gax, proto-google-cloud-pubsub-v1, gapic-google-cloud-pubsub-v1, google-cloud-pubsub, google-cloud-bigquery, pyhamcrest, apache-beam
  Found existing installation: apache-beam 2.2.0.dev0
    Uninstalling apache-beam-2.2.0.dev0:
      Successfully uninstalled apache-beam-2.2.0.dev0
  Running setup.py develop for apache-beam
Successfully installed apache-beam cachetools-2.0.1 certifi-2017.7.27.1 chardet-3.0.4 future-0.16.0 gapic-google-cloud-pubsub-v1-0.15.4 google-apitools-0.5.11 google-auth-1.1.0 google-auth-httplib2-0.0.2 google-cloud-bigquery-0.25.0 google-cloud-core-0.25.0 google-cloud-pubsub-0.26.0 google-gax-0.15.14 googleapis-common-protos-1.5.2 googledatastore-7.0.1 grpc-google-iam-v1-0.11.3 idna-2.6 ply-3.8 proto-google-cloud-datastore-v1-0.90.4 proto-google-cloud-pubsub-v1-0.15.4 pyhamcrest-1.9.0 requests-2.18.4 urllib3-1.22
py27gcp runtests: commands[1] | python --version
Python 2.7.6
py27gcp runtests: commands[2] | - find apache_beam -type f -name *.pyc -delete
py27gcp runtests: commands[3] | python apache_beam/examples/complete/autocomplete_test.py
Traceback (most recent call last):
  File "apache_beam/examples/complete/autocomplete_test.py", line 22, in <module>
    import apache_beam as beam
  File "<https://builds.apache.org/job/beam_PostCommit_Python_Verify/ws/sdks/python/apache_beam/__init__.py",> line 87, in <module>
    from apache_beam import io
  File "<https://builds.apache.org/job/beam_PostCommit_Python_Verify/ws/sdks/python/apache_beam/io/__init__.py",> line 21, in <module>
    from apache_beam.io.avroio import *
  File "<https://builds.apache.org/job/beam_PostCommit_Python_Verify/ws/sdks/python/apache_beam/io/avroio.py",> line 56, in <module>
    from apache_beam.io import filebasedsink
  File "<https://builds.apache.org/job/beam_PostCommit_Python_Verify/ws/sdks/python/apache_beam/io/filebasedsink.py",> line 32, in <module>
    from apache_beam.io.filesystems import FileSystems
  File "<https://builds.apache.org/job/beam_PostCommit_Python_Verify/ws/sdks/python/apache_beam/io/filesystems.py",> line 30, in <module>
    from apache_beam.io.gcp.gcsfilesystem import GCSFileSystem
  File "<https://builds.apache.org/job/beam_PostCommit_Python_Verify/ws/sdks/python/apache_beam/io/gcp/gcsfilesystem.py",> line 27, in <module>
    from apache_beam.io.gcp import gcsio
  File "<https://builds.apache.org/job/beam_PostCommit_Python_Verify/ws/sdks/python/apache_beam/io/gcp/gcsio.py",> line 37, in <module>
    from apache_beam.utils import retry
  File "<https://builds.apache.org/job/beam_PostCommit_Python_Verify/ws/sdks/python/apache_beam/utils/retry.py",> line 40, in <module>
    from apitools.base.py.exceptions import HttpError
  File "<https://builds.apache.org/job/beam_PostCommit_Python_Verify/ws/sdks/python/target/.tox/py27gcp/local/lib/python2.7/site-packages/apitools/base/py/__init__.py",> line 21, in <module>
    from apitools.base.py.base_api import *
  File "<https://builds.apache.org/job/beam_PostCommit_Python_Verify/ws/sdks/python/target/.tox/py27gcp/local/lib/python2.7/site-packages/apitools/base/py/base_api.py",> line 31, in <module>
    from apitools.base.protorpclite import message_types
  File "<https://builds.apache.org/job/beam_PostCommit_Python_Verify/ws/sdks/python/target/.tox/py27gcp/local/lib/python2.7/site-packages/apitools/base/protorpclite/message_types.py",> line 25, in <module>
    from apitools.base.protorpclite import messages
  File "<https://builds.apache.org/job/beam_PostCommit_Python_Verify/ws/sdks/python/target/.tox/py27gcp/local/lib/python2.7/site-packages/apitools/base/protorpclite/messages.py",> line 1165, in <module>
    class Field(six.with_metaclass(_FieldMeta, object)):
TypeError: Error when calling the metaclass bases
    metaclass conflict: the metaclass of a derived class must be a (non-strict) subclass of the metaclasses of all its bases
ERROR: InvocationError: '<https://builds.apache.org/job/beam_PostCommit_Python_Verify/ws/sdks/python/target/.tox/py27gcp/bin/python> apache_beam/examples/complete/autocomplete_test.py'
___________________________________ summary ____________________________________
ERROR:   docs: commands failed
  lint: commands succeeded
  py27: commands succeeded
  py27cython: commands succeeded
ERROR:   py27gcp: commands failed
Build step 'Execute shell' marked build as failure
Not sending mail to unregistered user echauchot@gmail.com+jbonofre@apache.org
Not sending mail to unregistered user kirpichov@google.com

Build failed in Jenkins: beam_PostCommit_Python_Verify #3157

Posted by Apache Jenkins Server <je...@builds.apache.org>.
See <https://builds.apache.org/job/beam_PostCommit_Python_Verify/3157/display/redirect?page=changes>

Changes:

[kirpichov] Speeds up CompressedSourceTest

------------------------------------------
[...truncated 44.06 KB...]
Requirement already satisfied: grpcio<2.0,>=1.0 in ./target/.tox/py27cython/lib/python2.7/site-packages (from apache-beam==2.2.0.dev0)
Collecting httplib2<0.10,>=0.8 (from apache-beam==2.2.0.dev0)
Collecting mock<3.0.0,>=1.0.1 (from apache-beam==2.2.0.dev0)
  Using cached mock-2.0.0-py2.py3-none-any.whl
Collecting oauth2client<4.0.0,>=2.0.1 (from apache-beam==2.2.0.dev0)
Collecting protobuf<=3.3.0,>=3.2.0 (from apache-beam==2.2.0.dev0)
  Using cached protobuf-3.3.0-cp27-cp27mu-manylinux1_x86_64.whl
Collecting pyyaml<4.0.0,>=3.12 (from apache-beam==2.2.0.dev0)
Collecting typing<3.7.0,>=3.6.0 (from apache-beam==2.2.0.dev0)
  Using cached typing-3.6.2-py2-none-any.whl
Requirement already satisfied: six>=1.5.2 in ./target/.tox/py27cython/lib/python2.7/site-packages (from grpcio<2.0,>=1.0->apache-beam==2.2.0.dev0)
Requirement already satisfied: enum34>=1.0.4 in ./target/.tox/py27cython/lib/python2.7/site-packages (from grpcio<2.0,>=1.0->apache-beam==2.2.0.dev0)
Requirement already satisfied: futures>=2.2.0 in ./target/.tox/py27cython/lib/python2.7/site-packages (from grpcio<2.0,>=1.0->apache-beam==2.2.0.dev0)
Collecting pbr>=0.11 (from mock<3.0.0,>=1.0.1->apache-beam==2.2.0.dev0)
  Using cached pbr-3.1.1-py2.py3-none-any.whl
Collecting funcsigs>=1; python_version < "3.3" (from mock<3.0.0,>=1.0.1->apache-beam==2.2.0.dev0)
  Using cached funcsigs-1.0.2-py2.py3-none-any.whl
Collecting pyasn1-modules>=0.0.5 (from oauth2client<4.0.0,>=2.0.1->apache-beam==2.2.0.dev0)
  Using cached pyasn1_modules-0.1.4-py2.py3-none-any.whl
Collecting pyasn1>=0.1.7 (from oauth2client<4.0.0,>=2.0.1->apache-beam==2.2.0.dev0)
  Using cached pyasn1-0.3.5-py2.py3-none-any.whl
Collecting rsa>=3.1.4 (from oauth2client<4.0.0,>=2.0.1->apache-beam==2.2.0.dev0)
  Using cached rsa-3.4.2-py2.py3-none-any.whl
Requirement already satisfied: setuptools in ./target/.tox/py27cython/lib/python2.7/site-packages (from protobuf<=3.3.0,>=3.2.0->apache-beam==2.2.0.dev0)
Building wheels for collected packages: apache-beam
  Running setup.py bdist_wheel for apache-beam: started
  Running setup.py bdist_wheel for apache-beam: finished with status 'error'
  Complete output from command <https://builds.apache.org/job/beam_PostCommit_Python_Verify/ws/sdks/python/target/.tox/py27cython/bin/python> -u -c "import setuptools, tokenize;__file__='/tmp/pip-FyVNon-build/setup.py';f=getattr(tokenize, 'open', open)(__file__);code=f.read().replace('\r\n', '\n');f.close();exec(compile(code, __file__, 'exec'))" bdist_wheel -d /tmp/tmpMlLeawpip-wheel- --python-tag cp27:
  <https://builds.apache.org/job/beam_PostCommit_Python_Verify/ws/sdks/python/target/.tox/py27cython/local/lib/python2.7/site-packages/setuptools/dist.py>:351: UserWarning: Normalizing '2.2.0.dev' to '2.2.0.dev0'
    normalized_version,
  running bdist_wheel
  running build
  running build_py
  Traceback (most recent call last):
    File "<string>", line 1, in <module>
    File "/tmp/pip-FyVNon-build/setup.py", line 198, in <module>
      'test': generate_protos_first(test),
    File "/usr/lib/python2.7/distutils/core.py", line 151, in setup
      dist.run_commands()
    File "/usr/lib/python2.7/distutils/dist.py", line 953, in run_commands
      self.run_command(cmd)
    File "/usr/lib/python2.7/distutils/dist.py", line 972, in run_command
      cmd_obj.run()
    File "<https://builds.apache.org/job/beam_PostCommit_Python_Verify/ws/sdks/python/target/.tox/py27cython/local/lib/python2.7/site-packages/wheel/bdist_wheel.py",> line 204, in run
      self.run_command('build')
    File "/usr/lib/python2.7/distutils/cmd.py", line 326, in run_command
      self.distribution.run_command(command)
    File "/usr/lib/python2.7/distutils/dist.py", line 972, in run_command
      cmd_obj.run()
    File "/usr/lib/python2.7/distutils/command/build.py", line 128, in run
      self.run_command(cmd_name)
    File "/usr/lib/python2.7/distutils/cmd.py", line 326, in run_command
      self.distribution.run_command(command)
    File "/usr/lib/python2.7/distutils/dist.py", line 972, in run_command
      cmd_obj.run()
    File "/tmp/pip-FyVNon-build/setup.py", line 138, in run
      gen_protos.generate_proto_files()
    File "gen_protos.py", line 65, in generate_proto_files
      'Not in apache git tree; unable to find proto definitions.')
  RuntimeError: Not in apache git tree; unable to find proto definitions.
  
  ----------------------------------------
  Failed building wheel for apache-beam
  Running setup.py clean for apache-beam
Failed to build apache-beam
Installing collected packages: avro, crcmod, dill, httplib2, pbr, funcsigs, mock, pyasn1, pyasn1-modules, rsa, oauth2client, protobuf, pyyaml, typing, apache-beam
  Found existing installation: protobuf 3.4.0
    Uninstalling protobuf-3.4.0:
      Successfully uninstalled protobuf-3.4.0
  Running setup.py install for apache-beam: started
    Running setup.py install for apache-beam: finished with status 'error'
    Complete output from command <https://builds.apache.org/job/beam_PostCommit_Python_Verify/ws/sdks/python/target/.tox/py27cython/bin/python> -u -c "import setuptools, tokenize;__file__='/tmp/pip-FyVNon-build/setup.py';f=getattr(tokenize, 'open', open)(__file__);code=f.read().replace('\r\n', '\n');f.close();exec(compile(code, __file__, 'exec'))" install --record /tmp/pip-vptXWK-record/install-record.txt --single-version-externally-managed --compile --install-headers <https://builds.apache.org/job/beam_PostCommit_Python_Verify/ws/sdks/python/target/.tox/py27cython/include/site/python2.7/apache-beam>:
    <https://builds.apache.org/job/beam_PostCommit_Python_Verify/ws/sdks/python/target/.tox/py27cython/local/lib/python2.7/site-packages/setuptools/dist.py>:351: UserWarning: Normalizing '2.2.0.dev' to '2.2.0.dev0'
      normalized_version,
    running install
    running build
    running build_py
    Traceback (most recent call last):
      File "<string>", line 1, in <module>
      File "/tmp/pip-FyVNon-build/setup.py", line 198, in <module>
        'test': generate_protos_first(test),
      File "/usr/lib/python2.7/distutils/core.py", line 151, in setup
        dist.run_commands()
      File "/usr/lib/python2.7/distutils/dist.py", line 953, in run_commands
        self.run_command(cmd)
      File "/usr/lib/python2.7/distutils/dist.py", line 972, in run_command
        cmd_obj.run()
      File "<https://builds.apache.org/job/beam_PostCommit_Python_Verify/ws/sdks/python/target/.tox/py27cython/local/lib/python2.7/site-packages/setuptools/command/install.py",> line 61, in run
        return orig.install.run(self)
      File "/usr/lib/python2.7/distutils/command/install.py", line 601, in run
        self.run_command('build')
      File "/usr/lib/python2.7/distutils/cmd.py", line 326, in run_command
        self.distribution.run_command(command)
      File "/usr/lib/python2.7/distutils/dist.py", line 972, in run_command
        cmd_obj.run()
      File "/usr/lib/python2.7/distutils/command/build.py", line 128, in run
        self.run_command(cmd_name)
      File "/usr/lib/python2.7/distutils/cmd.py", line 326, in run_command
        self.distribution.run_command(command)
      File "/usr/lib/python2.7/distutils/dist.py", line 972, in run_command
        cmd_obj.run()
      File "/tmp/pip-FyVNon-build/setup.py", line 138, in run
        gen_protos.generate_proto_files()
      File "gen_protos.py", line 65, in generate_proto_files
        'Not in apache git tree; unable to find proto definitions.')
    RuntimeError: Not in apache git tree; unable to find proto definitions.
    
    ----------------------------------------
Command "<https://builds.apache.org/job/beam_PostCommit_Python_Verify/ws/sdks/python/target/.tox/py27cython/bin/python> -u -c "import setuptools, tokenize;__file__='/tmp/pip-FyVNon-build/setup.py';f=getattr(tokenize, 'open', open)(__file__);code=f.read().replace('\r\n', '\n');f.close();exec(compile(code, __file__, 'exec'))" install --record /tmp/pip-vptXWK-record/install-record.txt --single-version-externally-managed --compile --install-headers <https://builds.apache.org/job/beam_PostCommit_Python_Verify/ws/sdks/python/target/.tox/py27cython/include/site/python2.7/apache-beam"> failed with error code 1 in /tmp/pip-FyVNon-build/

py27cython installed: avro==1.8.2,crcmod==1.7,Cython==0.25.2,dill==0.2.6,enum34==1.1.6,funcsigs==1.0.2,futures==3.1.1,grpcio==1.6.0,grpcio-tools==1.3.5,httplib2==0.9.2,mock==2.0.0,nose==1.3.7,oauth2client==3.0.0,pbr==3.1.1,protobuf==3.3.0,pyasn1==0.3.5,pyasn1-modules==0.1.4,PyYAML==3.12,rsa==3.4.2,six==1.11.0,typing==3.6.2
py27gcp create: <https://builds.apache.org/job/beam_PostCommit_Python_Verify/ws/sdks/python/target/.tox/py27gcp>
py27gcp installdeps: nose==1.3.7
py27gcp inst: <https://builds.apache.org/job/beam_PostCommit_Python_Verify/ws/sdks/python/target/.tox/dist/apache-beam-2.2.0.dev.zip>
ERROR: invocation failed (exit code 1), logfile: <https://builds.apache.org/job/beam_PostCommit_Python_Verify/ws/sdks/python/target/.tox/py27gcp/log/py27gcp-2.log>
ERROR: actionid: py27gcp
msg: installpkg
cmdargs: [local('<https://builds.apache.org/job/beam_PostCommit_Python_Verify/ws/sdks/python/target/.tox/py27gcp/bin/pip'),> 'install', '<https://builds.apache.org/job/beam_PostCommit_Python_Verify/ws/sdks/python/target/.tox/dist/apache-beam-2.2.0.dev.zip']>
env: {'JENKINS_HOME': '/x1/jenkins/jenkins-home', 'BUILD_CAUSE': 'SCMTRIGGER', 'GIT_COMMIT': 'fdd99650d4e92cbbc0121949c882e920cf9c89a7', 'HUDSON_URL': 'https://builds.apache.org/', 'BUILD_URL': 'https://builds.apache.org/job/beam_PostCommit_Python_Verify/3157/', 'GIT_PREVIOUS_COMMIT': '5ea2537eca0a006983d6ce36e2ad14f0b5f33115', 'BUILD_TAG': 'jenkins-beam_PostCommit_Python_Verify-3157', 'SSH_CLIENT': '62.210.60.235 55148 22', 'JENKINS_URL': 'https://builds.apache.org/', 'LOGNAME': 'jenkins', 'USER': 'jenkins', 'WORKSPACE': '<https://builds.apache.org/job/beam_PostCommit_Python_Verify/ws/',> 'HOME': '/home/jenkins', 'PATH': '<https://builds.apache.org/job/beam_PostCommit_Python_Verify/ws/sdks/python/target/.tox/py27gcp/bin>:/home/jenkins/tools/java/latest1.8/bin:/usr/local/sbin:/usr/local/bin:/usr/sbin:/usr/bin:/sbin:/bin:/usr/games:/usr/local/games', 'JOB_NAME': 'beam_PostCommit_Python_Verify', 'LANG': 'en_US.UTF-8', 'RUN_DISPLAY_URL': 'https://builds.apache.org/job/beam_PostCommit_Python_Verify/3157/display/redirect', 'VIRTUAL_ENV': '<https://builds.apache.org/job/beam_PostCommit_Python_Verify/ws/sdks/python/target/.tox/py27gcp',> 'SHELL': '/bin/bash', 'GIT_PREVIOUS_SUCCESSFUL_COMMIT': 'bd0facc469b2312dd7ca2e2a7161c5562cd58b36', 'SHLVL': '3', 'NLSPATH': '/usr/dt/lib/nls/msg/%L/%N.cat', 'GIT_AUTHOR_EMAIL': 'builds@apache.org', 'HUDSON_HOME': '/x1/jenkins/jenkins-home', 'NODE_LABELS': 'beam beam3', 'GIT_COMMITTER_EMAIL': 'builds@apache.org', 'PYTHONHASHSEED': '732449384', 'JAVA_HOME': '/home/jenkins/tools/java/latest1.8', 'ROOT_BUILD_CAUSE': 'SCMTRIGGER', 'BUILD_ID': '3157', 'BUILD_NUMBER': '3157', 'XDG_RUNTIME_DIR': '/run/user/9997', 'HUDSON_COOKIE': '60a46e79-570f-439c-8a47-1648de74123e', 'JOB_URL': 'https://builds.apache.org/job/beam_PostCommit_Python_Verify/', 'TEST_HOST': 'beam3', 'GIT_BRANCH': 'origin/master', 'JOB_BASE_NAME': 'beam_PostCommit_Python_Verify', 'GIT_AUTHOR_NAME': 'jenkins', 'GIT_COMMITTER_NAME': 'jenkins', 'XDG_SESSION_ID': '122', '_': '/home/jenkins/.local/bin//tox', 'sha1': 'master', 'COVERALLS_REPO_TOKEN': '****', 'JOB_DISPLAY_URL': 'https://builds.apache.org/job/beam_PostCommit_Python_Verify/display/redirect', 'BUILD_CAUSE_SCMTRIGGER': 'true', 'HUDSON_SERVER_COOKIE': 'f4ebd1e6b0d976e8', 'EXECUTOR_NUMBER': '1', 'NODE_NAME': 'beam3', 'PWD': '<https://builds.apache.org/job/beam_PostCommit_Python_Verify/ws/',> 'SPARK_LOCAL_IP': '127.0.0.1', 'JENKINS_SERVER_COOKIE': 'f4ebd1e6b0d976e8', 'BUILD_DISPLAY_NAME': '#3157', 'ROOT_BUILD_CAUSE_SCMTRIGGER': 'true', 'XFILESEARCHPATH': '/usr/dt/app-defaults/%L/Dt', 'MAIL': '/var/mail/jenkins', 'SSH_CONNECTION': '62.210.60.235 55148 10.128.0.4 22', 'RUN_CHANGES_DISPLAY_URL': 'https://builds.apache.org/job/beam_PostCommit_Python_Verify/3157/display/redirect?page=changes', 'GIT_URL': 'https://github.com/apache/beam.git'}

Processing ./target/.tox/dist/apache-beam-2.2.0.dev.zip
Collecting avro<2.0.0,>=1.8.1 (from apache-beam==2.2.0.dev0)
Collecting crcmod<2.0,>=1.7 (from apache-beam==2.2.0.dev0)
Collecting dill==0.2.6 (from apache-beam==2.2.0.dev0)
Collecting grpcio<2.0,>=1.0 (from apache-beam==2.2.0.dev0)
  Using cached grpcio-1.6.0-cp27-cp27mu-manylinux1_x86_64.whl
Collecting httplib2<0.10,>=0.8 (from apache-beam==2.2.0.dev0)
Collecting mock<3.0.0,>=1.0.1 (from apache-beam==2.2.0.dev0)
  Using cached mock-2.0.0-py2.py3-none-any.whl
Collecting oauth2client<4.0.0,>=2.0.1 (from apache-beam==2.2.0.dev0)
Collecting protobuf<=3.3.0,>=3.2.0 (from apache-beam==2.2.0.dev0)
  Using cached protobuf-3.3.0-cp27-cp27mu-manylinux1_x86_64.whl
Collecting pyyaml<4.0.0,>=3.12 (from apache-beam==2.2.0.dev0)
Collecting typing<3.7.0,>=3.6.0 (from apache-beam==2.2.0.dev0)
  Using cached typing-3.6.2-py2-none-any.whl
Collecting six>=1.5.2 (from grpcio<2.0,>=1.0->apache-beam==2.2.0.dev0)
  Using cached six-1.11.0-py2.py3-none-any.whl
Collecting enum34>=1.0.4 (from grpcio<2.0,>=1.0->apache-beam==2.2.0.dev0)
  Using cached enum34-1.1.6-py2-none-any.whl
Collecting futures>=2.2.0 (from grpcio<2.0,>=1.0->apache-beam==2.2.0.dev0)
  Using cached futures-3.1.1-py2-none-any.whl
Collecting pbr>=0.11 (from mock<3.0.0,>=1.0.1->apache-beam==2.2.0.dev0)
  Using cached pbr-3.1.1-py2.py3-none-any.whl
Collecting funcsigs>=1; python_version < "3.3" (from mock<3.0.0,>=1.0.1->apache-beam==2.2.0.dev0)
  Using cached funcsigs-1.0.2-py2.py3-none-any.whl
Collecting pyasn1-modules>=0.0.5 (from oauth2client<4.0.0,>=2.0.1->apache-beam==2.2.0.dev0)
  Using cached pyasn1_modules-0.1.4-py2.py3-none-any.whl
Collecting pyasn1>=0.1.7 (from oauth2client<4.0.0,>=2.0.1->apache-beam==2.2.0.dev0)
  Using cached pyasn1-0.3.5-py2.py3-none-any.whl
Collecting rsa>=3.1.4 (from oauth2client<4.0.0,>=2.0.1->apache-beam==2.2.0.dev0)
  Using cached rsa-3.4.2-py2.py3-none-any.whl
Requirement already satisfied: setuptools in ./target/.tox/py27gcp/lib/python2.7/site-packages (from protobuf<=3.3.0,>=3.2.0->apache-beam==2.2.0.dev0)
Building wheels for collected packages: apache-beam
  Running setup.py bdist_wheel for apache-beam: started
  Running setup.py bdist_wheel for apache-beam: finished with status 'error'
  Complete output from command <https://builds.apache.org/job/beam_PostCommit_Python_Verify/ws/sdks/python/target/.tox/py27gcp/bin/python> -u -c "import setuptools, tokenize;__file__='/tmp/pip-D2Qvkr-build/setup.py';f=getattr(tokenize, 'open', open)(__file__);code=f.read().replace('\r\n', '\n');f.close();exec(compile(code, __file__, 'exec'))" bdist_wheel -d /tmp/tmpEH66PApip-wheel- --python-tag cp27:
  <https://builds.apache.org/job/beam_PostCommit_Python_Verify/ws/sdks/python/target/.tox/py27gcp/local/lib/python2.7/site-packages/setuptools/dist.py>:351: UserWarning: Normalizing '2.2.0.dev' to '2.2.0.dev0'
    normalized_version,
  running bdist_wheel
  running build
  running build_py
  gen_protos.py:46: UserWarning: Installing grpcio-tools is recommended for development.
    warnings.warn('Installing grpcio-tools is recommended for development.')
  Traceback (most recent call last):
    File "<string>", line 1, in <module>
    File "/tmp/pip-D2Qvkr-build/setup.py", line 198, in <module>
      'test': generate_protos_first(test),
    File "/usr/lib/python2.7/distutils/core.py", line 151, in setup
      dist.run_commands()
    File "/usr/lib/python2.7/distutils/dist.py", line 953, in run_commands
      self.run_command(cmd)
    File "/usr/lib/python2.7/distutils/dist.py", line 972, in run_command
      cmd_obj.run()
    File "<https://builds.apache.org/job/beam_PostCommit_Python_Verify/ws/sdks/python/target/.tox/py27gcp/local/lib/python2.7/site-packages/wheel/bdist_wheel.py",> line 204, in run
      self.run_command('build')
    File "/usr/lib/python2.7/distutils/cmd.py", line 326, in run_command
      self.distribution.run_command(command)
    File "/usr/lib/python2.7/distutils/dist.py", line 972, in run_command
      cmd_obj.run()
    File "/usr/lib/python2.7/distutils/command/build.py", line 128, in run
      self.run_command(cmd_name)
    File "/usr/lib/python2.7/distutils/cmd.py", line 326, in run_command
      self.distribution.run_command(command)
    File "/usr/lib/python2.7/distutils/dist.py", line 972, in run_command
      cmd_obj.run()
    File "/tmp/pip-D2Qvkr-build/setup.py", line 138, in run
      gen_protos.generate_proto_files()
    File "gen_protos.py", line 65, in generate_proto_files
      'Not in apache git tree; unable to find proto definitions.')
  RuntimeError: Not in apache git tree; unable to find proto definitions.
  
  ----------------------------------------
  Failed building wheel for apache-beam
  Running setup.py clean for apache-beam
Failed to build apache-beam
Installing collected packages: avro, crcmod, dill, six, enum34, protobuf, futures, grpcio, httplib2, pbr, funcsigs, mock, pyasn1, pyasn1-modules, rsa, oauth2client, pyyaml, typing, apache-beam
  Running setup.py install for apache-beam: started
    Running setup.py install for apache-beam: finished with status 'error'
    Complete output from command <https://builds.apache.org/job/beam_PostCommit_Python_Verify/ws/sdks/python/target/.tox/py27gcp/bin/python> -u -c "import setuptools, tokenize;__file__='/tmp/pip-D2Qvkr-build/setup.py';f=getattr(tokenize, 'open', open)(__file__);code=f.read().replace('\r\n', '\n');f.close();exec(compile(code, __file__, 'exec'))" install --record /tmp/pip-xwNbRc-record/install-record.txt --single-version-externally-managed --compile --install-headers <https://builds.apache.org/job/beam_PostCommit_Python_Verify/ws/sdks/python/target/.tox/py27gcp/include/site/python2.7/apache-beam>:
    <https://builds.apache.org/job/beam_PostCommit_Python_Verify/ws/sdks/python/target/.tox/py27gcp/local/lib/python2.7/site-packages/setuptools/dist.py>:351: UserWarning: Normalizing '2.2.0.dev' to '2.2.0.dev0'
      normalized_version,
    running install
    running build
    running build_py
    gen_protos.py:46: UserWarning: Installing grpcio-tools is recommended for development.
      warnings.warn('Installing grpcio-tools is recommended for development.')
    Traceback (most recent call last):
      File "<string>", line 1, in <module>
      File "/tmp/pip-D2Qvkr-build/setup.py", line 198, in <module>
        'test': generate_protos_first(test),
      File "/usr/lib/python2.7/distutils/core.py", line 151, in setup
        dist.run_commands()
      File "/usr/lib/python2.7/distutils/dist.py", line 953, in run_commands
        self.run_command(cmd)
      File "/usr/lib/python2.7/distutils/dist.py", line 972, in run_command
        cmd_obj.run()
      File "<https://builds.apache.org/job/beam_PostCommit_Python_Verify/ws/sdks/python/target/.tox/py27gcp/local/lib/python2.7/site-packages/setuptools/command/install.py",> line 61, in run
        return orig.install.run(self)
      File "/usr/lib/python2.7/distutils/command/install.py", line 601, in run
        self.run_command('build')
      File "/usr/lib/python2.7/distutils/cmd.py", line 326, in run_command
        self.distribution.run_command(command)
      File "/usr/lib/python2.7/distutils/dist.py", line 972, in run_command
        cmd_obj.run()
      File "/usr/lib/python2.7/distutils/command/build.py", line 128, in run
        self.run_command(cmd_name)
      File "/usr/lib/python2.7/distutils/cmd.py", line 326, in run_command
        self.distribution.run_command(command)
      File "/usr/lib/python2.7/distutils/dist.py", line 972, in run_command
        cmd_obj.run()
      File "/tmp/pip-D2Qvkr-build/setup.py", line 138, in run
        gen_protos.generate_proto_files()
      File "gen_protos.py", line 65, in generate_proto_files
        'Not in apache git tree; unable to find proto definitions.')
    RuntimeError: Not in apache git tree; unable to find proto definitions.
    
    ----------------------------------------
Command "<https://builds.apache.org/job/beam_PostCommit_Python_Verify/ws/sdks/python/target/.tox/py27gcp/bin/python> -u -c "import setuptools, tokenize;__file__='/tmp/pip-D2Qvkr-build/setup.py';f=getattr(tokenize, 'open', open)(__file__);code=f.read().replace('\r\n', '\n');f.close();exec(compile(code, __file__, 'exec'))" install --record /tmp/pip-xwNbRc-record/install-record.txt --single-version-externally-managed --compile --install-headers <https://builds.apache.org/job/beam_PostCommit_Python_Verify/ws/sdks/python/target/.tox/py27gcp/include/site/python2.7/apache-beam"> failed with error code 1 in /tmp/pip-D2Qvkr-build/

py27gcp installed: avro==1.8.2,crcmod==1.7,dill==0.2.6,enum34==1.1.6,funcsigs==1.0.2,futures==3.1.1,grpcio==1.6.0,httplib2==0.9.2,mock==2.0.0,nose==1.3.7,oauth2client==3.0.0,pbr==3.1.1,protobuf==3.3.0,pyasn1==0.3.5,pyasn1-modules==0.1.4,PyYAML==3.12,rsa==3.4.2,six==1.11.0,typing==3.6.2
___________________________________ summary ____________________________________
ERROR:   docs: InvocationError: <https://builds.apache.org/job/beam_PostCommit_Python_Verify/ws/sdks/python/target/.tox/docs/bin/pip> install <https://builds.apache.org/job/beam_PostCommit_Python_Verify/ws/sdks/python/target/.tox/dist/apache-beam-2.2.0.dev.zip> (see <https://builds.apache.org/job/beam_PostCommit_Python_Verify/ws/sdks/python/target/.tox/docs/log/docs-2.log)>
ERROR:   lint: InvocationError: <https://builds.apache.org/job/beam_PostCommit_Python_Verify/ws/sdks/python/target/.tox/lint/bin/pip> install <https://builds.apache.org/job/beam_PostCommit_Python_Verify/ws/sdks/python/target/.tox/dist/apache-beam-2.2.0.dev.zip> (see <https://builds.apache.org/job/beam_PostCommit_Python_Verify/ws/sdks/python/target/.tox/lint/log/lint-2.log)>
ERROR:   py27: InvocationError: <https://builds.apache.org/job/beam_PostCommit_Python_Verify/ws/sdks/python/target/.tox/py27/bin/pip> install <https://builds.apache.org/job/beam_PostCommit_Python_Verify/ws/sdks/python/target/.tox/dist/apache-beam-2.2.0.dev.zip> (see <https://builds.apache.org/job/beam_PostCommit_Python_Verify/ws/sdks/python/target/.tox/py27/log/py27-2.log)>
ERROR:   py27cython: InvocationError: <https://builds.apache.org/job/beam_PostCommit_Python_Verify/ws/sdks/python/target/.tox/py27cython/bin/pip> install <https://builds.apache.org/job/beam_PostCommit_Python_Verify/ws/sdks/python/target/.tox/dist/apache-beam-2.2.0.dev.zip> (see <https://builds.apache.org/job/beam_PostCommit_Python_Verify/ws/sdks/python/target/.tox/py27cython/log/py27cython-2.log)>
ERROR:   py27gcp: InvocationError: <https://builds.apache.org/job/beam_PostCommit_Python_Verify/ws/sdks/python/target/.tox/py27gcp/bin/pip> install <https://builds.apache.org/job/beam_PostCommit_Python_Verify/ws/sdks/python/target/.tox/dist/apache-beam-2.2.0.dev.zip> (see <https://builds.apache.org/job/beam_PostCommit_Python_Verify/ws/sdks/python/target/.tox/py27gcp/log/py27gcp-2.log)>
Build step 'Execute shell' marked build as failure
Not sending mail to unregistered user echauchot@gmail.com+jbonofre@apache.org
Not sending mail to unregistered user kirpichov@google.com

Build failed in Jenkins: beam_PostCommit_Python_Verify #3156

Posted by Apache Jenkins Server <je...@builds.apache.org>.
See <https://builds.apache.org/job/beam_PostCommit_Python_Verify/3156/display/redirect>

------------------------------------------
[...truncated 44.00 KB...]
Collecting dill==0.2.6 (from apache-beam==2.2.0.dev0)
Requirement already satisfied: grpcio<2.0,>=1.0 in ./target/.tox/py27cython/lib/python2.7/site-packages (from apache-beam==2.2.0.dev0)
Collecting httplib2<0.10,>=0.8 (from apache-beam==2.2.0.dev0)
Collecting mock<3.0.0,>=1.0.1 (from apache-beam==2.2.0.dev0)
  Using cached mock-2.0.0-py2.py3-none-any.whl
Collecting oauth2client<4.0.0,>=2.0.1 (from apache-beam==2.2.0.dev0)
Collecting protobuf<=3.3.0,>=3.2.0 (from apache-beam==2.2.0.dev0)
  Using cached protobuf-3.3.0-cp27-cp27mu-manylinux1_x86_64.whl
Collecting pyyaml<4.0.0,>=3.12 (from apache-beam==2.2.0.dev0)
Collecting typing<3.7.0,>=3.6.0 (from apache-beam==2.2.0.dev0)
  Using cached typing-3.6.2-py2-none-any.whl
Requirement already satisfied: futures>=2.2.0 in ./target/.tox/py27cython/lib/python2.7/site-packages (from grpcio<2.0,>=1.0->apache-beam==2.2.0.dev0)
Requirement already satisfied: six>=1.5.2 in ./target/.tox/py27cython/lib/python2.7/site-packages (from grpcio<2.0,>=1.0->apache-beam==2.2.0.dev0)
Requirement already satisfied: enum34>=1.0.4 in ./target/.tox/py27cython/lib/python2.7/site-packages (from grpcio<2.0,>=1.0->apache-beam==2.2.0.dev0)
Collecting pbr>=0.11 (from mock<3.0.0,>=1.0.1->apache-beam==2.2.0.dev0)
  Using cached pbr-3.1.1-py2.py3-none-any.whl
Collecting funcsigs>=1; python_version < "3.3" (from mock<3.0.0,>=1.0.1->apache-beam==2.2.0.dev0)
  Using cached funcsigs-1.0.2-py2.py3-none-any.whl
Collecting pyasn1-modules>=0.0.5 (from oauth2client<4.0.0,>=2.0.1->apache-beam==2.2.0.dev0)
  Using cached pyasn1_modules-0.1.4-py2.py3-none-any.whl
Collecting pyasn1>=0.1.7 (from oauth2client<4.0.0,>=2.0.1->apache-beam==2.2.0.dev0)
  Using cached pyasn1-0.3.5-py2.py3-none-any.whl
Collecting rsa>=3.1.4 (from oauth2client<4.0.0,>=2.0.1->apache-beam==2.2.0.dev0)
  Using cached rsa-3.4.2-py2.py3-none-any.whl
Requirement already satisfied: setuptools in ./target/.tox/py27cython/lib/python2.7/site-packages (from protobuf<=3.3.0,>=3.2.0->apache-beam==2.2.0.dev0)
Building wheels for collected packages: apache-beam
  Running setup.py bdist_wheel for apache-beam: started
  Running setup.py bdist_wheel for apache-beam: finished with status 'error'
  Complete output from command <https://builds.apache.org/job/beam_PostCommit_Python_Verify/ws/sdks/python/target/.tox/py27cython/bin/python> -u -c "import setuptools, tokenize;__file__='/tmp/pip-BaeMMJ-build/setup.py';f=getattr(tokenize, 'open', open)(__file__);code=f.read().replace('\r\n', '\n');f.close();exec(compile(code, __file__, 'exec'))" bdist_wheel -d /tmp/tmpntipMCpip-wheel- --python-tag cp27:
  <https://builds.apache.org/job/beam_PostCommit_Python_Verify/ws/sdks/python/target/.tox/py27cython/local/lib/python2.7/site-packages/setuptools/dist.py>:351: UserWarning: Normalizing '2.2.0.dev' to '2.2.0.dev0'
    normalized_version,
  running bdist_wheel
  running build
  running build_py
  Traceback (most recent call last):
    File "<string>", line 1, in <module>
    File "/tmp/pip-BaeMMJ-build/setup.py", line 198, in <module>
      'test': generate_protos_first(test),
    File "/usr/lib/python2.7/distutils/core.py", line 151, in setup
      dist.run_commands()
    File "/usr/lib/python2.7/distutils/dist.py", line 953, in run_commands
      self.run_command(cmd)
    File "/usr/lib/python2.7/distutils/dist.py", line 972, in run_command
      cmd_obj.run()
    File "<https://builds.apache.org/job/beam_PostCommit_Python_Verify/ws/sdks/python/target/.tox/py27cython/local/lib/python2.7/site-packages/wheel/bdist_wheel.py",> line 204, in run
      self.run_command('build')
    File "/usr/lib/python2.7/distutils/cmd.py", line 326, in run_command
      self.distribution.run_command(command)
    File "/usr/lib/python2.7/distutils/dist.py", line 972, in run_command
      cmd_obj.run()
    File "/usr/lib/python2.7/distutils/command/build.py", line 128, in run
      self.run_command(cmd_name)
    File "/usr/lib/python2.7/distutils/cmd.py", line 326, in run_command
      self.distribution.run_command(command)
    File "/usr/lib/python2.7/distutils/dist.py", line 972, in run_command
      cmd_obj.run()
    File "/tmp/pip-BaeMMJ-build/setup.py", line 138, in run
      gen_protos.generate_proto_files()
    File "gen_protos.py", line 65, in generate_proto_files
      'Not in apache git tree; unable to find proto definitions.')
  RuntimeError: Not in apache git tree; unable to find proto definitions.
  
  ----------------------------------------
  Failed building wheel for apache-beam
  Running setup.py clean for apache-beam
Failed to build apache-beam
Installing collected packages: avro, crcmod, dill, httplib2, pbr, funcsigs, mock, pyasn1, pyasn1-modules, rsa, oauth2client, protobuf, pyyaml, typing, apache-beam
  Found existing installation: protobuf 3.4.0
    Uninstalling protobuf-3.4.0:
      Successfully uninstalled protobuf-3.4.0
  Running setup.py install for apache-beam: started
    Running setup.py install for apache-beam: finished with status 'error'
    Complete output from command <https://builds.apache.org/job/beam_PostCommit_Python_Verify/ws/sdks/python/target/.tox/py27cython/bin/python> -u -c "import setuptools, tokenize;__file__='/tmp/pip-BaeMMJ-build/setup.py';f=getattr(tokenize, 'open', open)(__file__);code=f.read().replace('\r\n', '\n');f.close();exec(compile(code, __file__, 'exec'))" install --record /tmp/pip-0A98K7-record/install-record.txt --single-version-externally-managed --compile --install-headers <https://builds.apache.org/job/beam_PostCommit_Python_Verify/ws/sdks/python/target/.tox/py27cython/include/site/python2.7/apache-beam>:
    <https://builds.apache.org/job/beam_PostCommit_Python_Verify/ws/sdks/python/target/.tox/py27cython/local/lib/python2.7/site-packages/setuptools/dist.py>:351: UserWarning: Normalizing '2.2.0.dev' to '2.2.0.dev0'
      normalized_version,
    running install
    running build
    running build_py
    Traceback (most recent call last):
      File "<string>", line 1, in <module>
      File "/tmp/pip-BaeMMJ-build/setup.py", line 198, in <module>
        'test': generate_protos_first(test),
      File "/usr/lib/python2.7/distutils/core.py", line 151, in setup
        dist.run_commands()
      File "/usr/lib/python2.7/distutils/dist.py", line 953, in run_commands
        self.run_command(cmd)
      File "/usr/lib/python2.7/distutils/dist.py", line 972, in run_command
        cmd_obj.run()
      File "<https://builds.apache.org/job/beam_PostCommit_Python_Verify/ws/sdks/python/target/.tox/py27cython/local/lib/python2.7/site-packages/setuptools/command/install.py",> line 61, in run
        return orig.install.run(self)
      File "/usr/lib/python2.7/distutils/command/install.py", line 601, in run
        self.run_command('build')
      File "/usr/lib/python2.7/distutils/cmd.py", line 326, in run_command
        self.distribution.run_command(command)
      File "/usr/lib/python2.7/distutils/dist.py", line 972, in run_command
        cmd_obj.run()
      File "/usr/lib/python2.7/distutils/command/build.py", line 128, in run
        self.run_command(cmd_name)
      File "/usr/lib/python2.7/distutils/cmd.py", line 326, in run_command
        self.distribution.run_command(command)
      File "/usr/lib/python2.7/distutils/dist.py", line 972, in run_command
        cmd_obj.run()
      File "/tmp/pip-BaeMMJ-build/setup.py", line 138, in run
        gen_protos.generate_proto_files()
      File "gen_protos.py", line 65, in generate_proto_files
        'Not in apache git tree; unable to find proto definitions.')
    RuntimeError: Not in apache git tree; unable to find proto definitions.
    
    ----------------------------------------
Command "<https://builds.apache.org/job/beam_PostCommit_Python_Verify/ws/sdks/python/target/.tox/py27cython/bin/python> -u -c "import setuptools, tokenize;__file__='/tmp/pip-BaeMMJ-build/setup.py';f=getattr(tokenize, 'open', open)(__file__);code=f.read().replace('\r\n', '\n');f.close();exec(compile(code, __file__, 'exec'))" install --record /tmp/pip-0A98K7-record/install-record.txt --single-version-externally-managed --compile --install-headers <https://builds.apache.org/job/beam_PostCommit_Python_Verify/ws/sdks/python/target/.tox/py27cython/include/site/python2.7/apache-beam"> failed with error code 1 in /tmp/pip-BaeMMJ-build/

py27cython installed: avro==1.8.2,crcmod==1.7,Cython==0.25.2,dill==0.2.6,enum34==1.1.6,funcsigs==1.0.2,futures==3.1.1,grpcio==1.6.0,grpcio-tools==1.3.5,httplib2==0.9.2,mock==2.0.0,nose==1.3.7,oauth2client==3.0.0,pbr==3.1.1,protobuf==3.3.0,pyasn1==0.3.5,pyasn1-modules==0.1.4,PyYAML==3.12,rsa==3.4.2,six==1.11.0,typing==3.6.2
py27gcp create: <https://builds.apache.org/job/beam_PostCommit_Python_Verify/ws/sdks/python/target/.tox/py27gcp>
py27gcp installdeps: nose==1.3.7
py27gcp inst: <https://builds.apache.org/job/beam_PostCommit_Python_Verify/ws/sdks/python/target/.tox/dist/apache-beam-2.2.0.dev.zip>
ERROR: invocation failed (exit code 1), logfile: <https://builds.apache.org/job/beam_PostCommit_Python_Verify/ws/sdks/python/target/.tox/py27gcp/log/py27gcp-2.log>
ERROR: actionid: py27gcp
msg: installpkg
cmdargs: [local('<https://builds.apache.org/job/beam_PostCommit_Python_Verify/ws/sdks/python/target/.tox/py27gcp/bin/pip'),> 'install', '<https://builds.apache.org/job/beam_PostCommit_Python_Verify/ws/sdks/python/target/.tox/dist/apache-beam-2.2.0.dev.zip']>
env: {'JENKINS_HOME': '/x1/jenkins/jenkins-home', 'BUILD_CAUSE': 'TIMERTRIGGER', 'GIT_COMMIT': '5ea2537eca0a006983d6ce36e2ad14f0b5f33115', 'HUDSON_URL': 'https://builds.apache.org/', 'BUILD_URL': 'https://builds.apache.org/job/beam_PostCommit_Python_Verify/3156/', 'GIT_PREVIOUS_COMMIT': '5ea2537eca0a006983d6ce36e2ad14f0b5f33115', 'BUILD_TAG': 'jenkins-beam_PostCommit_Python_Verify-3156', 'SSH_CLIENT': '62.210.60.235 55148 22', 'JENKINS_URL': 'https://builds.apache.org/', 'LOGNAME': 'jenkins', 'USER': 'jenkins', 'WORKSPACE': '<https://builds.apache.org/job/beam_PostCommit_Python_Verify/ws/',> 'HOME': '/home/jenkins', 'PATH': '<https://builds.apache.org/job/beam_PostCommit_Python_Verify/ws/sdks/python/target/.tox/py27gcp/bin>:/home/jenkins/tools/java/latest1.8/bin:/usr/local/sbin:/usr/local/bin:/usr/sbin:/usr/bin:/sbin:/bin:/usr/games:/usr/local/games', 'JOB_NAME': 'beam_PostCommit_Python_Verify', 'LANG': 'en_US.UTF-8', 'RUN_DISPLAY_URL': 'https://builds.apache.org/job/beam_PostCommit_Python_Verify/3156/display/redirect', 'VIRTUAL_ENV': '<https://builds.apache.org/job/beam_PostCommit_Python_Verify/ws/sdks/python/target/.tox/py27gcp',> 'SHELL': '/bin/bash', 'GIT_PREVIOUS_SUCCESSFUL_COMMIT': 'bd0facc469b2312dd7ca2e2a7161c5562cd58b36', 'SHLVL': '3', 'NLSPATH': '/usr/dt/lib/nls/msg/%L/%N.cat', 'GIT_AUTHOR_EMAIL': 'builds@apache.org', 'HUDSON_HOME': '/x1/jenkins/jenkins-home', 'NODE_LABELS': 'beam beam3', 'GIT_COMMITTER_EMAIL': 'builds@apache.org', 'BUILD_CAUSE_TIMERTRIGGER': 'true', 'PYTHONHASHSEED': '4149745122', 'JAVA_HOME': '/home/jenkins/tools/java/latest1.8', 'ROOT_BUILD_CAUSE': 'TIMERTRIGGER', 'BUILD_ID': '3156', 'BUILD_NUMBER': '3156', 'XDG_RUNTIME_DIR': '/run/user/9997', 'HUDSON_COOKIE': 'ce3bedc4-f22d-493a-b857-0e9c6f6d92e1', 'JOB_URL': 'https://builds.apache.org/job/beam_PostCommit_Python_Verify/', 'TEST_HOST': 'beam3', 'GIT_BRANCH': 'origin/master', 'JOB_BASE_NAME': 'beam_PostCommit_Python_Verify', 'GIT_AUTHOR_NAME': 'jenkins', 'ROOT_BUILD_CAUSE_TIMERTRIGGER': 'true', 'GIT_COMMITTER_NAME': 'jenkins', 'XDG_SESSION_ID': '122', '_': '/home/jenkins/.local/bin//tox', 'sha1': 'master', 'COVERALLS_REPO_TOKEN': '****', 'JOB_DISPLAY_URL': 'https://builds.apache.org/job/beam_PostCommit_Python_Verify/display/redirect', 'HUDSON_SERVER_COOKIE': 'f4ebd1e6b0d976e8', 'EXECUTOR_NUMBER': '0', 'NODE_NAME': 'beam3', 'PWD': '<https://builds.apache.org/job/beam_PostCommit_Python_Verify/ws/',> 'SPARK_LOCAL_IP': '127.0.0.1', 'JENKINS_SERVER_COOKIE': 'f4ebd1e6b0d976e8', 'BUILD_DISPLAY_NAME': '#3156', 'XFILESEARCHPATH': '/usr/dt/app-defaults/%L/Dt', 'MAIL': '/var/mail/jenkins', 'SSH_CONNECTION': '62.210.60.235 55148 10.128.0.4 22', 'RUN_CHANGES_DISPLAY_URL': 'https://builds.apache.org/job/beam_PostCommit_Python_Verify/3156/display/redirect?page=changes', 'GIT_URL': 'https://github.com/apache/beam.git'}

Processing ./target/.tox/dist/apache-beam-2.2.0.dev.zip
Collecting avro<2.0.0,>=1.8.1 (from apache-beam==2.2.0.dev0)
Collecting crcmod<2.0,>=1.7 (from apache-beam==2.2.0.dev0)
Collecting dill==0.2.6 (from apache-beam==2.2.0.dev0)
Collecting grpcio<2.0,>=1.0 (from apache-beam==2.2.0.dev0)
  Using cached grpcio-1.6.0-cp27-cp27mu-manylinux1_x86_64.whl
Collecting httplib2<0.10,>=0.8 (from apache-beam==2.2.0.dev0)
Collecting mock<3.0.0,>=1.0.1 (from apache-beam==2.2.0.dev0)
  Using cached mock-2.0.0-py2.py3-none-any.whl
Collecting oauth2client<4.0.0,>=2.0.1 (from apache-beam==2.2.0.dev0)
Collecting protobuf<=3.3.0,>=3.2.0 (from apache-beam==2.2.0.dev0)
  Using cached protobuf-3.3.0-cp27-cp27mu-manylinux1_x86_64.whl
Collecting pyyaml<4.0.0,>=3.12 (from apache-beam==2.2.0.dev0)
Collecting typing<3.7.0,>=3.6.0 (from apache-beam==2.2.0.dev0)
  Using cached typing-3.6.2-py2-none-any.whl
Collecting futures>=2.2.0 (from grpcio<2.0,>=1.0->apache-beam==2.2.0.dev0)
  Using cached futures-3.1.1-py2-none-any.whl
Collecting six>=1.5.2 (from grpcio<2.0,>=1.0->apache-beam==2.2.0.dev0)
  Using cached six-1.11.0-py2.py3-none-any.whl
Collecting enum34>=1.0.4 (from grpcio<2.0,>=1.0->apache-beam==2.2.0.dev0)
  Using cached enum34-1.1.6-py2-none-any.whl
Collecting pbr>=0.11 (from mock<3.0.0,>=1.0.1->apache-beam==2.2.0.dev0)
  Using cached pbr-3.1.1-py2.py3-none-any.whl
Collecting funcsigs>=1; python_version < "3.3" (from mock<3.0.0,>=1.0.1->apache-beam==2.2.0.dev0)
  Using cached funcsigs-1.0.2-py2.py3-none-any.whl
Collecting pyasn1-modules>=0.0.5 (from oauth2client<4.0.0,>=2.0.1->apache-beam==2.2.0.dev0)
  Using cached pyasn1_modules-0.1.4-py2.py3-none-any.whl
Collecting pyasn1>=0.1.7 (from oauth2client<4.0.0,>=2.0.1->apache-beam==2.2.0.dev0)
  Using cached pyasn1-0.3.5-py2.py3-none-any.whl
Collecting rsa>=3.1.4 (from oauth2client<4.0.0,>=2.0.1->apache-beam==2.2.0.dev0)
  Using cached rsa-3.4.2-py2.py3-none-any.whl
Requirement already satisfied: setuptools in ./target/.tox/py27gcp/lib/python2.7/site-packages (from protobuf<=3.3.0,>=3.2.0->apache-beam==2.2.0.dev0)
Building wheels for collected packages: apache-beam
  Running setup.py bdist_wheel for apache-beam: started
  Running setup.py bdist_wheel for apache-beam: finished with status 'error'
  Complete output from command <https://builds.apache.org/job/beam_PostCommit_Python_Verify/ws/sdks/python/target/.tox/py27gcp/bin/python> -u -c "import setuptools, tokenize;__file__='/tmp/pip-9D08ne-build/setup.py';f=getattr(tokenize, 'open', open)(__file__);code=f.read().replace('\r\n', '\n');f.close();exec(compile(code, __file__, 'exec'))" bdist_wheel -d /tmp/tmpVKM7urpip-wheel- --python-tag cp27:
  <https://builds.apache.org/job/beam_PostCommit_Python_Verify/ws/sdks/python/target/.tox/py27gcp/local/lib/python2.7/site-packages/setuptools/dist.py>:351: UserWarning: Normalizing '2.2.0.dev' to '2.2.0.dev0'
    normalized_version,
  running bdist_wheel
  running build
  running build_py
  gen_protos.py:46: UserWarning: Installing grpcio-tools is recommended for development.
    warnings.warn('Installing grpcio-tools is recommended for development.')
  Traceback (most recent call last):
    File "<string>", line 1, in <module>
    File "/tmp/pip-9D08ne-build/setup.py", line 198, in <module>
      'test': generate_protos_first(test),
    File "/usr/lib/python2.7/distutils/core.py", line 151, in setup
      dist.run_commands()
    File "/usr/lib/python2.7/distutils/dist.py", line 953, in run_commands
      self.run_command(cmd)
    File "/usr/lib/python2.7/distutils/dist.py", line 972, in run_command
      cmd_obj.run()
    File "<https://builds.apache.org/job/beam_PostCommit_Python_Verify/ws/sdks/python/target/.tox/py27gcp/local/lib/python2.7/site-packages/wheel/bdist_wheel.py",> line 204, in run
      self.run_command('build')
    File "/usr/lib/python2.7/distutils/cmd.py", line 326, in run_command
      self.distribution.run_command(command)
    File "/usr/lib/python2.7/distutils/dist.py", line 972, in run_command
      cmd_obj.run()
    File "/usr/lib/python2.7/distutils/command/build.py", line 128, in run
      self.run_command(cmd_name)
    File "/usr/lib/python2.7/distutils/cmd.py", line 326, in run_command
      self.distribution.run_command(command)
    File "/usr/lib/python2.7/distutils/dist.py", line 972, in run_command
      cmd_obj.run()
    File "/tmp/pip-9D08ne-build/setup.py", line 138, in run
      gen_protos.generate_proto_files()
    File "gen_protos.py", line 65, in generate_proto_files
      'Not in apache git tree; unable to find proto definitions.')
  RuntimeError: Not in apache git tree; unable to find proto definitions.
  
  ----------------------------------------
  Failed building wheel for apache-beam
  Running setup.py clean for apache-beam
Failed to build apache-beam
Installing collected packages: avro, crcmod, dill, futures, six, enum34, protobuf, grpcio, httplib2, pbr, funcsigs, mock, pyasn1, pyasn1-modules, rsa, oauth2client, pyyaml, typing, apache-beam
  Running setup.py install for apache-beam: started
    Running setup.py install for apache-beam: finished with status 'error'
    Complete output from command <https://builds.apache.org/job/beam_PostCommit_Python_Verify/ws/sdks/python/target/.tox/py27gcp/bin/python> -u -c "import setuptools, tokenize;__file__='/tmp/pip-9D08ne-build/setup.py';f=getattr(tokenize, 'open', open)(__file__);code=f.read().replace('\r\n', '\n');f.close();exec(compile(code, __file__, 'exec'))" install --record /tmp/pip-3jW45h-record/install-record.txt --single-version-externally-managed --compile --install-headers <https://builds.apache.org/job/beam_PostCommit_Python_Verify/ws/sdks/python/target/.tox/py27gcp/include/site/python2.7/apache-beam>:
    <https://builds.apache.org/job/beam_PostCommit_Python_Verify/ws/sdks/python/target/.tox/py27gcp/local/lib/python2.7/site-packages/setuptools/dist.py>:351: UserWarning: Normalizing '2.2.0.dev' to '2.2.0.dev0'
      normalized_version,
    running install
    running build
    running build_py
    gen_protos.py:46: UserWarning: Installing grpcio-tools is recommended for development.
      warnings.warn('Installing grpcio-tools is recommended for development.')
    Traceback (most recent call last):
      File "<string>", line 1, in <module>
      File "/tmp/pip-9D08ne-build/setup.py", line 198, in <module>
        'test': generate_protos_first(test),
      File "/usr/lib/python2.7/distutils/core.py", line 151, in setup
        dist.run_commands()
      File "/usr/lib/python2.7/distutils/dist.py", line 953, in run_commands
        self.run_command(cmd)
      File "/usr/lib/python2.7/distutils/dist.py", line 972, in run_command
        cmd_obj.run()
      File "<https://builds.apache.org/job/beam_PostCommit_Python_Verify/ws/sdks/python/target/.tox/py27gcp/local/lib/python2.7/site-packages/setuptools/command/install.py",> line 61, in run
        return orig.install.run(self)
      File "/usr/lib/python2.7/distutils/command/install.py", line 601, in run
        self.run_command('build')
      File "/usr/lib/python2.7/distutils/cmd.py", line 326, in run_command
        self.distribution.run_command(command)
      File "/usr/lib/python2.7/distutils/dist.py", line 972, in run_command
        cmd_obj.run()
      File "/usr/lib/python2.7/distutils/command/build.py", line 128, in run
        self.run_command(cmd_name)
      File "/usr/lib/python2.7/distutils/cmd.py", line 326, in run_command
        self.distribution.run_command(command)
      File "/usr/lib/python2.7/distutils/dist.py", line 972, in run_command
        cmd_obj.run()
      File "/tmp/pip-9D08ne-build/setup.py", line 138, in run
        gen_protos.generate_proto_files()
      File "gen_protos.py", line 65, in generate_proto_files
        'Not in apache git tree; unable to find proto definitions.')
    RuntimeError: Not in apache git tree; unable to find proto definitions.
    
    ----------------------------------------
Command "<https://builds.apache.org/job/beam_PostCommit_Python_Verify/ws/sdks/python/target/.tox/py27gcp/bin/python> -u -c "import setuptools, tokenize;__file__='/tmp/pip-9D08ne-build/setup.py';f=getattr(tokenize, 'open', open)(__file__);code=f.read().replace('\r\n', '\n');f.close();exec(compile(code, __file__, 'exec'))" install --record /tmp/pip-3jW45h-record/install-record.txt --single-version-externally-managed --compile --install-headers <https://builds.apache.org/job/beam_PostCommit_Python_Verify/ws/sdks/python/target/.tox/py27gcp/include/site/python2.7/apache-beam"> failed with error code 1 in /tmp/pip-9D08ne-build/

py27gcp installed: avro==1.8.2,crcmod==1.7,dill==0.2.6,enum34==1.1.6,funcsigs==1.0.2,futures==3.1.1,grpcio==1.6.0,httplib2==0.9.2,mock==2.0.0,nose==1.3.7,oauth2client==3.0.0,pbr==3.1.1,protobuf==3.3.0,pyasn1==0.3.5,pyasn1-modules==0.1.4,PyYAML==3.12,rsa==3.4.2,six==1.11.0,typing==3.6.2
___________________________________ summary ____________________________________
ERROR:   docs: InvocationError: <https://builds.apache.org/job/beam_PostCommit_Python_Verify/ws/sdks/python/target/.tox/docs/bin/pip> install <https://builds.apache.org/job/beam_PostCommit_Python_Verify/ws/sdks/python/target/.tox/dist/apache-beam-2.2.0.dev.zip> (see <https://builds.apache.org/job/beam_PostCommit_Python_Verify/ws/sdks/python/target/.tox/docs/log/docs-2.log)>
ERROR:   lint: InvocationError: <https://builds.apache.org/job/beam_PostCommit_Python_Verify/ws/sdks/python/target/.tox/lint/bin/pip> install <https://builds.apache.org/job/beam_PostCommit_Python_Verify/ws/sdks/python/target/.tox/dist/apache-beam-2.2.0.dev.zip> (see <https://builds.apache.org/job/beam_PostCommit_Python_Verify/ws/sdks/python/target/.tox/lint/log/lint-2.log)>
ERROR:   py27: InvocationError: <https://builds.apache.org/job/beam_PostCommit_Python_Verify/ws/sdks/python/target/.tox/py27/bin/pip> install <https://builds.apache.org/job/beam_PostCommit_Python_Verify/ws/sdks/python/target/.tox/dist/apache-beam-2.2.0.dev.zip> (see <https://builds.apache.org/job/beam_PostCommit_Python_Verify/ws/sdks/python/target/.tox/py27/log/py27-2.log)>
ERROR:   py27cython: InvocationError: <https://builds.apache.org/job/beam_PostCommit_Python_Verify/ws/sdks/python/target/.tox/py27cython/bin/pip> install <https://builds.apache.org/job/beam_PostCommit_Python_Verify/ws/sdks/python/target/.tox/dist/apache-beam-2.2.0.dev.zip> (see <https://builds.apache.org/job/beam_PostCommit_Python_Verify/ws/sdks/python/target/.tox/py27cython/log/py27cython-2.log)>
ERROR:   py27gcp: InvocationError: <https://builds.apache.org/job/beam_PostCommit_Python_Verify/ws/sdks/python/target/.tox/py27gcp/bin/pip> install <https://builds.apache.org/job/beam_PostCommit_Python_Verify/ws/sdks/python/target/.tox/dist/apache-beam-2.2.0.dev.zip> (see <https://builds.apache.org/job/beam_PostCommit_Python_Verify/ws/sdks/python/target/.tox/py27gcp/log/py27gcp-2.log)>
Build step 'Execute shell' marked build as failure
Not sending mail to unregistered user echauchot@gmail.com+jbonofre@apache.org