You are viewing a plain text version of this content. The canonical link for it is here.
Posted to builds@beam.apache.org by Apache Jenkins Server <je...@builds.apache.org> on 2022/08/02 15:44:39 UTC

Build failed in Jenkins: beam_PostCommit_Py_VR_Dataflow #9663

See <https://ci-beam.apache.org/job/beam_PostCommit_Py_VR_Dataflow/9663/display/redirect>

Changes:


------------------------------------------
[...truncated 226.04 KB...]
INFO     apache_beam.runners.dataflow.internal.apiclient:apiclient.py:732 Starting GCS upload to gs://temp-storage-for-end-to-end-tests/staging-it/beamapp-jenkins-0802153454-812993-nthvafm2.1659454494.813187/dataflow_python_sdk.tar...
INFO     apache_beam.runners.dataflow.internal.apiclient:apiclient.py:748 Completed GCS upload to gs://temp-storage-for-end-to-end-tests/staging-it/beamapp-jenkins-0802153454-812993-nthvafm2.1659454494.813187/dataflow_python_sdk.tar in 0 seconds.
INFO     apache_beam.runners.dataflow.internal.apiclient:apiclient.py:732 Starting GCS upload to gs://temp-storage-for-end-to-end-tests/staging-it/beamapp-jenkins-0802153454-812993-nthvafm2.1659454494.813187/dataflow-worker.jar...
INFO     apache_beam.runners.dataflow.internal.apiclient:apiclient.py:748 Completed GCS upload to gs://temp-storage-for-end-to-end-tests/staging-it/beamapp-jenkins-0802153454-812993-nthvafm2.1659454494.813187/dataflow-worker.jar in 11 seconds.
INFO     apache_beam.runners.dataflow.internal.apiclient:apiclient.py:732 Starting GCS upload to gs://temp-storage-for-end-to-end-tests/staging-it/beamapp-jenkins-0802153454-812993-nthvafm2.1659454494.813187/pipeline.pb...
INFO     apache_beam.runners.dataflow.internal.apiclient:apiclient.py:748 Completed GCS upload to gs://temp-storage-for-end-to-end-tests/staging-it/beamapp-jenkins-0802153454-812993-nthvafm2.1659454494.813187/pipeline.pb in 0 seconds.
INFO     apache_beam.runners.dataflow.internal.apiclient:apiclient.py:911 Create job: <Job
 clientRequestId: '20220802153454814357-2535'
 createTime: '2022-08-02T15:35:10.314454Z'
 currentStateTime: '1970-01-01T00:00:00Z'
 id: '2022-08-02_08_35_09-10614664617212284206'
 location: 'us-central1'
 name: 'beamapp-jenkins-0802153454-812993-nthvafm2'
 projectId: 'apache-beam-testing'
 stageStates: []
 startTime: '2022-08-02T15:35:10.314454Z'
 steps: []
 tempFiles: []
 type: TypeValueValuesEnum(JOB_TYPE_STREAMING, 2)>
INFO     apache_beam.runners.dataflow.internal.apiclient:apiclient.py:913 Created job with id: [2022-08-02_08_35_09-10614664617212284206]
INFO     apache_beam.runners.dataflow.internal.apiclient:apiclient.py:914 Submitted job: 2022-08-02_08_35_09-10614664617212284206
INFO     apache_beam.runners.dataflow.internal.apiclient:apiclient.py:915 To access the Dataflow monitoring console, please navigate to https://console.cloud.google.com/dataflow/jobs/us-central1/2022-08-02_08_35_09-10614664617212284206?project=apache-beam-testing
Worker logs: https://console.cloud.google.com/dataflow/jobs/us-central1/2022-08-02_08_35_09-10614664617212284206?project=apache-beam-testing
INFO     apache_beam.runners.dataflow.test_dataflow_runner:test_dataflow_runner.py:58 Console log: 
INFO     apache_beam.runners.dataflow.test_dataflow_runner:test_dataflow_runner.py:59 https://console.cloud.google.com/dataflow/jobs/us-central1/2022-08-02_08_35_09-10614664617212284206?project=apache-beam-testing

> Task :sdks:python:test-suites:dataflow:py37:validatesRunnerStreamingTests

[gw3] PASSED apache_beam/transforms/util_test.py::ReshuffleTest::test_reshuffle_preserves_timestamps 

=============================== warnings summary ===============================
../../build/gradleenv/-1734967052/lib/python3.7/site-packages/hdfs/config.py:15
../../build/gradleenv/-1734967052/lib/python3.7/site-packages/hdfs/config.py:15
../../build/gradleenv/-1734967052/lib/python3.7/site-packages/hdfs/config.py:15
../../build/gradleenv/-1734967052/lib/python3.7/site-packages/hdfs/config.py:15
../../build/gradleenv/-1734967052/lib/python3.7/site-packages/hdfs/config.py:15
../../build/gradleenv/-1734967052/lib/python3.7/site-packages/hdfs/config.py:15
../../build/gradleenv/-1734967052/lib/python3.7/site-packages/hdfs/config.py:15
../../build/gradleenv/-1734967052/lib/python3.7/site-packages/hdfs/config.py:15
../../build/gradleenv/-1734967052/lib/python3.7/site-packages/hdfs/config.py:15
  <https://ci-beam.apache.org/job/beam_PostCommit_Py_VR_Dataflow/ws/src/build/gradleenv/-1734967052/lib/python3.7/site-packages/hdfs/config.py>:15: DeprecationWarning: the imp module is deprecated in favour of importlib; see the module's documentation for alternative uses
    from imp import load_source

-- Docs: https://docs.pytest.org/en/stable/how-to/capture-warnings.html
- generated xml file: <https://ci-beam.apache.org/job/beam_PostCommit_Py_VR_Dataflow/ws/src/sdks/python/pytest_validatesRunnerStreamingTests-df-py37-xdist.xml> -
============ 30 passed, 5 skipped, 9 warnings in 2533.73s (0:42:13) ============
>>> RUNNING integration tests with pipeline options: --runner=TestDataflowRunner --project=apache-beam-testing --region=us-central1 --staging_location=gs://temp-storage-for-end-to-end-tests/staging-it --temp_location=gs://temp-storage-for-end-to-end-tests/temp-it --output=gs://temp-storage-for-end-to-end-tests/py-it-cloud/output --sdk_location=<https://ci-beam.apache.org/job/beam_PostCommit_Py_VR_Dataflow/ws/src/sdks/python/build/apache-beam.tar.gz> --requirements_file=postcommit_requirements.txt --num_workers=1 --sleep_secs=20 --streaming --dataflow_worker_jar=<https://ci-beam.apache.org/job/beam_PostCommit_Py_VR_Dataflow/ws/src/runners/google-cloud-dataflow-java/worker/build/libs/beam-runners-google-cloud-dataflow-java-fn-api-worker-2.42.0-SNAPSHOT.jar> --kms_key_name=projects/apache-beam-testing/locations/global/keyRings/beam-it/cryptoKeys/test --dataflow_kms_key=projects/apache-beam-testing/locations/global/keyRings/beam-it/cryptoKeys/test
>>>   pytest options: --capture=no --timeout=4500 --color=yes --log-cli-level=INFO
>>>   collect markers: -m=it_validatesrunner and not no_sickbay_streaming and no_xdist
============================= test session starts ==============================
platform linux -- Python 3.7.12, pytest-7.1.2, pluggy-1.0.0
rootdir: <https://ci-beam.apache.org/job/beam_PostCommit_Py_VR_Dataflow/ws/src/sdks/python,> configfile: pytest.ini
plugins: xdist-2.5.0, timeout-2.1.0, forked-1.4.0, requests-mock-1.9.3
timeout: 4500.0s
timeout method: signal
timeout func_only: False

----------------------------- live log collection ------------------------------
WARNING  root:avroio_test.py:54 python-snappy is not installed; some tests will be skipped.
WARNING  root:tfrecordio_test.py:55 Tensorflow is not installed, so skipping some tests.
WARNING  apache_beam.runners.interactive.interactive_environment:interactive_environment.py:191 Dependencies required for Interactive Beam PCollection visualization are not available, please use: `pip install apache-beam[interactive]` to install necessary dependencies to enable all data visualization features.
WARNING  apache_beam.runners.interactive.interactive_environment:interactive_environment.py:200 You cannot use Interactive Beam features when you are not in an interactive environment such as a Jupyter notebook or ipython terminal.
INFO     root:environments.py:376 Default Python SDK image for environment is apache/beam_python3.7_sdk:2.42.0.dev
collected 6524 items / 6523 deselected / 2 skipped / 1 selected

apache_beam/runners/dataflow/dataflow_exercise_streaming_metrics_pipeline_test.py::ExerciseStreamingMetricsPipelineTest::test_streaming_pipeline_returns_expected_user_metrics_fnapi_it 
-------------------------------- live log call ---------------------------------
INFO     apache_beam.runners.portability.stager:stager.py:754 Executing command: ['<https://ci-beam.apache.org/job/beam_PostCommit_Py_VR_Dataflow/ws/src/build/gradleenv/-1734967052/bin/python3.7',> '-m', 'pip', 'download', '--dest', '/tmp/dataflow-requirements-cache', '-r', '/tmp/tmpel72bxlz/tmp_requirements.txt', '--exists-action', 'i', '--no-deps', '--implementation', 'cp', '--abi', 'cp37m', '--platform', 'manylinux2014_x86_64']
INFO     apache_beam.runners.portability.stager:stager.py:325 Copying Beam SDK "<https://ci-beam.apache.org/job/beam_PostCommit_Py_VR_Dataflow/ws/src/sdks/python/build/apache-beam.tar.gz"> to staging location.
INFO     apache_beam.runners.dataflow.dataflow_runner:dataflow_runner.py:478 Pipeline has additional dependencies to be installed in SDK worker container, consider using the SDK container image pre-building workflow to avoid repetitive installations. Learn more on https://cloud.google.com/dataflow/docs/guides/using-custom-containers#prebuild
INFO     root:environments.py:376 Default Python SDK image for environment is apache/beam_python3.7_sdk:2.42.0.dev
INFO     root:environments.py:296 Using provided Python SDK container image: gcr.io/cloud-dataflow/v1beta3/python37-fnapi:beam-master-20220617
INFO     root:environments.py:304 Python SDK container image set to "gcr.io/cloud-dataflow/v1beta3/python37-fnapi:beam-master-20220617" for Docker environment
INFO     apache_beam.internal.gcp.auth:auth.py:136 Setting socket default timeout to 60 seconds.
INFO     apache_beam.internal.gcp.auth:auth.py:139 socket default timeout is 60.0 seconds.
INFO     apache_beam.runners.dataflow.internal.apiclient:apiclient.py:732 Starting GCS upload to gs://temp-storage-for-end-to-end-tests/staging-it/beamapp-jenkins-0802153533-362816-nthvafm2.1659454533.363026/requirements.txt...
INFO     apache_beam.runners.dataflow.internal.apiclient:apiclient.py:751 Completed GCS upload to gs://temp-storage-for-end-to-end-tests/staging-it/beamapp-jenkins-0802153533-362816-nthvafm2.1659454533.363026/requirements.txt in 0 seconds.
INFO     apache_beam.runners.dataflow.internal.apiclient:apiclient.py:732 Starting GCS upload to gs://temp-storage-for-end-to-end-tests/staging-it/beamapp-jenkins-0802153533-362816-nthvafm2.1659454533.363026/pickled_main_session...
INFO     apache_beam.runners.dataflow.internal.apiclient:apiclient.py:751 Completed GCS upload to gs://temp-storage-for-end-to-end-tests/staging-it/beamapp-jenkins-0802153533-362816-nthvafm2.1659454533.363026/pickled_main_session in 0 seconds.
INFO     apache_beam.runners.dataflow.internal.apiclient:apiclient.py:732 Starting GCS upload to gs://temp-storage-for-end-to-end-tests/staging-it/beamapp-jenkins-0802153533-362816-nthvafm2.1659454533.363026/mock-2.0.0-py2.py3-none-any.whl...
INFO     apache_beam.runners.dataflow.internal.apiclient:apiclient.py:751 Completed GCS upload to gs://temp-storage-for-end-to-end-tests/staging-it/beamapp-jenkins-0802153533-362816-nthvafm2.1659454533.363026/mock-2.0.0-py2.py3-none-any.whl in 0 seconds.
INFO     apache_beam.runners.dataflow.internal.apiclient:apiclient.py:732 Starting GCS upload to gs://temp-storage-for-end-to-end-tests/staging-it/beamapp-jenkins-0802153533-362816-nthvafm2.1659454533.363026/seaborn-0.11.2-py3-none-any.whl...
INFO     apache_beam.runners.dataflow.internal.apiclient:apiclient.py:751 Completed GCS upload to gs://temp-storage-for-end-to-end-tests/staging-it/beamapp-jenkins-0802153533-362816-nthvafm2.1659454533.363026/seaborn-0.11.2-py3-none-any.whl in 0 seconds.
INFO     apache_beam.runners.dataflow.internal.apiclient:apiclient.py:732 Starting GCS upload to gs://temp-storage-for-end-to-end-tests/staging-it/beamapp-jenkins-0802153533-362816-nthvafm2.1659454533.363026/PyHamcrest-1.10.1-py3-none-any.whl...
INFO     apache_beam.runners.dataflow.internal.apiclient:apiclient.py:751 Completed GCS upload to gs://temp-storage-for-end-to-end-tests/staging-it/beamapp-jenkins-0802153533-362816-nthvafm2.1659454533.363026/PyHamcrest-1.10.1-py3-none-any.whl in 0 seconds.
INFO     apache_beam.runners.dataflow.internal.apiclient:apiclient.py:732 Starting GCS upload to gs://temp-storage-for-end-to-end-tests/staging-it/beamapp-jenkins-0802153533-362816-nthvafm2.1659454533.363026/beautifulsoup4-4.11.1-py3-none-any.whl...
INFO     apache_beam.runners.dataflow.internal.apiclient:apiclient.py:751 Completed GCS upload to gs://temp-storage-for-end-to-end-tests/staging-it/beamapp-jenkins-0802153533-362816-nthvafm2.1659454533.363026/beautifulsoup4-4.11.1-py3-none-any.whl in 0 seconds.
INFO     apache_beam.runners.dataflow.internal.apiclient:apiclient.py:732 Starting GCS upload to gs://temp-storage-for-end-to-end-tests/staging-it/beamapp-jenkins-0802153533-362816-nthvafm2.1659454533.363026/parameterized-0.7.5-py2.py3-none-any.whl...
INFO     apache_beam.runners.dataflow.internal.apiclient:apiclient.py:751 Completed GCS upload to gs://temp-storage-for-end-to-end-tests/staging-it/beamapp-jenkins-0802153533-362816-nthvafm2.1659454533.363026/parameterized-0.7.5-py2.py3-none-any.whl in 0 seconds.
INFO     apache_beam.runners.dataflow.internal.apiclient:apiclient.py:732 Starting GCS upload to gs://temp-storage-for-end-to-end-tests/staging-it/beamapp-jenkins-0802153533-362816-nthvafm2.1659454533.363026/matplotlib-3.5.2-cp38-cp38-manylinux_2_5_x86_64.manylinux1_x86_64.whl...
INFO     apache_beam.runners.dataflow.internal.apiclient:apiclient.py:751 Completed GCS upload to gs://temp-storage-for-end-to-end-tests/staging-it/beamapp-jenkins-0802153533-362816-nthvafm2.1659454533.363026/matplotlib-3.5.2-cp38-cp38-manylinux_2_5_x86_64.manylinux1_x86_64.whl in 0 seconds.
INFO     apache_beam.runners.dataflow.internal.apiclient:apiclient.py:732 Starting GCS upload to gs://temp-storage-for-end-to-end-tests/staging-it/beamapp-jenkins-0802153533-362816-nthvafm2.1659454533.363026/matplotlib-3.5.2-cp39-cp39-manylinux_2_5_x86_64.manylinux1_x86_64.whl...
INFO     apache_beam.runners.dataflow.internal.apiclient:apiclient.py:751 Completed GCS upload to gs://temp-storage-for-end-to-end-tests/staging-it/beamapp-jenkins-0802153533-362816-nthvafm2.1659454533.363026/matplotlib-3.5.2-cp39-cp39-manylinux_2_5_x86_64.manylinux1_x86_64.whl in 0 seconds.
INFO     apache_beam.runners.dataflow.internal.apiclient:apiclient.py:732 Starting GCS upload to gs://temp-storage-for-end-to-end-tests/staging-it/beamapp-jenkins-0802153533-362816-nthvafm2.1659454533.363026/matplotlib-3.5.2-cp37-cp37m-manylinux_2_5_x86_64.manylinux1_x86_64.whl...
INFO     apache_beam.runners.dataflow.internal.apiclient:apiclient.py:751 Completed GCS upload to gs://temp-storage-for-end-to-end-tests/staging-it/beamapp-jenkins-0802153533-362816-nthvafm2.1659454533.363026/matplotlib-3.5.2-cp37-cp37m-manylinux_2_5_x86_64.manylinux1_x86_64.whl in 0 seconds.
INFO     apache_beam.runners.dataflow.internal.apiclient:apiclient.py:732 Starting GCS upload to gs://temp-storage-for-end-to-end-tests/staging-it/beamapp-jenkins-0802153533-362816-nthvafm2.1659454533.363026/matplotlib-3.5.2-cp310-cp310-manylinux_2_17_x86_64.manylinux2014_x86_64.whl...
INFO     apache_beam.runners.dataflow.internal.apiclient:apiclient.py:751 Completed GCS upload to gs://temp-storage-for-end-to-end-tests/staging-it/beamapp-jenkins-0802153533-362816-nthvafm2.1659454533.363026/matplotlib-3.5.2-cp310-cp310-manylinux_2_17_x86_64.manylinux2014_x86_64.whl in 0 seconds.
INFO     apache_beam.runners.dataflow.internal.apiclient:apiclient.py:732 Starting GCS upload to gs://temp-storage-for-end-to-end-tests/staging-it/beamapp-jenkins-0802153533-362816-nthvafm2.1659454533.363026/dataflow_python_sdk.tar...
INFO     apache_beam.runners.dataflow.internal.apiclient:apiclient.py:751 Completed GCS upload to gs://temp-storage-for-end-to-end-tests/staging-it/beamapp-jenkins-0802153533-362816-nthvafm2.1659454533.363026/dataflow_python_sdk.tar in 0 seconds.
INFO     apache_beam.runners.dataflow.internal.apiclient:apiclient.py:732 Starting GCS upload to gs://temp-storage-for-end-to-end-tests/staging-it/beamapp-jenkins-0802153533-362816-nthvafm2.1659454533.363026/dataflow-worker.jar...

> Task :sdks:python:test-suites:dataflow:py39:validatesRunnerStreamingTests
INFO     apache_beam.runners.dataflow.dataflow_runner:dataflow_runner.py:197 Job 2022-08-02_08_35_09-10614664617212284206 is in state JOB_STATE_RUNNING
INFO     apache_beam.runners.dataflow.dataflow_runner:dataflow_runner.py:242 2022-08-02T15:35:09.937Z: JOB_MESSAGE_BASIC: Dataflow Runner V2 auto-enabled. Use --experiments=disable_runner_v2 to opt out.
INFO     apache_beam.runners.dataflow.dataflow_runner:dataflow_runner.py:242 2022-08-02T15:35:09.937Z: JOB_MESSAGE_BASIC: Streaming Engine auto-enabled. Use --experiments=disable_streaming_engine to opt out.
INFO     apache_beam.runners.dataflow.dataflow_runner:dataflow_runner.py:242 2022-08-02T15:35:10.937Z: JOB_MESSAGE_WARNING: Autoscaling is enabled for Dataflow Streaming Engine. Workers will scale between 1 and 100 unless maxNumWorkers is specified.
INFO     apache_beam.runners.dataflow.dataflow_runner:dataflow_runner.py:242 2022-08-02T15:35:11.045Z: JOB_MESSAGE_DETAILED: Autoscaling is enabled for job 2022-08-02_08_35_09-10614664617212284206. The number of workers will be between 1 and 100.
INFO     apache_beam.runners.dataflow.dataflow_runner:dataflow_runner.py:242 2022-08-02T15:35:11.078Z: JOB_MESSAGE_DETAILED: Autoscaling was automatically enabled for job 2022-08-02_08_35_09-10614664617212284206.
INFO     apache_beam.runners.dataflow.dataflow_runner:dataflow_runner.py:242 2022-08-02T15:35:16.697Z: JOB_MESSAGE_BASIC: Worker configuration: e2-standard-2 in us-central1-b.
INFO     apache_beam.runners.dataflow.dataflow_runner:dataflow_runner.py:242 2022-08-02T15:35:18.724Z: JOB_MESSAGE_DETAILED: Expanding SplittableParDo operations into optimizable parts.
INFO     apache_beam.runners.dataflow.dataflow_runner:dataflow_runner.py:242 2022-08-02T15:35:18.760Z: JOB_MESSAGE_DETAILED: Expanding CollectionToSingleton operations into optimizable parts.
INFO     apache_beam.runners.dataflow.dataflow_runner:dataflow_runner.py:242 2022-08-02T15:35:18.818Z: JOB_MESSAGE_DETAILED: Expanding CoGroupByKey operations into optimizable parts.
INFO     apache_beam.runners.dataflow.dataflow_runner:dataflow_runner.py:242 2022-08-02T15:35:18.851Z: JOB_MESSAGE_DETAILED: Expanding SplittableProcessKeyed operations into optimizable parts.
INFO     apache_beam.runners.dataflow.dataflow_runner:dataflow_runner.py:242 2022-08-02T15:35:18.898Z: JOB_MESSAGE_DETAILED: Expanding GroupByKey operations into streaming Read/Write steps
INFO     apache_beam.runners.dataflow.dataflow_runner:dataflow_runner.py:242 2022-08-02T15:35:18.920Z: JOB_MESSAGE_DETAILED: Lifting ValueCombiningMappingFns into MergeBucketsMappingFns
INFO     apache_beam.runners.dataflow.dataflow_runner:dataflow_runner.py:242 2022-08-02T15:35:18.942Z: JOB_MESSAGE_DEBUG: Annotating graph with Autotuner information.
INFO     apache_beam.runners.dataflow.dataflow_runner:dataflow_runner.py:242 2022-08-02T15:35:18.971Z: JOB_MESSAGE_DETAILED: Fusing adjacent ParDo, Read, Write, and Flatten operations
INFO     apache_beam.runners.dataflow.dataflow_runner:dataflow_runner.py:242 2022-08-02T15:35:18.999Z: JOB_MESSAGE_DETAILED: Fusing consumer generate_metrics into ReadFromPubSub/Read
INFO     apache_beam.runners.dataflow.dataflow_runner:dataflow_runner.py:242 2022-08-02T15:35:19.034Z: JOB_MESSAGE_DETAILED: Fusing consumer dump_to_pub/ToProtobuf into generate_metrics
INFO     apache_beam.runners.dataflow.dataflow_runner:dataflow_runner.py:242 2022-08-02T15:35:19.069Z: JOB_MESSAGE_DETAILED: Fusing consumer dump_to_pub/Write into dump_to_pub/ToProtobuf
INFO     apache_beam.runners.dataflow.dataflow_runner:dataflow_runner.py:242 2022-08-02T15:35:19.099Z: JOB_MESSAGE_BASIC: Running job using Streaming Engine
INFO     apache_beam.runners.dataflow.dataflow_runner:dataflow_runner.py:242 2022-08-02T15:35:19.125Z: JOB_MESSAGE_BASIC: Using cloud KMLS key to protect persistent state.
INFO     apache_beam.runners.dataflow.dataflow_runner:dataflow_runner.py:242 2022-08-02T15:35:19.222Z: JOB_MESSAGE_DEBUG: Workflow config is missing a default resource spec.
INFO     apache_beam.runners.dataflow.dataflow_runner:dataflow_runner.py:242 2022-08-02T15:35:19.260Z: JOB_MESSAGE_DEBUG: Adding StepResource setup and teardown to workflow graph.
INFO     apache_beam.runners.dataflow.dataflow_runner:dataflow_runner.py:242 2022-08-02T15:35:19.285Z: JOB_MESSAGE_DEBUG: Adding workflow start and stop steps.
INFO     apache_beam.runners.dataflow.dataflow_runner:dataflow_runner.py:242 2022-08-02T15:35:19.306Z: JOB_MESSAGE_DEBUG: Assigning stage ids.
INFO     apache_beam.runners.dataflow.dataflow_runner:dataflow_runner.py:242 2022-08-02T15:35:19.397Z: JOB_MESSAGE_DEBUG: Starting worker pool setup.
INFO     apache_beam.runners.dataflow.dataflow_runner:dataflow_runner.py:242 2022-08-02T15:35:19.428Z: JOB_MESSAGE_DEBUG: Starting worker pool setup.
INFO     apache_beam.runners.dataflow.dataflow_runner:dataflow_runner.py:242 2022-08-02T15:35:19.464Z: JOB_MESSAGE_BASIC: Starting 1 workers in us-central1-b...
INFO     apache_beam.runners.dataflow.dataflow_runner:dataflow_runner.py:242 2022-08-02T15:35:26.306Z: JOB_MESSAGE_BASIC: Your project already contains 100 Dataflow-created metric descriptors, so new user metrics of the form custom.googleapis.com/* will not be created. However, all user metrics are also available in the metric dataflow.googleapis.com/job/user_counter. If you rely on the custom metrics, you can delete old / unused metric descriptors. See https://developers.google.com/apis-explorer/#p/monitoring/v3/monitoring.projects.metricDescriptors.list and https://developers.google.com/apis-explorer/#p/monitoring/v3/monitoring.projects.metricDescriptors.delete
INFO     apache_beam.runners.dataflow.dataflow_runner:dataflow_runner.py:242 2022-08-02T15:35:54.742Z: JOB_MESSAGE_DETAILED: Autoscaling: Raised the number of workers to 1 so that the pipeline can catch up with its backlog and keep up with its input rate.

> Task :sdks:python:test-suites:dataflow:py37:validatesRunnerStreamingTests
INFO     apache_beam.runners.dataflow.internal.apiclient:apiclient.py:751 Completed GCS upload to gs://temp-storage-for-end-to-end-tests/staging-it/beamapp-jenkins-0802153533-362816-nthvafm2.1659454533.363026/dataflow-worker.jar in 6 seconds.
INFO     apache_beam.runners.dataflow.internal.apiclient:apiclient.py:732 Starting GCS upload to gs://temp-storage-for-end-to-end-tests/staging-it/beamapp-jenkins-0802153533-362816-nthvafm2.1659454533.363026/pipeline.pb...
INFO     apache_beam.runners.dataflow.internal.apiclient:apiclient.py:751 Completed GCS upload to gs://temp-storage-for-end-to-end-tests/staging-it/beamapp-jenkins-0802153533-362816-nthvafm2.1659454533.363026/pipeline.pb in 0 seconds.
INFO     apache_beam.runners.dataflow.internal.apiclient:apiclient.py:911 Create job: <Job
 clientRequestId: '20220802153533364209-2535'
 createTime: '2022-08-02T15:35:44.926024Z'
 currentStateTime: '1970-01-01T00:00:00Z'
 id: '2022-08-02_08_35_44-3120097248176262240'
 location: 'us-central1'
 name: 'beamapp-jenkins-0802153533-362816-nthvafm2'
 projectId: 'apache-beam-testing'
 stageStates: []
 startTime: '2022-08-02T15:35:44.926024Z'
 steps: []
 tempFiles: []
 type: TypeValueValuesEnum(JOB_TYPE_STREAMING, 2)>
INFO     apache_beam.runners.dataflow.internal.apiclient:apiclient.py:913 Created job with id: [2022-08-02_08_35_44-3120097248176262240]
INFO     apache_beam.runners.dataflow.internal.apiclient:apiclient.py:914 Submitted job: 2022-08-02_08_35_44-3120097248176262240
INFO     apache_beam.runners.dataflow.internal.apiclient:apiclient.py:920 To access the Dataflow monitoring console, please navigate to https://console.cloud.google.com/dataflow/jobs/us-central1/2022-08-02_08_35_44-3120097248176262240?project=apache-beam-testing
Worker logs: https://console.cloud.google.com/dataflow/jobs/us-central1/2022-08-02_08_35_44-3120097248176262240?project=apache-beam-testing
INFO     apache_beam.runners.dataflow.test_dataflow_runner:test_dataflow_runner.py:58 Console log: 
INFO     apache_beam.runners.dataflow.test_dataflow_runner:test_dataflow_runner.py:59 https://console.cloud.google.com/dataflow/jobs/us-central1/2022-08-02_08_35_44-3120097248176262240?project=apache-beam-testing
INFO     apache_beam.runners.dataflow.dataflow_runner:dataflow_runner.py:197 Job 2022-08-02_08_35_44-3120097248176262240 is in state JOB_STATE_RUNNING
INFO     apache_beam.runners.dataflow.dataflow_runner:dataflow_runner.py:242 2022-08-02T15:35:44.575Z: JOB_MESSAGE_BASIC: Streaming Engine auto-enabled. Use --experiments=disable_streaming_engine to opt out.
INFO     apache_beam.runners.dataflow.dataflow_runner:dataflow_runner.py:242 2022-08-02T15:35:44.575Z: JOB_MESSAGE_BASIC: Dataflow Runner V2 auto-enabled. Use --experiments=disable_runner_v2 to opt out.
INFO     apache_beam.runners.dataflow.dataflow_runner:dataflow_runner.py:242 2022-08-02T15:35:45.633Z: JOB_MESSAGE_WARNING: Autoscaling is enabled for Dataflow Streaming Engine. Workers will scale between 1 and 100 unless maxNumWorkers is specified.
INFO     apache_beam.runners.dataflow.dataflow_runner:dataflow_runner.py:242 2022-08-02T15:35:45.924Z: JOB_MESSAGE_DETAILED: Autoscaling is enabled for job 2022-08-02_08_35_44-3120097248176262240. The number of workers will be between 1 and 100.
INFO     apache_beam.runners.dataflow.dataflow_runner:dataflow_runner.py:242 2022-08-02T15:35:45.949Z: JOB_MESSAGE_DETAILED: Autoscaling was automatically enabled for job 2022-08-02_08_35_44-3120097248176262240.
INFO     apache_beam.runners.dataflow.dataflow_runner:dataflow_runner.py:242 2022-08-02T15:35:51.693Z: JOB_MESSAGE_BASIC: Worker configuration: e2-standard-2 in us-central1-b.
INFO     apache_beam.runners.dataflow.dataflow_runner:dataflow_runner.py:242 2022-08-02T15:35:53.827Z: JOB_MESSAGE_DETAILED: Expanding SplittableParDo operations into optimizable parts.
INFO     apache_beam.runners.dataflow.dataflow_runner:dataflow_runner.py:242 2022-08-02T15:35:53.857Z: JOB_MESSAGE_DETAILED: Expanding CollectionToSingleton operations into optimizable parts.
INFO     apache_beam.runners.dataflow.dataflow_runner:dataflow_runner.py:242 2022-08-02T15:35:53.953Z: JOB_MESSAGE_DETAILED: Expanding CoGroupByKey operations into optimizable parts.
INFO     apache_beam.runners.dataflow.dataflow_runner:dataflow_runner.py:242 2022-08-02T15:35:53.993Z: JOB_MESSAGE_DETAILED: Expanding SplittableProcessKeyed operations into optimizable parts.
INFO     apache_beam.runners.dataflow.dataflow_runner:dataflow_runner.py:242 2022-08-02T15:35:54.022Z: JOB_MESSAGE_DETAILED: Expanding GroupByKey operations into streaming Read/Write steps
INFO     apache_beam.runners.dataflow.dataflow_runner:dataflow_runner.py:242 2022-08-02T15:35:54.058Z: JOB_MESSAGE_DETAILED: Lifting ValueCombiningMappingFns into MergeBucketsMappingFns
INFO     apache_beam.runners.dataflow.dataflow_runner:dataflow_runner.py:242 2022-08-02T15:35:54.090Z: JOB_MESSAGE_DEBUG: Annotating graph with Autotuner information.
INFO     apache_beam.runners.dataflow.dataflow_runner:dataflow_runner.py:242 2022-08-02T15:35:54.133Z: JOB_MESSAGE_DETAILED: Fusing adjacent ParDo, Read, Write, and Flatten operations
INFO     apache_beam.runners.dataflow.dataflow_runner:dataflow_runner.py:242 2022-08-02T15:35:54.159Z: JOB_MESSAGE_DETAILED: Fusing consumer generate_metrics into ReadFromPubSub/Read
INFO     apache_beam.runners.dataflow.dataflow_runner:dataflow_runner.py:242 2022-08-02T15:35:54.192Z: JOB_MESSAGE_DETAILED: Fusing consumer dump_to_pub/ToProtobuf into generate_metrics
INFO     apache_beam.runners.dataflow.dataflow_runner:dataflow_runner.py:242 2022-08-02T15:35:54.216Z: JOB_MESSAGE_DETAILED: Fusing consumer dump_to_pub/Write into dump_to_pub/ToProtobuf
INFO     apache_beam.runners.dataflow.dataflow_runner:dataflow_runner.py:242 2022-08-02T15:35:54.242Z: JOB_MESSAGE_BASIC: Running job using Streaming Engine
INFO     apache_beam.runners.dataflow.dataflow_runner:dataflow_runner.py:242 2022-08-02T15:35:54.272Z: JOB_MESSAGE_BASIC: Using cloud KMLS key to protect persistent state.
INFO     apache_beam.runners.dataflow.dataflow_runner:dataflow_runner.py:242 2022-08-02T15:35:54.364Z: JOB_MESSAGE_DEBUG: Workflow config is missing a default resource spec.
INFO     apache_beam.runners.dataflow.dataflow_runner:dataflow_runner.py:242 2022-08-02T15:35:54.391Z: JOB_MESSAGE_DEBUG: Adding StepResource setup and teardown to workflow graph.
INFO     apache_beam.runners.dataflow.dataflow_runner:dataflow_runner.py:242 2022-08-02T15:35:54.416Z: JOB_MESSAGE_DEBUG: Adding workflow start and stop steps.
INFO     apache_beam.runners.dataflow.dataflow_runner:dataflow_runner.py:242 2022-08-02T15:35:54.439Z: JOB_MESSAGE_DEBUG: Assigning stage ids.
INFO     apache_beam.runners.dataflow.dataflow_runner:dataflow_runner.py:242 2022-08-02T15:35:54.488Z: JOB_MESSAGE_DEBUG: Starting worker pool setup.
INFO     apache_beam.runners.dataflow.dataflow_runner:dataflow_runner.py:242 2022-08-02T15:35:54.515Z: JOB_MESSAGE_BASIC: Starting 1 workers in us-central1-b...
INFO     apache_beam.runners.dataflow.dataflow_runner:dataflow_runner.py:242 2022-08-02T15:35:54.547Z: JOB_MESSAGE_DEBUG: Starting worker pool setup.
INFO     apache_beam.runners.dataflow.dataflow_runner:dataflow_runner.py:242 2022-08-02T15:36:04.216Z: JOB_MESSAGE_BASIC: Your project already contains 100 Dataflow-created metric descriptors, so new user metrics of the form custom.googleapis.com/* will not be created. However, all user metrics are also available in the metric dataflow.googleapis.com/job/user_counter. If you rely on the custom metrics, you can delete old / unused metric descriptors. See https://developers.google.com/apis-explorer/#p/monitoring/v3/monitoring.projects.metricDescriptors.list and https://developers.google.com/apis-explorer/#p/monitoring/v3/monitoring.projects.metricDescriptors.delete

> Task :sdks:python:test-suites:dataflow:py39:validatesRunnerStreamingTests
WARNING  apache_beam.runners.dataflow.dataflow_runner:dataflow_runner.py:253 Timing out on waiting for job 2022-08-02_08_35_09-10614664617212284206 after 61 seconds

> Task :sdks:python:test-suites:dataflow:py37:validatesRunnerStreamingTests
INFO     apache_beam.runners.dataflow.dataflow_runner:dataflow_runner.py:242 2022-08-02T15:36:32.240Z: JOB_MESSAGE_DETAILED: Autoscaling: Raised the number of workers to 1 so that the pipeline can catch up with its backlog and keep up with its input rate.
WARNING  apache_beam.runners.dataflow.dataflow_runner:dataflow_runner.py:256 Timing out on waiting for job 2022-08-02_08_35_44-3120097248176262240 after 61 seconds
PASSED

=============================== warnings summary ===============================
../../build/gradleenv/-1734967052/lib/python3.7/site-packages/hdfs/config.py:15
  <https://ci-beam.apache.org/job/beam_PostCommit_Py_VR_Dataflow/ws/src/build/gradleenv/-1734967052/lib/python3.7/site-packages/hdfs/config.py>:15: DeprecationWarning: the imp module is deprecated in favour of importlib; see the module's documentation for alternative uses
    from imp import load_source

-- Docs: https://docs.pytest.org/en/stable/how-to/capture-warnings.html
- generated xml file: <https://ci-beam.apache.org/job/beam_PostCommit_Py_VR_Dataflow/ws/src/sdks/python/pytest_validatesRunnerStreamingTests-df-py37-noxdist.xml> -
===== 1 passed, 2 skipped, 6523 deselected, 1 warning in 492.11s (0:08:12) =====

> Task :sdks:python:test-suites:dataflow:py39:validatesRunnerStreamingTests
PASSED

=============================== warnings summary ===============================
../../build/gradleenv/-1734967050/lib/python3.9/site-packages/hdfs/config.py:15
  <https://ci-beam.apache.org/job/beam_PostCommit_Py_VR_Dataflow/ws/src/build/gradleenv/-1734967050/lib/python3.9/site-packages/hdfs/config.py>:15: DeprecationWarning: the imp module is deprecated in favour of importlib; see the module's documentation for alternative uses
    from imp import load_source

../../build/gradleenv/-1734967050/lib/python3.9/site-packages/tenacity/_asyncio.py:42
  <https://ci-beam.apache.org/job/beam_PostCommit_Py_VR_Dataflow/ws/src/build/gradleenv/-1734967050/lib/python3.9/site-packages/tenacity/_asyncio.py>:42: DeprecationWarning: "@coroutine" decorator is deprecated since Python 3.8, use "async def" instead
    def call(self, fn, *args, **kwargs):

-- Docs: https://docs.pytest.org/en/stable/how-to/capture-warnings.html
- generated xml file: <https://ci-beam.apache.org/job/beam_PostCommit_Py_VR_Dataflow/ws/src/sdks/python/pytest_validatesRunnerStreamingTests-df-py39-noxdist.xml> -
==== 1 passed, 2 skipped, 6523 deselected, 2 warnings in 592.84s (0:09:52) =====

> Task :sdks:python:test-suites:dataflow:validatesRunnerStreamingTests

FAILURE: Build failed with an exception.

* Where:
Script '<https://ci-beam.apache.org/job/beam_PostCommit_Py_VR_Dataflow/ws/src/sdks/python/test-suites/dataflow/common.gradle'> line: 232

* What went wrong:
Execution failed for task ':sdks:python:test-suites:dataflow:py39:validatesRunnerBatchTests'.
> Process 'command 'sh'' finished with non-zero exit value 1

* Try:
> Run with --stacktrace option to get the stack trace.
> Run with --info or --debug option to get more log output.
> Run with --scan to get full insights.

* Get more help at https://help.gradle.org

Deprecated Gradle features were used in this build, making it incompatible with Gradle 8.0.

You can use '--warning-mode all' to show the individual deprecation warnings and determine if they come from your own scripts or plugins.

See https://docs.gradle.org/7.4/userguide/command_line_interface.html#sec:command_line_warnings

BUILD FAILED in 1h 25m 4s
100 actionable tasks: 65 executed, 33 from cache, 2 up-to-date

Publishing build scan...
https://gradle.com/s/cib2yvyatf3we

Build step 'Invoke Gradle script' changed build result to FAILURE
Build step 'Invoke Gradle script' marked build as failure

---------------------------------------------------------------------
To unsubscribe, e-mail: builds-unsubscribe@beam.apache.org
For additional commands, e-mail: builds-help@beam.apache.org


Jenkins build is back to normal : beam_PostCommit_Py_VR_Dataflow #9664

Posted by Apache Jenkins Server <je...@builds.apache.org>.
See <https://ci-beam.apache.org/job/beam_PostCommit_Py_VR_Dataflow/9664/display/redirect?page=changes>


---------------------------------------------------------------------
To unsubscribe, e-mail: builds-unsubscribe@beam.apache.org
For additional commands, e-mail: builds-help@beam.apache.org