You are viewing a plain text version of this content. The canonical link for it is here.
Posted to dev@lucene.apache.org by Policeman Jenkins Server <je...@thetaphi.de> on 2016/04/15 11:48:57 UTC

[JENKINS] Lucene-Solr-6.x-MacOSX (64bit/jdk1.8.0) - Build # 78 - Still Failing!

Build: http://jenkins.thetaphi.de/job/Lucene-Solr-6.x-MacOSX/78/
Java: 64bit/jdk1.8.0 -XX:-UseCompressedOops -XX:+UseParallelGC

2 tests failed.
FAILED:  org.apache.solr.cloud.LeaderFailoverAfterPartitionTest.test

Error Message:
Expected 2 of 3 replicas to be active but only found 1; [core_node3:{"core":"c8n_1x3_lf_shard1_replica1","base_url":"http://127.0.0.1:52577","node_name":"127.0.0.1:52577_","state":"active","leader":"true"}]; clusterState: DocCollection(c8n_1x3_lf)={   "replicationFactor":"3",   "shards":{"shard1":{       "range":"80000000-7fffffff",       "state":"active",       "replicas":{         "core_node1":{           "core":"c8n_1x3_lf_shard1_replica3",           "base_url":"http://127.0.0.1:52582",           "node_name":"127.0.0.1:52582_",           "state":"down"},         "core_node2":{           "state":"down",           "base_url":"http://127.0.0.1:52572",           "core":"c8n_1x3_lf_shard1_replica2",           "node_name":"127.0.0.1:52572_"},         "core_node3":{           "core":"c8n_1x3_lf_shard1_replica1",           "base_url":"http://127.0.0.1:52577",           "node_name":"127.0.0.1:52577_",           "state":"active",           "leader":"true"}}}},   "router":{"name":"compositeId"},   "maxShardsPerNode":"1",   "autoAddReplicas":"false"}

Stack Trace:
java.lang.AssertionError: Expected 2 of 3 replicas to be active but only found 1; [core_node3:{"core":"c8n_1x3_lf_shard1_replica1","base_url":"http://127.0.0.1:52577","node_name":"127.0.0.1:52577_","state":"active","leader":"true"}]; clusterState: DocCollection(c8n_1x3_lf)={
  "replicationFactor":"3",
  "shards":{"shard1":{
      "range":"80000000-7fffffff",
      "state":"active",
      "replicas":{
        "core_node1":{
          "core":"c8n_1x3_lf_shard1_replica3",
          "base_url":"http://127.0.0.1:52582",
          "node_name":"127.0.0.1:52582_",
          "state":"down"},
        "core_node2":{
          "state":"down",
          "base_url":"http://127.0.0.1:52572",
          "core":"c8n_1x3_lf_shard1_replica2",
          "node_name":"127.0.0.1:52572_"},
        "core_node3":{
          "core":"c8n_1x3_lf_shard1_replica1",
          "base_url":"http://127.0.0.1:52577",
          "node_name":"127.0.0.1:52577_",
          "state":"active",
          "leader":"true"}}}},
  "router":{"name":"compositeId"},
  "maxShardsPerNode":"1",
  "autoAddReplicas":"false"}
	at __randomizedtesting.SeedInfo.seed([9802D92CA5285819:1056E6F60BD435E1]:0)
	at org.junit.Assert.fail(Assert.java:93)
	at org.junit.Assert.assertTrue(Assert.java:43)
	at org.apache.solr.cloud.LeaderFailoverAfterPartitionTest.testRf3WithLeaderFailover(LeaderFailoverAfterPartitionTest.java:168)
	at org.apache.solr.cloud.LeaderFailoverAfterPartitionTest.test(LeaderFailoverAfterPartitionTest.java:55)
	at sun.reflect.NativeMethodAccessorImpl.invoke0(Native Method)
	at sun.reflect.NativeMethodAccessorImpl.invoke(NativeMethodAccessorImpl.java:62)
	at sun.reflect.DelegatingMethodAccessorImpl.invoke(DelegatingMethodAccessorImpl.java:43)
	at java.lang.reflect.Method.invoke(Method.java:498)
	at com.carrotsearch.randomizedtesting.RandomizedRunner.invoke(RandomizedRunner.java:1764)
	at com.carrotsearch.randomizedtesting.RandomizedRunner$8.evaluate(RandomizedRunner.java:871)
	at com.carrotsearch.randomizedtesting.RandomizedRunner$9.evaluate(RandomizedRunner.java:907)
	at com.carrotsearch.randomizedtesting.RandomizedRunner$10.evaluate(RandomizedRunner.java:921)
	at org.apache.solr.BaseDistributedSearchTestCase$ShardsRepeatRule$ShardsFixedStatement.callStatement(BaseDistributedSearchTestCase.java:992)
	at org.apache.solr.BaseDistributedSearchTestCase$ShardsRepeatRule$ShardsStatement.evaluate(BaseDistributedSearchTestCase.java:967)
	at com.carrotsearch.randomizedtesting.rules.SystemPropertiesRestoreRule$1.evaluate(SystemPropertiesRestoreRule.java:57)
	at org.apache.lucene.util.TestRuleSetupTeardownChained$1.evaluate(TestRuleSetupTeardownChained.java:49)
	at org.apache.lucene.util.AbstractBeforeAfterRule$1.evaluate(AbstractBeforeAfterRule.java:45)
	at org.apache.lucene.util.TestRuleThreadAndTestName$1.evaluate(TestRuleThreadAndTestName.java:48)
	at org.apache.lucene.util.TestRuleIgnoreAfterMaxFailures$1.evaluate(TestRuleIgnoreAfterMaxFailures.java:64)
	at org.apache.lucene.util.TestRuleMarkFailure$1.evaluate(TestRuleMarkFailure.java:47)
	at com.carrotsearch.randomizedtesting.rules.StatementAdapter.evaluate(StatementAdapter.java:36)
	at com.carrotsearch.randomizedtesting.ThreadLeakControl$StatementRunner.run(ThreadLeakControl.java:367)
	at com.carrotsearch.randomizedtesting.ThreadLeakControl.forkTimeoutingTask(ThreadLeakControl.java:809)
	at com.carrotsearch.randomizedtesting.ThreadLeakControl$3.evaluate(ThreadLeakControl.java:460)
	at com.carrotsearch.randomizedtesting.RandomizedRunner.runSingleTest(RandomizedRunner.java:880)
	at com.carrotsearch.randomizedtesting.RandomizedRunner$5.evaluate(RandomizedRunner.java:781)
	at com.carrotsearch.randomizedtesting.RandomizedRunner$6.evaluate(RandomizedRunner.java:816)
	at com.carrotsearch.randomizedtesting.RandomizedRunner$7.evaluate(RandomizedRunner.java:827)
	at com.carrotsearch.randomizedtesting.rules.StatementAdapter.evaluate(StatementAdapter.java:36)
	at com.carrotsearch.randomizedtesting.rules.SystemPropertiesRestoreRule$1.evaluate(SystemPropertiesRestoreRule.java:57)
	at org.apache.lucene.util.AbstractBeforeAfterRule$1.evaluate(AbstractBeforeAfterRule.java:45)
	at com.carrotsearch.randomizedtesting.rules.StatementAdapter.evaluate(StatementAdapter.java:36)
	at org.apache.lucene.util.TestRuleStoreClassName$1.evaluate(TestRuleStoreClassName.java:41)
	at com.carrotsearch.randomizedtesting.rules.NoShadowingOrOverridesOnMethodsRule$1.evaluate(NoShadowingOrOverridesOnMethodsRule.java:40)
	at com.carrotsearch.randomizedtesting.rules.NoShadowingOrOverridesOnMethodsRule$1.evaluate(NoShadowingOrOverridesOnMethodsRule.java:40)
	at com.carrotsearch.randomizedtesting.rules.StatementAdapter.evaluate(StatementAdapter.java:36)
	at com.carrotsearch.randomizedtesting.rules.StatementAdapter.evaluate(StatementAdapter.java:36)
	at com.carrotsearch.randomizedtesting.rules.StatementAdapter.evaluate(StatementAdapter.java:36)
	at org.apache.lucene.util.TestRuleAssertionsRequired$1.evaluate(TestRuleAssertionsRequired.java:53)
	at org.apache.lucene.util.TestRuleMarkFailure$1.evaluate(TestRuleMarkFailure.java:47)
	at org.apache.lucene.util.TestRuleIgnoreAfterMaxFailures$1.evaluate(TestRuleIgnoreAfterMaxFailures.java:64)
	at org.apache.lucene.util.TestRuleIgnoreTestSuites$1.evaluate(TestRuleIgnoreTestSuites.java:54)
	at com.carrotsearch.randomizedtesting.rules.StatementAdapter.evaluate(StatementAdapter.java:36)
	at com.carrotsearch.randomizedtesting.ThreadLeakControl$StatementRunner.run(ThreadLeakControl.java:367)
	at java.lang.Thread.run(Thread.java:745)


FAILED:  org.apache.solr.handler.TestReplicationHandler.doTestStressReplication

Error Message:
timed out waiting for collection1 startAt time to exceed: Fri Apr 15 04:51:12 EDT 2016

Stack Trace:
java.lang.AssertionError: timed out waiting for collection1 startAt time to exceed: Fri Apr 15 04:51:12 EDT 2016
	at __randomizedtesting.SeedInfo.seed([9802D92CA5285819:43A9D9EAA00031AA]:0)
	at org.junit.Assert.fail(Assert.java:93)
	at org.apache.solr.handler.TestReplicationHandler.watchCoreStartAt(TestReplicationHandler.java:1423)
	at org.apache.solr.handler.TestReplicationHandler.doTestStressReplication(TestReplicationHandler.java:775)
	at sun.reflect.NativeMethodAccessorImpl.invoke0(Native Method)
	at sun.reflect.NativeMethodAccessorImpl.invoke(NativeMethodAccessorImpl.java:62)
	at sun.reflect.DelegatingMethodAccessorImpl.invoke(DelegatingMethodAccessorImpl.java:43)
	at java.lang.reflect.Method.invoke(Method.java:498)
	at com.carrotsearch.randomizedtesting.RandomizedRunner.invoke(RandomizedRunner.java:1764)
	at com.carrotsearch.randomizedtesting.RandomizedRunner$8.evaluate(RandomizedRunner.java:871)
	at com.carrotsearch.randomizedtesting.RandomizedRunner$9.evaluate(RandomizedRunner.java:907)
	at com.carrotsearch.randomizedtesting.RandomizedRunner$10.evaluate(RandomizedRunner.java:921)
	at com.carrotsearch.randomizedtesting.rules.SystemPropertiesRestoreRule$1.evaluate(SystemPropertiesRestoreRule.java:57)
	at org.apache.lucene.util.TestRuleSetupTeardownChained$1.evaluate(TestRuleSetupTeardownChained.java:49)
	at org.apache.lucene.util.AbstractBeforeAfterRule$1.evaluate(AbstractBeforeAfterRule.java:45)
	at org.apache.lucene.util.TestRuleThreadAndTestName$1.evaluate(TestRuleThreadAndTestName.java:48)
	at org.apache.lucene.util.TestRuleIgnoreAfterMaxFailures$1.evaluate(TestRuleIgnoreAfterMaxFailures.java:64)
	at org.apache.lucene.util.TestRuleMarkFailure$1.evaluate(TestRuleMarkFailure.java:47)
	at com.carrotsearch.randomizedtesting.rules.StatementAdapter.evaluate(StatementAdapter.java:36)
	at com.carrotsearch.randomizedtesting.ThreadLeakControl$StatementRunner.run(ThreadLeakControl.java:367)
	at com.carrotsearch.randomizedtesting.ThreadLeakControl.forkTimeoutingTask(ThreadLeakControl.java:809)
	at com.carrotsearch.randomizedtesting.ThreadLeakControl$3.evaluate(ThreadLeakControl.java:460)
	at com.carrotsearch.randomizedtesting.RandomizedRunner.runSingleTest(RandomizedRunner.java:880)
	at com.carrotsearch.randomizedtesting.RandomizedRunner$5.evaluate(RandomizedRunner.java:781)
	at com.carrotsearch.randomizedtesting.RandomizedRunner$6.evaluate(RandomizedRunner.java:816)
	at com.carrotsearch.randomizedtesting.RandomizedRunner$7.evaluate(RandomizedRunner.java:827)
	at com.carrotsearch.randomizedtesting.rules.StatementAdapter.evaluate(StatementAdapter.java:36)
	at com.carrotsearch.randomizedtesting.rules.SystemPropertiesRestoreRule$1.evaluate(SystemPropertiesRestoreRule.java:57)
	at org.apache.lucene.util.AbstractBeforeAfterRule$1.evaluate(AbstractBeforeAfterRule.java:45)
	at com.carrotsearch.randomizedtesting.rules.StatementAdapter.evaluate(StatementAdapter.java:36)
	at org.apache.lucene.util.TestRuleStoreClassName$1.evaluate(TestRuleStoreClassName.java:41)
	at com.carrotsearch.randomizedtesting.rules.NoShadowingOrOverridesOnMethodsRule$1.evaluate(NoShadowingOrOverridesOnMethodsRule.java:40)
	at com.carrotsearch.randomizedtesting.rules.NoShadowingOrOverridesOnMethodsRule$1.evaluate(NoShadowingOrOverridesOnMethodsRule.java:40)
	at com.carrotsearch.randomizedtesting.rules.StatementAdapter.evaluate(StatementAdapter.java:36)
	at com.carrotsearch.randomizedtesting.rules.StatementAdapter.evaluate(StatementAdapter.java:36)
	at com.carrotsearch.randomizedtesting.rules.StatementAdapter.evaluate(StatementAdapter.java:36)
	at org.apache.lucene.util.TestRuleAssertionsRequired$1.evaluate(TestRuleAssertionsRequired.java:53)
	at org.apache.lucene.util.TestRuleMarkFailure$1.evaluate(TestRuleMarkFailure.java:47)
	at org.apache.lucene.util.TestRuleIgnoreAfterMaxFailures$1.evaluate(TestRuleIgnoreAfterMaxFailures.java:64)
	at org.apache.lucene.util.TestRuleIgnoreTestSuites$1.evaluate(TestRuleIgnoreTestSuites.java:54)
	at com.carrotsearch.randomizedtesting.rules.StatementAdapter.evaluate(StatementAdapter.java:36)
	at com.carrotsearch.randomizedtesting.ThreadLeakControl$StatementRunner.run(ThreadLeakControl.java:367)
	at java.lang.Thread.run(Thread.java:745)




Build Log:
[...truncated 10629 lines...]
   [junit4] Suite: org.apache.solr.handler.TestReplicationHandler
   [junit4]   2> Creating dataDir: /Users/jenkins/workspace/Lucene-Solr-6.x-MacOSX/solr/build/solr-core/test/J0/temp/solr.handler.TestReplicationHandler_9802D92CA5285819-001/init-core-data-001
   [junit4]   2> 104005 INFO  (TEST-TestReplicationHandler.doTestDetails-seed#[9802D92CA5285819]) [    ] o.a.s.SolrTestCaseJ4 ###Starting doTestDetails
   [junit4]   2> 104006 INFO  (TEST-TestReplicationHandler.doTestDetails-seed#[9802D92CA5285819]) [    ] o.a.s.SolrTestCaseJ4 Writing core.properties file to /Users/jenkins/workspace/Lucene-Solr-6.x-MacOSX/solr/build/solr-core/test/J0/temp/solr.handler.TestReplicationHandler_9802D92CA5285819-001/solr-instance-001/collection1
   [junit4]   2> 104040 INFO  (TEST-TestReplicationHandler.doTestDetails-seed#[9802D92CA5285819]) [    ] o.e.j.s.Server jetty-9.3.8.v20160314
   [junit4]   2> 104043 INFO  (TEST-TestReplicationHandler.doTestDetails-seed#[9802D92CA5285819]) [    ] o.e.j.s.h.ContextHandler Started o.e.j.s.ServletContextHandler@71e8141e{/solr,null,AVAILABLE}
   [junit4]   2> 104092 INFO  (TEST-TestReplicationHandler.doTestDetails-seed#[9802D92CA5285819]) [    ] o.e.j.s.ServerConnector Started ServerConnector@3101e289{HTTP/1.1,[http/1.1]}{127.0.0.1:50367}
   [junit4]   2> 104092 INFO  (TEST-TestReplicationHandler.doTestDetails-seed#[9802D92CA5285819]) [    ] o.e.j.s.Server Started @110085ms
   [junit4]   2> 104092 INFO  (TEST-TestReplicationHandler.doTestDetails-seed#[9802D92CA5285819]) [    ] o.a.s.c.s.e.JettySolrRunner Jetty properties: {solr.data.dir=/Users/jenkins/workspace/Lucene-Solr-6.x-MacOSX/solr/build/solr-core/test/J0/temp/solr.handler.TestReplicationHandler_9802D92CA5285819-001/solr-instance-001/collection1/data, hostContext=/solr, hostPort=50367}
   [junit4]   2> 104092 INFO  (TEST-TestReplicationHandler.doTestDetails-seed#[9802D92CA5285819]) [    ] o.a.s.s.SolrDispatchFilter SolrDispatchFilter.init(): sun.misc.Launcher$AppClassLoader@4554617c
   [junit4]   2> 104092 INFO  (TEST-TestReplicationHandler.doTestDetails-seed#[9802D92CA5285819]) [    ] o.a.s.c.SolrResourceLoader new SolrResourceLoader for directory: '/Users/jenkins/workspace/Lucene-Solr-6.x-MacOSX/solr/build/solr-core/test/J0/temp/solr.handler.TestReplicationHandler_9802D92CA5285819-001/solr-instance-001'
   [junit4]   2> 104092 INFO  (TEST-TestReplicationHandler.doTestDetails-seed#[9802D92CA5285819]) [    ] o.a.s.c.SolrResourceLoader JNDI not configured for solr (NoInitialContextEx)
   [junit4]   2> 104093 INFO  (TEST-TestReplicationHandler.doTestDetails-seed#[9802D92CA5285819]) [    ] o.a.s.c.SolrResourceLoader solr home defaulted to 'solr/' (could not find system property or JNDI)
   [junit4]   2> 104093 INFO  (TEST-TestReplicationHandler.doTestDetails-seed#[9802D92CA5285819]) [    ] o.a.s.c.SolrXmlConfig Loading container configuration from /Users/jenkins/workspace/Lucene-Solr-6.x-MacOSX/solr/build/solr-core/test/J0/temp/solr.handler.TestReplicationHandler_9802D92CA5285819-001/solr-instance-001/solr.xml
   [junit4]   2> 104100 INFO  (TEST-TestReplicationHandler.doTestDetails-seed#[9802D92CA5285819]) [    ] o.a.s.c.CorePropertiesLocator Config-defined core root directory: /Users/jenkins/workspace/Lucene-Solr-6.x-MacOSX/solr/build/solr-core/test/J0/temp/solr.handler.TestReplicationHandler_9802D92CA5285819-001/solr-instance-001/.
   [junit4]   2> 104101 INFO  (TEST-TestReplicationHandler.doTestDetails-seed#[9802D92CA5285819]) [    ] o.a.s.c.CoreContainer New CoreContainer 1964991847
   [junit4]   2> 104101 INFO  (TEST-TestReplicationHandler.doTestDetails-seed#[9802D92CA5285819]) [    ] o.a.s.c.CoreContainer Loading cores into CoreContainer [instanceDir=/Users/jenkins/workspace/Lucene-Solr-6.x-MacOSX/solr/build/solr-core/test/J0/temp/solr.handler.TestReplicationHandler_9802D92CA5285819-001/solr-instance-001]
   [junit4]   2> 104101 WARN  (TEST-TestReplicationHandler.doTestDetails-seed#[9802D92CA5285819]) [    ] o.a.s.c.CoreContainer Couldn't add files from /Users/jenkins/workspace/Lucene-Solr-6.x-MacOSX/solr/build/solr-core/test/J0/temp/solr.handler.TestReplicationHandler_9802D92CA5285819-001/solr-instance-001/lib to classpath: /Users/jenkins/workspace/Lucene-Solr-6.x-MacOSX/solr/build/solr-core/test/J0/temp/solr.handler.TestReplicationHandler_9802D92CA5285819-001/solr-instance-001/lib
   [junit4]   2> 104101 INFO  (TEST-TestReplicationHandler.doTestDetails-seed#[9802D92CA5285819]) [    ] o.a.s.h.c.HttpShardHandlerFactory created with socketTimeout : 90000,urlScheme : ,connTimeout : 15000,maxConnectionsPerHost : 20,maxConnections : 10000,corePoolSize : 0,maximumPoolSize : 2147483647,maxThreadIdleTime : 5,sizeOfQueue : -1,fairnessPolicy : false,useRetries : false,
   [junit4]   2> 104104 INFO  (TEST-TestReplicationHandler.doTestDetails-seed#[9802D92CA5285819]) [    ] o.a.s.u.UpdateShardHandler Creating UpdateShardHandler HTTP client with params: socketTimeout=340000&connTimeout=45000&retry=true
   [junit4]   2> 104105 INFO  (TEST-TestReplicationHandler.doTestDetails-seed#[9802D92CA5285819]) [    ] o.a.s.l.LogWatcher SLF4J impl is org.slf4j.impl.Log4jLoggerFactory
   [junit4]   2> 104105 INFO  (TEST-TestReplicationHandler.doTestDetails-seed#[9802D92CA5285819]) [    ] o.a.s.l.LogWatcher Registering Log Listener [Log4j (org.slf4j.impl.Log4jLoggerFactory)]
   [junit4]   2> 104105 INFO  (TEST-TestReplicationHandler.doTestDetails-seed#[9802D92CA5285819]) [    ] o.a.s.c.CoreContainer Security conf doesn't exist. Skipping setup for authorization module.
   [junit4]   2> 104105 INFO  (TEST-TestReplicationHandler.doTestDetails-seed#[9802D92CA5285819]) [    ] o.a.s.c.CoreContainer No authentication plugin used.
   [junit4]   2> 104106 INFO  (TEST-TestReplicationHandler.doTestDetails-seed#[9802D92CA5285819]) [    ] o.a.s.c.CorePropertiesLocator Looking for core definitions underneath /Users/jenkins/workspace/Lucene-Solr-6.x-MacOSX/solr/build/solr-core/test/J0/temp/solr.handler.TestReplicationHandler_9802D92CA5285819-001/solr-instance-001/.
   [junit4]   2> 104108 INFO  (TEST-TestReplicationHandler.doTestDetails-seed#[9802D92CA5285819]) [    ] o.a.s.c.CoreDescriptor Created CoreDescriptor: {name=collection1, config=solrconfig.xml, loadOnStartup=true, schema=schema.xml, configSetProperties=configsetprops.json, transient=false, dataDir=data/}
   [junit4]   2> 104108 INFO  (TEST-TestReplicationHandler.doTestDetails-seed#[9802D92CA5285819]) [    ] o.a.s.c.CorePropertiesLocator Found core collection1 in /Users/jenkins/workspace/Lucene-Solr-6.x-MacOSX/solr/build/solr-core/test/J0/temp/solr.handler.TestReplicationHandler_9802D92CA5285819-001/solr-instance-001/./collection1
   [junit4]   2> 104108 INFO  (TEST-TestReplicationHandler.doTestDetails-seed#[9802D92CA5285819]) [    ] o.a.s.c.CorePropertiesLocator Found 1 core definitions
   [junit4]   2> 104109 INFO  (TEST-TestReplicationHandler.doTestDetails-seed#[9802D92CA5285819]) [    ] o.a.s.s.SolrDispatchFilter user.dir=/Users/jenkins/workspace/Lucene-Solr-6.x-MacOSX/solr/build/solr-core/test/J0
   [junit4]   2> 104109 INFO  (coreLoadExecutor-273-thread-1) [    ] o.a.s.c.SolrResourceLoader new SolrResourceLoader for directory: '/Users/jenkins/workspace/Lucene-Solr-6.x-MacOSX/solr/build/solr-core/test/J0/temp/solr.handler.TestReplicationHandler_9802D92CA5285819-001/solr-instance-001/collection1'
   [junit4]   2> 104109 INFO  (TEST-TestReplicationHandler.doTestDetails-seed#[9802D92CA5285819]) [    ] o.a.s.s.SolrDispatchFilter SolrDispatchFilter.init() done
   [junit4]   2> 104109 INFO  (coreLoadExecutor-273-thread-1) [    ] o.a.s.c.SolrResourceLoader JNDI not configured for solr (NoInitialContextEx)
   [junit4]   2> 104110 INFO  (coreLoadExecutor-273-thread-1) [    ] o.a.s.c.SolrResourceLoader solr home defaulted to 'solr/' (could not find system property or JNDI)
   [junit4]   2> 104127 INFO  (coreLoadExecutor-273-thread-1) [    ] o.a.s.c.SolrConfig current version of requestparams : -1
   [junit4]   2> 104129 WARN  (coreLoadExecutor-273-thread-1) [    ] o.a.s.c.Config Beginning with Solr 5.5, <mergePolicy> is deprecated, use <mergePolicyFactory> instead.
   [junit4]   2> 104129 INFO  (coreLoadExecutor-273-thread-1) [    ] o.a.s.c.SolrConfig Using Lucene MatchVersion: 6.1.0
   [junit4]   2> 104134 INFO  (coreLoadExecutor-273-thread-1) [    ] o.a.s.c.SolrConfig Loaded SolrConfig: solrconfig.xml
   [junit4]   2> 104137 INFO  (coreLoadExecutor-273-thread-1) [    ] o.a.s.s.IndexSchema [collection1] Schema name=test
   [junit4]   2> 104142 INFO  (coreLoadExecutor-273-thread-1) [    ] o.a.s.s.IndexSchema unique key field: id
   [junit4]   2> 104151 INFO  (coreLoadExecutor-273-thread-1) [    ] o.a.s.c.ConfigSetProperties Did not find ConfigSet properties, assuming default properties: Can't find resource 'configsetprops.json' in classpath or '/Users/jenkins/workspace/Lucene-Solr-6.x-MacOSX/solr/build/solr-core/test/J0/temp/solr.handler.TestReplicationHandler_9802D92CA5285819-001/solr-instance-001/collection1'
   [junit4]   2> 104151 INFO  (coreLoadExecutor-273-thread-1) [    ] o.a.s.c.CoreContainer Creating SolrCore 'collection1' using configuration from instancedir /Users/jenkins/workspace/Lucene-Solr-6.x-MacOSX/solr/build/solr-core/test/J0/temp/solr.handler.TestReplicationHandler_9802D92CA5285819-001/solr-instance-001/./collection1
   [junit4]   2> 104151 INFO  (coreLoadExecutor-273-thread-1) [    x:collection1] o.a.s.c.SolrCore org.apache.solr.core.MockDirectoryFactory
   [junit4]   2> 104152 INFO  (coreLoadExecutor-273-thread-1) [    x:collection1] o.a.s.c.SolrCore [[collection1] ] Opening new SolrCore at [/Users/jenkins/workspace/Lucene-Solr-6.x-MacOSX/solr/build/solr-core/test/J0/temp/solr.handler.TestReplicationHandler_9802D92CA5285819-001/solr-instance-001/collection1], dataDir=[/Users/jenkins/workspace/Lucene-Solr-6.x-MacOSX/solr/build/solr-core/test/J0/temp/solr.handler.TestReplicationHandler_9802D92CA5285819-001/solr-instance-001/./collection1/data/]
   [junit4]   2> 104152 INFO  (coreLoadExecutor-273-thread-1) [    x:collection1] o.a.s.c.SolrCore JMX monitoring not detected for core: collection1
   [junit4]   2> 104152 INFO  (coreLoadExecutor-273-thread-1) [    x:collection1] o.a.s.c.CachingDirectoryFactory return new directory for /Users/jenkins/workspace/Lucene-Solr-6.x-MacOSX/solr/build/solr-core/test/J0/temp/solr.handler.TestReplicationHandler_9802D92CA5285819-001/solr-instance-001/./collection1/data
   [junit4]   2> 104162 INFO  (coreLoadExecutor-273-thread-1) [    x:collection1] o.a.s.c.SolrCore New index directory detected: old=null new=/Users/jenkins/workspace/Lucene-Solr-6.x-MacOSX/solr/build/solr-core/test/J0/temp/solr.handler.TestReplicationHandler_9802D92CA5285819-001/solr-instance-001/./collection1/data/index/
   [junit4]   2> 104162 WARN  (coreLoadExecutor-273-thread-1) [    x:collection1] o.a.s.c.SolrCore [collection1] Solr index directory '/Users/jenkins/workspace/Lucene-Solr-6.x-MacOSX/solr/build/solr-core/test/J0/temp/solr.handler.TestReplicationHandler_9802D92CA5285819-001/solr-instance-001/./collection1/data/index' doesn't exist. Creating new index...
   [junit4]   2> 104163 INFO  (coreLoadExecutor-273-thread-1) [    x:collection1] o.a.s.c.CachingDirectoryFactory return new directory for /Users/jenkins/workspace/Lucene-Solr-6.x-MacOSX/solr/build/solr-core/test/J0/temp/solr.handler.TestReplicationHandler_9802D92CA5285819-001/solr-instance-001/./collection1/data/index
   [junit4]   2> 104163 INFO  (coreLoadExecutor-273-thread-1) [    x:collection1] o.a.s.u.RandomMergePolicy RandomMergePolicy wrapping class org.apache.lucene.index.TieredMergePolicy: [TieredMergePolicy: maxMergeAtOnce=46, maxMergeAtOnceExplicit=38, maxMergedSegmentMB=1.1591796875, floorSegmentMB=1.056640625, forceMergeDeletesPctAllowed=7.875569317504699, segmentsPerTier=41.0, maxCFSSegmentSizeMB=8.796093022207999E12, noCFSRatio=0.649508236792487
   [junit4]   2> 104174 INFO  (coreLoadExecutor-273-thread-1) [    x:collection1] o.a.s.c.SolrDeletionPolicy SolrDeletionPolicy.onCommit: commits: num=1
   [junit4]   2> 	commit{dir=MockDirectoryWrapper(RAMDirectory@4537f4ca lockFactory=org.apache.lucene.store.SingleInstanceLockFactory@4b4834a),segFN=segments_1,generation=1}
   [junit4]   2> 104174 INFO  (coreLoadExecutor-273-thread-1) [    x:collection1] o.a.s.c.SolrDeletionPolicy newest commit generation = 1
   [junit4]   2> 104174 INFO  (OldIndexDirectoryCleanupThreadForCore-collection1) [    x:collection1] o.a.s.c.SolrCore Looking for old index directories to cleanup for core collection1 in /Users/jenkins/workspace/Lucene-Solr-6.x-MacOSX/solr/build/solr-core/test/J0/temp/solr.handler.TestReplicationHandler_9802D92CA5285819-001/solr-instance-001/./collection1/data/
   [junit4]   2> 104176 INFO  (coreLoadExecutor-273-thread-1) [    x:collection1] o.a.s.c.SolrCore no updateRequestProcessorChain defined as default, creating implicit default
   [junit4]   2> 104180 INFO  (coreLoadExecutor-273-thread-1) [    x:collection1] o.a.s.h.l.XMLLoader xsltCacheLifetimeSeconds=60
   [junit4]   2> 104181 INFO  (coreLoadExecutor-273-thread-1) [    x:collection1] o.a.s.h.l.XMLLoader xsltCacheLifetimeSeconds=60
   [junit4]   2> 104182 INFO  (coreLoadExecutor-273-thread-1) [    x:collection1] o.a.s.h.l.XMLLoader xsltCacheLifetimeSeconds=60
   [junit4]   2> 104182 INFO  (coreLoadExecutor-273-thread-1) [    x:collection1] o.a.s.h.l.XMLLoader xsltCacheLifetimeSeconds=60
   [junit4]   2> 104184 INFO  (coreLoadExecutor-273-thread-1) [    x:collection1] o.a.s.c.PluginBag requestHandler : 'lazy' created with startup=lazy 
   [junit4]   2> 104184 INFO  (coreLoadExecutor-273-thread-1) [    x:collection1] o.a.s.c.RequestHandlers Registered paths: /admin/mbeans,standard,lazy,/update/json/docs,/admin/luke,/export,/get,/admin/properties,/update/json,/admin/threads,/update/csv,/sql,/admin/segments,/admin/system,/replication,defaults,/config,/stream,/schema,/admin/plugins,/admin/logging,/admin/ping,/update,/admin/file
   [junit4]   2> 104184 INFO  (coreLoadExecutor-273-thread-1) [    x:collection1] o.a.s.c.SolrCore Using default statsCache cache: org.apache.solr.search.stats.LocalStatsCache
   [junit4]   2> 104185 INFO  (coreLoadExecutor-273-thread-1) [    x:collection1] o.a.s.u.CommitTracker Hard AutoCommit: disabled
   [junit4]   2> 104185 INFO  (coreLoadExecutor-273-thread-1) [    x:collection1] o.a.s.u.CommitTracker Soft AutoCommit: disabled
   [junit4]   2> 104185 INFO  (coreLoadExecutor-273-thread-1) [    x:collection1] o.a.s.u.RandomMergePolicy RandomMergePolicy wrapping class org.apache.lucene.index.LogByteSizeMergePolicy: [LogByteSizeMergePolicy: minMergeSize=1677721, mergeFactor=23, maxMergeSize=2147483648, maxMergeSizeForForcedMerge=9223372036854775807, calibrateSizeByDeletes=false, maxMergeDocs=2147483647, maxCFSSegmentSizeMB=8.796093022207999E12, noCFSRatio=0.0]
   [junit4]   2> 104189 INFO  (coreLoadExecutor-273-thread-1) [    x:collection1] o.a.s.c.SolrDeletionPolicy SolrDeletionPolicy.onInit: commits: num=1
   [junit4]   2> 	commit{dir=MockDirectoryWrapper(RAMDirectory@4537f4ca lockFactory=org.apache.lucene.store.SingleInstanceLockFactory@4b4834a),segFN=segments_1,generation=1}
   [junit4]   2> 104189 INFO  (coreLoadExecutor-273-thread-1) [    x:collection1] o.a.s.c.SolrDeletionPolicy newest commit generation = 1
   [junit4]   2> 104190 INFO  (coreLoadExecutor-273-thread-1) [    x:collection1] o.a.s.s.SolrIndexSearcher Opening [Searcher@23b311b0[collection1] main]
   [junit4]   2> 104190 INFO  (coreLoadExecutor-273-thread-1) [    x:collection1] o.a.s.r.ManagedResourceStorage File-based storage initialized to use dir: /Users/jenkins/workspace/Lucene-Solr-6.x-MacOSX/solr/build/solr-core/test/J0/temp/solr.handler.TestReplicationHandler_9802D92CA5285819-001/solr-instance-001/collection1/conf
   [junit4]   2> 104190 INFO  (coreLoadExecutor-273-thread-1) [    x:collection1] o.a.s.r.RestManager Initializing RestManager with initArgs: {storageDir=/Users/jenkins/workspace/Lucene-Solr-6.x-MacOSX/solr/build/solr-core/test/J0/temp/solr.handler.TestReplicationHandler_9802D92CA5285819-001/solr-instance-001/collection1/conf}
   [junit4]   2> 104190 INFO  (coreLoadExecutor-273-thread-1) [    x:collection1] o.a.s.r.ManagedResourceStorage Reading _rest_managed.json using file:dir=/Users/jenkins/workspace/Lucene-Solr-6.x-MacOSX/solr/build/solr-core/test/J0/temp/solr.handler.TestReplicationHandler_9802D92CA5285819-001/solr-instance-001/collection1/conf
   [junit4]   2> 104190 INFO  (coreLoadExecutor-273-thread-1) [    x:collection1] o.a.s.r.RestManager Initializing 0 registered ManagedResources
   [junit4]   2> 104191 INFO  (coreLoadExecutor-273-thread-1) [    x:collection1] o.a.s.h.ReplicationHandler Replication enabled for following config files: schema.xml,xslt/dummy.xsl
   [junit4]   2> 104191 INFO  (coreLoadExecutor-273-thread-1) [    x:collection1] o.a.s.h.ReplicationHandler Commits will be reserved for  10000
   [junit4]   2> 104191 INFO  (searcherExecutor-274-thread-1-processing-x:collection1) [    x:collection1] o.a.s.c.SolrCore [collection1] Registered new searcher Searcher@23b311b0[collection1] main{ExitableDirectoryReader(UninvertingDirectoryReader())}
   [junit4]   2> 104191 INFO  (coreLoadExecutor-273-thread-1) [    x:collection1] o.a.s.c.CoreContainer registering core: collection1
   [junit4]   2> 104611 INFO  (TEST-TestReplicationHandler.doTestDetails-seed#[9802D92CA5285819]) [    ] o.a.s.SolrTestCaseJ4 Writing core.properties file to /Users/jenkins/workspace/Lucene-Solr-6.x-MacOSX/solr/build/solr-core/test/J0/temp/solr.handler.TestReplicationHandler_9802D92CA5285819-001/solr-instance-002/collection1
   [junit4]   2> 104618 INFO  (TEST-TestReplicationHandler.doTestDetails-seed#[9802D92CA5285819]) [    ] o.e.j.s.Server jetty-9.3.8.v20160314
   [junit4]   2> 104620 INFO  (TEST-TestReplicationHandler.doTestDetails-seed#[9802D92CA5285819]) [    ] o.e.j.s.h.ContextHandler Started o.e.j.s.ServletContextHandler@14358267{/solr,null,AVAILABLE}
   [junit4]   2> 104621 INFO  (TEST-TestReplicationHandler.doTestDetails-seed#[9802D92CA5285819]) [    ] o.e.j.s.ServerConnector Started ServerConnector@5a05e2cd{HTTP/1.1,[http/1.1]}{127.0.0.1:50368}
   [junit4]   2> 104621 INFO  (TEST-TestReplicationHandler.doTestDetails-seed#[9802D92CA5285819]) [    ] o.e.j.s.Server Started @110614ms
   [junit4]   2> 104621 INFO  (TEST-TestReplicationHandler.doTestDetails-seed#[9802D92CA5285819]) [    ] o.a.s.c.s.e.JettySolrRunner Jetty properties: {solr.data.dir=/Users/jenkins/workspace/Lucene-Solr-6.x-MacOSX/solr/build/solr-core/test/J0/temp/solr.handler.TestReplicationHandler_9802D92CA5285819-001/solr-instance-002/collection1/data, hostContext=/solr, hostPort=50368}
   [junit4]   2> 104621 INFO  (TEST-TestReplicationHandler.doTestDetails-seed#[9802D92CA5285819]) [    ] o.a.s.s.SolrDispatchFilter SolrDispatchFilter.init(): sun.misc.Launcher$AppClassLoader@4554617c
   [junit4]   2> 104622 INFO  (TEST-TestReplicationHandler.doTestDetails-seed#[9802D92CA5285819]) [    ] o.a.s.c.SolrResourceLoader new SolrResourceLoader for directory: '/Users/jenkins/workspace/Lucene-Solr-6.x-MacOSX/solr/build/solr-core/test/J0/temp/solr.handler.TestReplicationHandler_9802D92CA5285819-001/solr-instance-002'
   [junit4]   2> 104622 INFO  (TEST-TestReplicationHandler.doTestDetails-seed#[9802D92CA5285819]) [    ] o.a.s.c.SolrResourceLoader JNDI not configured for solr (NoInitialContextEx)
   [junit4]   2> 104622 INFO  (TEST-TestReplicationHandler.doTestDetails-seed#[9802D92CA5285819]) [    ] o.a.s.c.SolrResourceLoader solr home defaulted to 'solr/' (could not find system property or JNDI)
   [junit4]   2> 104622 INFO  (TEST-TestReplicationHandler.doTestDetails-seed#[9802D92CA5285819]) [    ] o.a.s.c.SolrXmlConfig Loading container configuration from /Users/jenkins/workspace/Lucene-Solr-6.x-MacOSX/solr/build/solr-core/test/J0/temp/solr.handler.TestReplicationHandler_9802D92CA5285819-001/solr-instance-002/solr.xml
   [junit4]   2> 104641 INFO  (TEST-TestReplicationHandler.doTestDetails-seed#[9802D92CA5285819]) [    ] o.a.s.c.CorePropertiesLocator Config-defined core root directory: /Users/jenkins/workspace/Lucene-Solr-6.x-MacOSX/solr/build/solr-core/test/J0/temp/solr.handler.TestReplicationHandler_9802D92CA5285819-001/solr-instance-002/.
   [junit4]   2> 104641 INFO  (TEST-TestReplicationHandler.doTestDetails-seed#[9802D92CA5285819]) [    ] o.a.s.c.CoreContainer New CoreContainer 509241744
   [junit4]   2> 104641 INFO  (TEST-TestReplicationHandler.doTestDetails-seed#[9802D92CA5285819]) [    ] o.a.s.c.CoreContainer Loading cores into CoreContainer [instanceDir=/Users/jenkins/workspace/Lucene-Solr-6.x-MacOSX/solr/build/solr-core/test/J0/temp/solr.handler.TestReplicationHandler_9802D92CA5285819-001/solr-instance-002]
   [junit4]   2> 104641 WARN  (TEST-TestReplicationHandler.doTestDetails-seed#[9802D92CA5285819]) [    ] o.a.s.c.CoreContainer Couldn't add files from /Users/jenkins/workspace/Lucene-Solr-6.x-MacOSX/solr/build/solr-core/test/J0/temp/solr.handler.TestReplicationHandler_9802D92CA5285819-001/solr-instance-002/lib to classpath: /Users/jenkins/workspace/Lucene-Solr-6.x-MacOSX/solr/build/solr-core/test/J0/temp/solr.handler.TestReplicationHandler_9802D92CA5285819-001/solr-instance-002/lib
   [junit4]   2> 104642 INFO  (TEST-TestReplicationHandler.doTestDetails-seed#[9802D92CA5285819]) [    ] o.a.s.h.c.HttpShardHandlerFactory created with socketTimeout : 90000,urlScheme : ,connTimeout : 15000,maxConnectionsPerHost : 20,maxConnections : 10000,corePoolSize : 0,maximumPoolSize : 2147483647,maxThreadIdleTime : 5,sizeOfQueue : -1,fairnessPolicy : false,useRetries : false,
   [junit4]   2> 104643 INFO  (TEST-TestReplicationHandler.doTestDetails-seed#[9802D92CA5285819]) [    ] o.a.s.u.UpdateShardHandler Creating UpdateShardHandler HTTP client with params: socketTimeout=340000&connTimeout=45000&retry=true
   [junit4]   2> 104643 INFO  (TEST-TestReplicationHandler.doTestDetails-seed#[9802D92CA5285819]) [    ] o.a.s.l.LogWatcher SLF4J impl is org.slf4j.impl.Log4jLoggerFactory
   [junit4]   2> 104643 INFO  (TEST-TestReplicationHandler.doTestDetails-seed#[9802D92CA5285819]) [    ] o.a.s.l.LogWatcher Registering Log Listener [Log4j (org.slf4j.impl.Log4jLoggerFactory)]
   [junit4]   2> 104643 INFO  (TEST-TestReplicationHandler.doTestDetails-seed#[9802D92CA5285819]) [    ] o.a.s.c.CoreContainer Security conf doesn't exist. Skipping setup for authorization module.
   [junit4]   2> 104643 INFO  (TEST-TestReplicationHandler.doTestDetails-seed#[9802D92CA5285819]) [    ] o.a.s.c.CoreContainer No authentication plugin used.
   [junit4]   2> 104644 INFO  (TEST-TestReplicationHandler.doTestDetails-seed#[9802D92CA5285819]) [    ] o.a.s.c.CorePropertiesLocator Looking for core definitions underneath /Users/jenkins/workspace/Lucene-Solr-6.x-MacOSX/solr/build/solr-core/test/J0/temp/solr.handler.TestReplicationHandler_9802D92CA5285819-001/solr-instance-002/.
   [junit4]   2> 104646 INFO  (TEST-TestReplicationHandler.doTestDetails-seed#[9802D92CA5285819]) [    ] o.a.s.c.CoreDescriptor Created CoreDescriptor: {name=collection1, config=solrconfig.xml, loadOnStartup=true, schema=schema.xml, configSetProperties=configsetprops.json, transient=false, dataDir=data/}
   [junit4]   2> 104646 INFO  (TEST-TestReplicationHandler.doTestDetails-seed#[9802D92CA5285819]) [    ] o.a.s.c.CorePropertiesLocator Found core collection1 in /Users/jenkins/workspace/Lucene-Solr-6.x-MacOSX/solr/build/solr-core/test/J0/temp/solr.handler.TestReplicationHandler_9802D92CA5285819-001/solr-instance-002/./collection1
   [junit4]   2> 104646 INFO  (TEST-TestReplicationHandler.doTestDetails-seed#[9802D92CA5285819]) [    ] o.a.s.c.CorePropertiesLocator Found 1 core definitions
   [junit4]   2> 104647 INFO  (coreLoadExecutor-283-thread-1) [    ] o.a.s.c.SolrResourceLoader new SolrResourceLoader for directory: '/Users/jenkins/workspace/Lucene-Solr-6.x-MacOSX/solr/build/solr-core/test/J0/temp/solr.handler.TestReplicationHandler_9802D92CA5285819-001/solr-instance-002/collection1'
   [junit4]   2> 104648 INFO  (TEST-TestReplicationHandler.doTestDetails-seed#[9802D92CA5285819]) [    ] o.a.s.s.SolrDispatchFilter user.dir=/Users/jenkins/workspace/Lucene-Solr-6.x-MacOSX/solr/build/solr-core/test/J0
   [junit4]   2> 104648 INFO  (TEST-TestReplicationHandler.doTestDetails-seed#[9802D92CA5285819]) [    ] o.a.s.s.SolrDispatchFilter SolrDispatchFilter.init() done
   [junit4]   2> 104648 INFO  (coreLoadExecutor-283-thread-1) [    ] o.a.s.c.SolrResourceLoader JNDI not configured for solr (NoInitialContextEx)
   [junit4]   2> 104648 INFO  (coreLoadExecutor-283-thread-1) [    ] o.a.s.c.SolrResourceLoader solr home defaulted to 'solr/' (could not find system property or JNDI)
   [junit4]   2> 104655 INFO  (coreLoadExecutor-283-thread-1) [    ] o.a.s.c.SolrConfig current version of requestparams : -1
   [junit4]   2> 104657 WARN  (coreLoadExecutor-283-thread-1) [    ] o.a.s.c.Config Beginning with Solr 5.5, <mergePolicy> is deprecated, use <mergePolicyFactory> instead.
   [junit4]   2> 104658 INFO  (coreLoadExecutor-283-thread-1) [    ] o.a.s.c.SolrConfig Using Lucene MatchVersion: 6.1.0
   [junit4]   2> 104662 INFO  (coreLoadExecutor-283-thread-1) [    ] o.a.s.c.SolrConfig Loaded SolrConfig: solrconfig.xml
   [junit4]   2> 104665 INFO  (coreLoadExecutor-283-thread-1) [    ] o.a.s.s.IndexSchema [collection1] Schema name=test
   [junit4]   2> 104667 INFO  (coreLoadExecutor-283-thread-1) [    ] o.a.s.s.IndexSchema unique key field: id
   [junit4]   2> 104669 INFO  (coreLoadExecutor-283-thread-1) [    ] o.a.s.c.ConfigSetProperties Did not find ConfigSet properties, assuming default properties: Can't find resource 'configsetprops.json' in classpath or '/Users/jenkins/workspace/Lucene-Solr-6.x-MacOSX/solr/build/solr-core/test/J0/temp/solr.handler.TestReplicationHandler_9802D92CA5285819-001/solr-instance-002/collection1'
   [junit4]   2> 104669 INFO  (coreLoadExecutor-283-thread-1) [    ] o.a.s.c.CoreContainer Creating SolrCore 'collection1' using configuration from instancedir /Users/jenkins/workspace/Lucene-Solr-6.x-MacOSX/solr/build/solr-core/test/J0/temp/solr.handler.TestReplicationHandler_9802D92CA5285819-001/solr-instance-002/./collection1
   [junit4]   2> 104669 INFO  (coreLoadExecutor-283-thread-1) [    x:collection1] o.a.s.c.SolrCore org.apache.solr.core.MockDirectoryFactory
   [junit4]   2> 104669 INFO  (coreLoadExecutor-283-thread-1) [    x:collection1] o.a.s.c.SolrCore [[collection1] ] Opening new SolrCore at [/Users/jenkins/workspace/Lucene-Solr-6.x-MacOSX/solr/build/solr-core/test/J0/temp/solr.handler.TestReplicationHandler_9802D92CA5285819-001/solr-instance-002/collection1], dataDir=[/Users/jenkins/workspace/Lucene-Solr-6.x-MacOSX/solr/build/solr-core/test/J0/temp/solr.handler.TestReplicationHandler_9802D92CA5285819-001/solr-instance-002/./collection1/data/]
   [junit4]   2> 104669 INFO  (coreLoadExecutor-283-thread-1) [    x:collection1] o.a.s.c.SolrCore JMX monitoring not detected for core: collection1
   [junit4]   2> 104669 INFO  (coreLoadExecutor-283-thread-1) [    x:collection1] o.a.s.c.CachingDirectoryFactory return new directory for /Users/jenkins/workspace/Lucene-Solr-6.x-MacOSX/solr/build/solr-core/test/J0/temp/solr.handler.TestReplicationHandler_9802D92CA5285819-001/solr-instance-002/./collection1/data
   [junit4]   2> 104670 INFO  (coreLoadExecutor-283-thread-1) [    x:collection1] o.a.s.c.SolrCore New index directory detected: old=null new=/Users/jenkins/workspace/Lucene-Solr-6.x-MacOSX/solr/build/solr-core/test/J0/temp/solr.handler.TestReplicationHandler_9802D92CA5285819-001/solr-instance-002/./collection1/data/index/
   [junit4]   2> 104670 WARN  (coreLoadExecutor-283-thread-1) [    x:collection1] o.a.s.c.SolrCore [collection1] Solr index directory '/Users/jenkins/workspace/Lucene-Solr-6.x-MacOSX/solr/build/solr-core/test/J0/temp/solr.handler.TestReplicationHandler_9802D92CA5285819-001/solr-instance-002/./collection1/data/index' doesn't exist. Creating new index...
   [junit4]   2> 104670 INFO  (coreLoadExecutor-283-thread-1) [    x:collection1] o.a.s.c.CachingDirectoryFactory return new directory for /Users/jenkins/workspace/Lucene-Solr-6.x-MacOSX/solr/build/solr-core/test/J0/temp/solr.handler.TestReplicationHandler_9802D92CA5285819-001/solr-instance-002/./collection1/data/index
   [junit4]   2> 104670 INFO  (coreLoadExecutor-283-thread-1) [    x:collection1] o.a.s.u.RandomMergePolicy RandomMergePolicy wrapping class org.apache.lucene.index.TieredMergePolicy: [TieredMergePolicy: maxMergeAtOnce=46, maxMergeAtOnceExplicit=38, maxMergedSegmentMB=1.1591796875, floorSegmentMB=1.056640625, forceMergeDeletesPctAllowed=7.875569317504699, segmentsPerTier=41.0, maxCFSSegmentSizeMB=8.796093022207999E12, noCFSRatio=0.649508236792487
   [junit4]   2> 104670 INFO  (coreLoadExecutor-283-thread-1) [    x:collection1] o.a.s.c.SolrDeletionPolicy SolrDeletionPolicy.onCommit: commits: num=1
   [junit4]   2> 	commit{dir=MockDirectoryWrapper(RAMDirectory@69a8e1a8 lockFactory=org.apache.lucene.store.SingleInstanceLockFactory@2f891ae5),segFN=segments_1,generation=1}
   [junit4]   2> 104670 INFO  (coreLoadExecutor-283-thread-1) [    x:collection1] o.a.s.c.SolrDeletionPolicy newest commit generation = 1
   [junit4]   2> 104671 INFO  (OldIndexDirectoryCleanupThreadForCore-collection1) [    x:collection1] o.a.s.c.SolrCore Looking for old index directories to cleanup for core collection1 in /Users/jenkins/workspace/Lucene-Solr-6.x-MacOSX/solr/build/solr-core/test/J0/temp/solr.handler.TestReplicationHandler_9802D92CA5285819-001/solr-instance-002/./collection1/data/
   [junit4]   2> 104673 INFO  (coreLoadExecutor-283-thread-1) [    x:collection1] o.a.s.c.SolrCore no updateRequestProcessorChain defined as default, creating implicit default
   [junit4]   2> 104674 INFO  (coreLoadExecutor-283-thread-1) [    x:collection1] o.a.s.h.l.XMLLoader xsltCacheLifetimeSeconds=60
   [junit4]   2> 104675 INFO  (coreLoadExecutor-283-thread-1) [    x:collection1] o.a.s.h.l.XMLLoader xsltCacheLifetimeSeconds=60
   [junit4]   2> 104676 INFO  (coreLoadExecutor-283-thread-1) [    x:collection1] o.a.s.h.l.XMLLoader xsltCacheLifetimeSeconds=60
   [junit4]   2> 104677 INFO  (coreLoadExecutor-283-thread-1) [    x:collection1] o.a.s.h.l.XMLLoader xsltCacheLifetimeSeconds=60
   [junit4]   2> 104679 INFO  (coreLoadExecutor-283-thread-1) [    x:collection1] o.a.s.c.PluginBag requestHandler : 'lazy' created with startup=lazy 
   [junit4]   2> 104679 INFO  (coreLoadExecutor-283-thread-1) [    x:collection1] o.a.s.c.RequestHandlers Registered paths: /admin/mbeans,standard,lazy,/update/json/docs,/admin/luke,/export,/get,/admin/properties,/update/json,/admin/threads,/update/csv,/sql,/admin/segments,/admin/system,/replication,defaults,/config,/stream,/schema,/admin/plugins,/admin/logging,/admin/ping,/update,/admin/file
   [junit4]   2> 104679 INFO  (coreLoadExecutor-283-thread-1) [    x:collection1] o.a.s.c.SolrCore Using default statsCache cache: org.apache.solr.search.stats.LocalStatsCache
   [junit4]   2> 104679 INFO  (coreLoadExecutor-283-thread-1) [    x:collection1] o.a.s.u.CommitTracker Hard AutoCommit: disabled
   [junit4]   2> 104679 INFO  (coreLoadExecutor-283-thread-1) [    x:collection1] o.a.s.u.CommitTracker Soft AutoCommit: disabled
   [junit4]   2> 104679 INFO  (coreLoadExecutor-283-thread-1) [    x:collection1] o.a.s.u.RandomMergePolicy RandomMergePolicy wrapping class org.apache.lucene.index.LogByteSizeMergePolicy: [LogByteSizeMergePolicy: minMergeSize=1677721, mergeFactor=23, maxMergeSize=2147483648, maxMergeSizeForForcedMerge=9223372036854775807, calibrateSizeByDeletes=false, maxMergeDocs=2147483647, maxCFSSegmentSizeMB=8.796093022207999E12, noCFSRatio=0.0]
   [junit4]   2> 104680 INFO  (coreLoadExecutor-283-thread-1) [    x:collection1] o.a.s.c.SolrDeletionPolicy SolrDeletionPolicy.onInit: commits: num=1
   [junit4]   2> 	commit{dir=MockDirectoryWrapper(RAMDirectory@69a8e1a8 lockFactory=org.apache.lucene.store.SingleInstanceLockFactory@2f891ae5),segFN=segments_1,generation=1}
   [junit4]   2> 104680 INFO  (coreLoadExecutor-283-thread-1) [    x:collection1] o.a.s.c.SolrDeletionPolicy newest commit generation = 1
   [junit4]   2> 104680 INFO  (coreLoadExecutor-283-thread-1) [    x:collection1] o.a.s.s.SolrIndexSearcher Opening [Searcher@780393d0[collection1] main]
   [junit4]   2> 104680 INFO  (coreLoadExecutor-283-thread-1) [    x:collection1] o.a.s.r.ManagedResourceStorage File-based storage initialized to use dir: /Users/jenkins/workspace/Lucene-Solr-6.x-MacOSX/solr/build/solr-core/test/J0/temp/solr.handler.TestReplicationHandler_9802D92CA5285819-001/solr-instance-002/collection1/conf
   [junit4]   2> 104680 INFO  (coreLoadExecutor-283-thread-1) [    x:collection1] o.a.s.r.RestManager Initializing RestManager with initArgs: {storageDir=/Users/jenkins/workspace/Lucene-Solr-6.x-MacOSX/solr/build/solr-core/test/J0/temp/solr.handler.TestReplicationHandler_9802D92CA5285819-001/solr-instance-002/collection1/conf}
   [junit4]   2> 104680 INFO  (coreLoadExecutor-283-thread-1) [    x:collection1] o.a.s.r.ManagedResourceStorage Reading _rest_managed.json using file:dir=/Users/jenkins/workspace/Lucene-Solr-6.x-MacOSX/solr/build/solr-core/test/J0/temp/solr.handler.TestReplicationHandler_9802D92CA5285819-001/solr-instance-002/collection1/conf
   [junit4]   2> 104681 INFO  (coreLoadExecutor-283-thread-1) [    x:collection1] o.a.s.r.RestManager Initializing 0 registered ManagedResources
   [junit4]   2> 104683 INFO  (coreLoadExecutor-283-thread-1) [    x:collection1] o.a.s.h.ReplicationHandler Poll scheduled at an interval of 1000ms
   [junit4]   2> 104684 INFO  (coreLoadExecutor-283-thread-1) [    x:collection1] o.a.s.c.CoreContainer registering core: collection1
   [junit4]   2> 104684 INFO  (searcherExecutor-284-thread-1-processing-x:collection1) [    x:collection1] o.a.s.c.SolrCore [collection1] Registered new searcher Searcher@780393d0[collection1] main{ExitableDirectoryReader(UninvertingDirectoryReader())}
   [junit4]   2> 104991 INFO  (qtp932891691-525) [    x:collection1] o.a.s.c.S.Request [collection1]  webapp=/solr path=/replication params={qt=/replication&wt=javabin&version=2&command=indexversion} status=0 QTime=0
   [junit4]   2> 105153 INFO  (qtp932891691-527) [    x:collection1] o.a.s.c.S.Request [collection1]  webapp=/solr path=/select params={q=*:*&sort=id+desc&wt=javabin&version=2} hits=0 status=0 QTime=0
   [junit4]   2> 105158 INFO  (qtp932891691-528) [    x:collection1] o.a.s.c.S.Request [collection1]  webapp=/solr path=/replication params={_trace=getDetails&qt=/replication&wt=javabin&version=2&command=details} status=0 QTime=1
   [junit4]   2> 105167 INFO  (qtp932891691-529) [    x:collection1] o.a.s.c.S.Request [collection1]  webapp=/solr path=/replication params={slave=false&qt=/replication&wt=javabin&version=2&command=details} status=0 QTime=0
   [junit4]   2> 105168 INFO  (qtp2074766188-542) [    x:collection1] o.a.s.c.S.Request [collection1]  webapp=/solr path=/replication params={_trace=getDetails&qt=/replication&wt=javabin&version=2&command=details} status=0 QTime=5
   [junit4]   2> 105174 INFO  (qtp932891691-530) [    x:collection1] o.a.s.u.p.LogUpdateProcessorFactory [collection1]  webapp=/solr path=/update params={wt=javabin&version=2}{add=[0]} 0 2
   [junit4]   2> 105178 INFO  (qtp932891691-526) [    x:collection1] o.a.s.u.DirectUpdateHandler2 start commit{,optimize=false,openSearcher=true,waitSearcher=true,expungeDeletes=false,softCommit=false,prepareCommit=false}
   [junit4]   2> 105181 INFO  (qtp932891691-526) [    x:collection1] o.a.s.c.SolrDeletionPolicy SolrDeletionPolicy.onCommit: commits: num=2
   [junit4]   2> 	commit{dir=MockDirectoryWrapper(RAMDirectory@4537f4ca lockFactory=org.apache.lucene.store.SingleInstanceLockFactory@4b4834a),segFN=segments_1,generation=1}
   [junit4]   2> 	commit{dir=MockDirectoryWrapper(RAMDirectory@4537f4ca lockFactory=org.apache.lucene.store.SingleInstanceLockFactory@4b4834a),segFN=segments_2,generation=2}
   [junit4]   2> 105182 INFO  (qtp932891691-526) [    x:collection1] o.a.s.c.SolrDeletionPolicy newest commit generation = 2
   [junit4]   2> 105183 INFO  (qtp932891691-526) [    x:collection1] o.a.s.s.SolrIndexSearcher Opening [Searcher@22f16813[collection1] main]
   [junit4]   2> 105183 INFO  (qtp932891691-526) [    x:collection1] o.a.s.u.DirectUpdateHandler2 end_commit_flush
   [junit4]   2> 105184 INFO  (searcherExecutor-274-thread-1-processing-x:collection1) [    x:collection1] o.a.s.c.SolrCore [collection1] Registered new searcher Searcher@22f16813[collection1] main{ExitableDirectoryReader(UninvertingDirectoryReader(Uninverting(_0(6.1.0):C1)))}
   [junit4]   2> 105184 INFO  (qtp932891691-526) [    x:collection1] o.a.s.u.p.LogUpdateProcessorFactory [collection1]  webapp=/solr path=/update params={waitSearcher=true&commit=true&softCommit=false&wt=javabin&version=2}{commit=} 0 6
   [junit4]   2> 105251 WARN  (explicit-fetchindex-cmd) [    x:collection1] o.a.s.h.IndexFetcher 'masterUrl' must be specified without the /replication suffix
   [junit4]   2> 105258 INFO  (qtp932891691-525) [    x:collection1] o.a.s.c.S.Request [collection1]  webapp=/solr path=/replication params={qt=/replication&wt=javabin&version=2&command=indexversion} status=0 QTime=0
   [junit4]   2> 105259 INFO  (explicit-fetchindex-cmd) [    x:collection1] o.a.s.h.IndexFetcher Master's generation: 2
   [junit4]   2> 105259 INFO  (explicit-fetchindex-cmd) [    x:collection1] o.a.s.h.IndexFetcher Slave's generation: 1
   [junit4]   2> 105259 INFO  (explicit-fetchindex-cmd) [    x:collection1] o.a.s.h.IndexFetcher Starting replication process
   [junit4]   2> 105265 WARN  (qtp932891691-523) [    x:collection1] o.a.s.h.ReplicationHandler Could not read checksum from index file: _0_MockRandom_0.sd
   [junit4]   2> org.apache.lucene.index.CorruptIndexException: misplaced codec footer (file truncated?): length=8 but footerLength==16 (resource=MockIndexInputWrapper(RAMInputStream(name=_0_MockRandom_0.sd)))
   [junit4]   2> 	at org.apache.lucene.codecs.CodecUtil.retrieveChecksum(CodecUtil.java:430)
   [junit4]   2> 	at org.apache.solr.handler.ReplicationHandler.getFileList(ReplicationHandler.java:564)
   [junit4]   2> 	at org.apache.solr.handler.ReplicationHandler.handleRequestBody(ReplicationHandler.java:252)
   [junit4]   2> 	at org.apache.solr.handler.RequestHandlerBase.handleRequest(RequestHandlerBase.java:155)
   [junit4]   2> 	at org.apache.solr.core.SolrCore.execute(SolrCore.java:2018)
   [junit4]   2> 	at org.apache.solr.servlet.HttpSolrCall.execute(HttpSolrCall.java:652)
   [junit4]   2> 	at org.apache.solr.servlet.HttpSolrCall.call(HttpSolrCall.java:460)
   [junit4]   2> 	at org.apache.solr.servlet.SolrDispatchFilter.doFilter(SolrDispatchFilter.java:229)
   [junit4]   2> 	at org.apache.solr.servlet.SolrDispatchFilter.doFilter(SolrDispatchFilter.java:184)
   [junit4]   2> 	at org.eclipse.jetty.servlet.ServletHandler$CachedChain.doFilter(ServletHandler.java:1676)
   [junit4]   2> 	at org.apache.solr.client.solrj.embedded.JettySolrRunner$DebugFilter.doFilter(JettySolrRunner.java:109)
   [junit4]   2> 	at org.eclipse.jetty.servlet.ServletHandler$CachedChain.doFilter(ServletHandler.java:1676)
   [junit4]   2> 	at org.eclipse.jetty.servlet.ServletHandler.doHandle(ServletHandler.java:581)
   [junit4]   2> 	at org.eclipse.jetty.server.session.SessionHandler.doHandle(SessionHandler.java:224)
   [junit4]   2> 	at org.eclipse.jetty.server.handler.ContextHandler.doHandle(ContextHandler.java:1160)
   [junit4]   2> 	at org.eclipse.jetty.servlet.ServletHandler.doScope(ServletHandler.java:511)
   [junit4]   2> 	at org.eclipse.jetty.server.session.SessionHandler.doScope(SessionHandler.java:185)
   [junit4]   2> 	at org.eclipse.jetty.server.handler.ContextHandler.doScope(ContextHandler.java:1092)
   [junit4]   2> 	at org.eclipse.jetty.server.handler.ScopedHandler.handle(ScopedHandler.java:141)
   [junit4]   2> 	at org.eclipse.jetty.server.handler.gzip.GzipHandler.handle(GzipHandler.java:462)
   [junit4]   2> 	at org.eclipse.jetty.server.handler.HandlerWrapper.handle(HandlerWrapper.java:134)
   [junit4]   2> 	at org.eclipse.jetty.server.Server.handle(Server.java:518)
   [junit4]   2> 	at org.eclipse.jetty.server.HttpChannel.handle(HttpChannel.java:308)
   [junit4]   2> 	at org.eclipse.jetty.server.HttpConnection.onFillable(HttpConnection.java:244)
   [junit4]   2> 	at org.eclipse.jetty.io.AbstractConnection$ReadCallback.succeeded(AbstractConnection.java:273)
   [junit4]   2> 	at org.eclipse.jetty.io.FillInterest.fillable(FillInterest.java:95)
   [junit4]   2> 	at org.eclipse.jetty.io.SelectChannelEndPoint$2.run(SelectChannelEndPoint.java:93)
   [junit4]   2> 	at org.eclipse.jetty.util.thread.strategy.ExecuteProduceConsume.produceAndRun(ExecuteProduceConsume.java:246)
   [junit4]   2> 	at org.eclipse.jetty.util.thread.strategy.ExecuteProduceConsume.run(ExecuteProduceConsume.java:156)
   [junit4]   2> 	at org.eclipse.jetty.util.thread.QueuedThreadPool.runJob(QueuedThreadPool.java:654)
   [junit4]   2> 	at org.eclipse.jetty.util.thread.QueuedThreadPool$3.run(QueuedThreadPool.java:572)
   [junit4]   2> 	at java.lang.Thread.run(Thread.java:745)
   [junit4]   2> 105270 INFO  (qtp932891691-523) [    x:collection1] o.a.s.c.S.Request [collection1]  webapp=/solr path=/replication params={generation=2&qt=/replication&wt=javabin&version=2&command=filelist} status=0 QTime=8
   [junit4]   2> 105271 INFO  (explicit-fetchindex-cmd) [    x:collection1] o.a.s.h.IndexFetcher Number of files in latest index in master: 11
   [junit4]   2> 105275 INFO  (explicit-fetchindex-cmd) [    x:collection1] o.a.s.c.CachingDirectoryFactory return new directory for /Users/jenkins/workspace/Lucene-Solr-6.x-MacOSX/solr/build/solr-core/test/J0/temp/solr.handler.TestReplicationHandler_9802D92CA5285819-001/solr-instance-002/./collection1/data/index.20160415045108570
   [junit4]   2> 105275 INFO  (explicit-fetchindex-cmd) [    x:collection1] o.a.s.u.DefaultSolrCoreState Rollback old IndexWriter... core=collection1
   [junit4]   2> 105277 INFO  (explicit-fetchindex-cmd) [    x:collection1] o.a.s.u.RandomMergePolicy RandomMergePolicy wrapping class org.apache.lucene.index.TieredMergePolicy: [TieredMergePolicy: maxMergeAtOnce=20, maxMergeAtOnceExplicit=43, maxMergedSegmentMB=79.65625, floorSegmentMB=0.7314453125, forceMergeDeletesPctAllowed=0.34800920566322, segmentsPerTier=25.0, maxCFSSegmentSizeMB=8.796093022207999E12, noCFSRatio=0.0
   [junit4]   2> 105278 INFO  (explicit-fetchindex-cmd) [    x:collection1] o.a.s.c.SolrDeletionPolicy SolrDeletionPolicy.onInit: commits: num=1
   [junit4]   2> 	commit{dir=MockDirectoryWrapper(RAMDirectory@69a8e1a8 lockFactory=org.apache.lucene.store.SingleInstanceLockFactory@2f891ae5),segFN=segments_1,generation=1}
   [junit4]   2> 105278 INFO  (explicit-fetchindex-cmd) [    x:collection1] o.a.s.c.SolrDeletionPolicy newest commit generation = 1
   [junit4]   2> 105278 INFO  (explicit-fetchindex-cmd) [    x:collection1] o.a.s.u.DefaultSolrCoreState New IndexWriter is ready to be used.
   [junit4]   2> 105278 INFO  (explicit-fetchindex-cmd) [    x:collection1] o.a.s.c.SolrDeletionPolicy SolrDeletionPolicy.onCommit: commits: num=1
   [junit4]   2> 	commit{dir=MockDirectoryWrapper(RAMDirectory@69a8e1a8 lockFactory=org.apache.lucene.store.SingleInstanceLockFactory@2f891ae5),segFN=segments_1,generation=1}
   [junit4]   2> 105279 INFO  (explicit-fetchindex-cmd) [    x:collection1] o.a.s.c.SolrDeletionPolicy newest commit generation = 1
   [junit4]   2> 105279 INFO  (explicit-fetchindex-cmd) [    x:collection1] o.a.s.u.DefaultSolrCoreState Rollback old IndexWriter... core=collection1
   [junit4]   2> 105279 INFO  (explicit-fetchindex-cmd) [    x:collection1] o.a.s.h.IndexFetcher Starting download (fullCopy=false) to MockDirectoryWrapper(RAMDirectory@1f9f2e72 lockFactory=org.apache.lucene.store.SingleInstanceLockFactory@590473a1)
   [junit4]   2> 105303 INFO  (qtp932891691-527) [    x:collection1] o.a.s.c.S.Request [collection1]  webapp=/solr path=/replication params={generation=2&qt=/replication&file=_0.si&checksum=true&wt=filestream&command=filecontent} status=0 QTime=9
   [junit4]   2> 105314 INFO  (qtp932891691-528) [    x:collection1] o.a.s.c.S.Request [collection1]  webapp=/solr path=/replication params={generation=2&qt=/replication&file=_0_MockRandom_0.doc&checksum=true&wt=filestream&command=filecontent} status=0 QTime=0
   [junit4]   2> 105319 INFO  (qtp932891691-529) [    x:collection1] o.a.s.c.S.Request [collection1]  webapp=/solr path=/replication params={generation=2&qt=/replication&file=_0.nvd&checksum=true&wt=filestream&command=filecontent} status=0 QTime=0
   [junit4]   2> 105324 INFO  (qtp932891691-530) [    x:collection1] o.a.s.c.S.Request [collection1]  webapp=/solr path=/replication params={generation=2&qt=/replication&file=_0_MockRandom_0.tib&checksum=true&wt=filestream&command=filecontent} status=0 QTime=0
   [junit4]   2> 105330 INFO  (qtp932891691-526) [    x:collection1] o.a.s.c.S.Request [collection1]  webapp=/solr path=/replication params={generation=2&qt=/replication&file=_0_MockRandom_0.sd&checksum=true&wt=filestream&command=filecontent} status=0 QTime=0
   [junit4]   2> 105334 INFO  (qtp932891691-525) [    x:collection1] o.a.s.c.S.Request [collection1]  webapp=/solr path=/replication params={generation=2&qt=/replication&file=_0.fdx&checksum=true&wt=filestream&command=filecontent} status=0 QTime=0
   [junit4]   2> 105339 INFO  (qtp932891691-523) [    x:collection1] o.a.s.c.S.Request [collection1]  webapp=/solr path=/replication params={generation=2&qt=/replication&file=_0_MockRandom_0.tiv&checksum=true&wt=filestream&command=filecontent} status=0 QTime=0
   [junit4]   2> 105344 INFO  (qtp932891691-527) [    x:collection1] o.a.s.c.S.Request [collection1]  webapp=/solr path=/replication params={generation=2&qt=/replication&file=_0.fdt&checksum=true&wt=filestream&command=filecontent} status=0 QTime=0
   [junit4]   2> 105349 INFO  (qtp932891691-528) [    x:collection1] o.a.s.c.S.Request [collection1]  webapp=/solr path=/replication params={generation=2&qt=/replication&file=_0.fnm&checksum=true&wt=filestream&command=filecontent} status=0 QTime=0
   [junit4]   2> 105354 INFO  (qtp932891691-529) [    x:collection1] o.a.s.c.S.Request [collection1]  webapp=/solr path=/replication params={generation=2&qt=/replication&file=_0.nvm&checksum=true&wt=filestream&command=filecontent} status=0 QTime=0
   [junit4]   2> 105360 INFO  (qtp932891691-530) [    x:collection1] o.a.s.c.S.Request [collection1]  webapp=/solr path=/replication params={generation=2&qt=/replication&file=segments_2&checksum=true&wt=filestream&command=filecontent} status=0 QTime=0
   [junit4]   2> 105362 INFO  (explicit-fetchindex-cmd) [    x:collection1] o.a.s.h.IndexFetcher Total time taken for download (fullCopy=false,bytesDownloaded=1642) : 0 secs (null bytes/sec) to MockDirectoryWrapper(RAMDirectory@1f9f2e72 lockFactory=org.apache.lucene.store.SingleInstanceLockFactory@590473a1)
   [junit4]   2> 105365 INFO  (explicit-fetchindex-cmd) [    x:collection1] o.a.s.u.RandomMergePolicy RandomMergePolicy wrapping class org.apache.lucene.index.TieredMergePolicy: [TieredMergePolicy: maxMergeAtOnce=42, maxMergeAtOnceExplicit=41, maxMergedSegmentMB=18.3193359375, floorSegmentMB=0.810546875, forceMergeDeletesPctAllowed=3.7833433472621047, segmentsPerTier=22.0, maxCFSSegmentSizeMB=8.796093022207999E12, noCFSRatio=0.6392356448949622
   [junit4]   2> 105368 INFO  (explicit-fetchindex-cmd) [    x:collection1] o.a.s.c.SolrDeletionPolicy SolrDeletionPolicy.onInit: commits: num=2
   [junit4]   2> 	commit{dir=MockDirectoryWrapper(RAMDirectory@69a8e1a8 lockFactory=org.apache.lucene.store.SingleInstanceLockFactory@2f891ae5),segFN=segments_1,generation=1}
   [junit4]   2> 	commit{dir=MockDirectoryWrapper(RAMDirectory@69a8e1a8 lockFactory=org.apache.lucene.store.SingleInstanceLockFactory@2f891ae5),segFN=segments_2,generation=2}
   [junit4]   2> 105368 INFO  (explicit-fetchindex-cmd) [    x:collection1] o.a.s.c.SolrDeletionPolicy newest commit generation = 2
   [junit4]   2> 105368 INFO  (explicit-fetchindex-cmd) [    x:collection1] o.a.s.u.DefaultSolrCoreState New IndexWriter is ready to be used.
   [junit4]   2> 105369 INFO  (explicit-fetchindex-cmd) [    x:collection1] o.a.s.s.SolrIndexSearcher Opening [Searcher@320d910[collection1] main]
   [junit4]   2> 105370 INFO  (searcherExecutor-284-thread-1-processing-x:collection1) [    x:collection1] o.a.s.c.SolrCore [collection1] Registered new searcher Searcher@320d910[collection1] main{ExitableDirectoryReader(UninvertingDirectoryReader(Uninverting(_0(6.1.0):C1)))}
   [junit4]   2> 105370 INFO  (explicit-fetchindex-cmd) [    x:collection1] o.a.s.c.CachingDirectoryFactory looking to close /Users/jenkins/workspace/Lucene-Solr-6.x-MacOSX/solr/build/solr-core/test/J0/temp/solr.handler.TestReplicationHandler_9802D92CA5285819-001/solr-instance-002/./collection1/data/index.20160415045108570 [CachedDir<<refCount=0;path=/Users/jenkins/workspace/Lucene-Solr-6.x-MacOSX/solr/build/solr-core/test/J0/temp/solr.handler.TestReplicationHandler_9802D92CA5285819-001/solr-instance-002/./collection1/data/index.20160415045108570;done=true>>]
   [junit4]   2> 105370 INFO  (explicit-fetchindex-cmd) [    x:collection1] o.a.s.c.CachingDirectoryFactory Closing directory, CoreContainer#isShutdown=false
   [junit4]   2> 105370 INFO  (explicit-fetchindex-cmd) [    x:collection1] o.a.s.c.CachingDirectoryFactory Closing directory: /Users/jenkins/workspace/Lucene-Solr-6.x-MacOSX/solr/build/solr-core/test/J0/temp/solr.handler.TestReplicationHandler_9802D92CA5285819-001/solr-instance-002/./collection1/data/index.20160415045108570
   [junit4]   2> 105370 INFO  (qtp2074766188-544) [    x:collection1] o.a.s.c.S.Request [collection1]  webapp=/solr path=/replication params={wait=true&masterUrl=http://127.0.0.1:50367/solr/collection1/replication&command=fetchindex} status=0 QTime=119
   [junit4]   2> 105394 INFO  (qtp932891691-526) [    x:collection1] o.a.s.c.S.Request [collection1]  webapp=/solr path=/replication params={slave=false&qt=/replication&wt=javabin&version=2&command=details} status=0 QTime=0
   [junit4]   2> 105395 INFO  (qtp2074766188-545) [    x:collection1] o.a.s.c.S.Request [collection1]  webapp=/solr path=/replication params={_trace=getDetails&qt=/replication&wt=javabin&version=2&command=details} status=0 QTime=9
   [junit4]   2> 105402 INFO  (qtp932891691-525) [    x:collection1] o.a.s.u.p.LogUpdateProcessorFactory [collection1]  webapp=/solr path=/update params={wt=javabin&version=2}{add=[1]} 0 2
   [junit4]   2> 105405 INFO  (qtp932891691-523) [    x:collection1] o.a.s.u.DirectUpdateHandler2 start commit{,optimize=false,openSearcher=true,waitSearcher=true,expungeDeletes=false,softCommit=false,prepareCommit=false}
   [junit4]   2> 105413 INFO  (qtp932891691-523) [    x:collection1] o.a.s.c.SolrDeletionPolicy SolrDeletionPolicy.onCommit: commits: num=3
   [junit4]   2> 	commit{dir=MockDirectoryWrapper(RAMDirectory@4537f4ca lockFactory=org.apache.lucene.store.SingleInstanceLockFactory@4b4834a),segFN=segments_1,generation=1}
   [junit4]   2> 	commit{dir=MockDirectoryWrapper(RAMDirectory@4537f4ca lockFactory=org.apache.lucene.store.SingleInstanceLockFactory@4b4834a),segFN=segments_2,generation=2}
   [junit4]   2> 	commit{dir=MockDirectoryWrapper(RAMDirectory@4537f4ca lockFactory=org.apache.lucene.store.SingleInstanceLockFactory@4b4834a),segFN=segments_3,generation=3}
   [junit4]   2> 105413 INFO  (qtp932891691-523) [    x:collection1] o.a.s.c.SolrDeletionPolicy newest commit generation = 3
   [junit4]   2> 105414 INFO  (qtp932891691-523) [    x:collection1] o.a.s.s.SolrIndexSearcher Opening [Searcher@f7b6cd0[collection1] main]
   [junit4]   2> 105414 INFO  (qtp932891691-523) [    x:collection1] o.a.s.u.DirectUpdateHandler2 end_commit_flush
   [junit4]   2> 105415 INFO  (searcherExecutor-274-thread-1-processing-x:collection1) [    x:collection1] o.a.s.c.SolrCore [collection1] Registered new searcher Searcher@f7b6cd0[collection1] main{ExitableDirectoryReader(UninvertingDirectoryReader(Uninverting(_0(6.1.0):C1) Uninverting(_1(6.1.0):C1)))}
   [junit4]   2> 105415 INFO  (qtp932891691-523) [    x:collection1] o.a.s.u.p.LogUpdateProcessorFactory [collection1]  webapp=/solr path=/update params={waitSearcher=true&commit=true&softCommit=false&wt=javabin&version=2}{commit=} 0 9
   [junit4]   2> 105417 WARN  (explicit-fetchindex-cmd) [    x:collection1] o.a.s.h.IndexFetcher 'masterUrl' must be specified without the /replication suffix
   [junit4]   2> 105423 INFO  (qtp932891691-527) [    x:collection1] o.a.s.c.S.Request [collection1]  webapp=/solr path=/replication params={qt=/replication&wt=javabin&version=2&command=indexversion} status=0 QTime=0
   [junit4]   2> 105423 INFO  (explicit-fetchindex-cmd) [    x:collection1] o.a.s.h.IndexFetcher Master's generation: 3
   [junit4]   2> 105423 INFO  (explicit-fetchindex-cmd) [    x:collection1] o.a.s.h.IndexFetcher Slave's generation: 2
   [junit4]   2> 105423 INFO  (explicit-fetchindex-cmd) [    x:collection1] o.a.s.h.IndexFetcher Starting replication process
   [junit4]   2> 105428 WARN  (qtp932891691-528) [    x:collection1] o.a.s.h.ReplicationHandler Could not read checksum from index file: _0_MockRandom_0.sd
   [junit4]   2> org.apache.lucene.index.CorruptIndexException: misplaced codec footer (file truncated?): length=8 but footerLength==16 (resource=MockIndexInputWrapper(RAMInputStream(name=_0_MockRandom_0.sd)))
   [junit4]   2> 	at org.apache.lucene.codecs.CodecUtil.retrieveChecksum(CodecUtil.java:430)
   [junit4]   2> 	at org.apache.solr.handler.ReplicationHandler.getFileList(ReplicationHandler.java:564)
   [junit4]   2> 	at org.apache.solr.handler.ReplicationHandler.handleRequestBody(ReplicationHandler.java:252)
   [junit4]   2> 	at org.apache.solr.handler.RequestHandlerBase.handleRequest(RequestHandlerBase.java:155)
   [junit4]   2> 	at org.apache.solr.core.SolrCore.execute(SolrCore.java:2018)
   [junit4]   2> 	at org.apache.solr.servlet.HttpSolrCall.execute(HttpSolrCall.java:652)
   [junit4]   2> 	at org.apache.solr.servlet.HttpSolrCall.call(HttpSolrCall.java:460)
   [junit4]   2> 	at org.apache.solr.servlet.SolrDispatchFilter.doFilter(SolrDispatchFilter.java:229)
   [junit4]   2> 	at org.apache.solr.servlet.SolrDispatchFilter.doFilter(SolrDispatchFilter.java:184)
   [junit4]   2> 	at org.eclipse.jetty.servlet.ServletHandler$CachedChain.doFilter(ServletHandler.java:1676)
   [junit4]   2> 	at org.apache.solr.client.solrj.embedded.JettySolrRunner$DebugFilter.doFilter(JettySolrRunner.java:109)
   [junit4]   2> 	at org.eclipse.jetty.servlet.ServletHandler$CachedChain.doFilter(ServletHandler.java:1676)
   [junit4]   2> 	at org.eclipse.jetty.servlet.ServletHandler.doHandle(ServletHandler.java:581)
   [junit4]   2> 	at org.eclipse.jetty.server.session.SessionHandler.doHandle(SessionHandler.java:224)
   [junit4]   2> 	at org.eclipse.jetty.server.handler.ContextHandler.doHandle(ContextHandler.java:1160)
   [junit4]   2> 	at org.eclipse.jetty.servlet.ServletHandler.doScope(ServletHandler.java:511)
   [junit4]   2> 	at org.eclipse.jetty.server.session.SessionHandler.doScope(SessionHandler.java:185)
   [junit4]   2> 	at org.eclipse.jetty.server.handler.ContextHandler.doScope(ContextHandler.java:1092)
   [junit4]   2> 	at org.eclipse.jetty.server.handler.ScopedHandler.handle(ScopedHandler.java:141)
   [junit4]   2> 	at org.eclipse.jetty.server.handler.gzip.GzipHandler.handle(GzipHandler.java:462)
   [junit4]   2> 	at org.eclipse.jetty.server.handler.HandlerWrapper.handle(HandlerWrapper.java:134)
   [junit4]   2> 	at org.eclipse.jetty.server.Server.handle(Server.java:518)
   [junit4]   2> 	at org.eclipse.jetty.server.HttpChannel.handle(HttpChannel.java:308)
   [junit4]   2> 	at org.eclipse.jetty.server.HttpConnection.onFillable(HttpConnection.java:244)
   [junit4]   2> 	at org.eclipse.jetty.io.AbstractConnection$ReadCallback.succeeded(AbstractConnection.java:273)
   [junit4]   2> 	at org.eclipse.jetty.io.FillInterest.fillable(FillInterest.java:95)
   [junit4]   2> 	at org.eclipse.jetty.io.SelectChannelEndPoint$2.run(SelectChannelEndPoint.java:93)
   [junit4]   2> 	at org.eclipse.jetty.util.thread.strategy.ExecuteProduceConsume.produceAndRun(ExecuteProduceConsume.java:246)
   [junit4]   2> 	at org.eclipse.jetty.util.thread.strategy.ExecuteProduceConsume.run(ExecuteProduceConsume.java:156)
   [junit4]   2> 	at org.eclipse.jetty.util.thread.QueuedThreadPool.runJob(QueuedThreadPool.java:654)
   [junit4]   2> 	at org.eclipse.jetty.util.thread.QueuedThreadPool$3.run(QueuedThreadPool.java:572)
   [junit4]   2> 	at java.lang.Thread.run(Thread.java:745)
   [junit4]   2> 105428 WARN  (qtp932891691-528) [    x:collection1] o.a.s.h.ReplicationHandler Could not read checksum from index file: _1_MockRandom_0.sd
   [junit4]   2> org.apache.lucene.index.CorruptIndexException: misplaced codec footer (file truncated?): length=8 but footerLength==16 (resource=MockIndexInputWrapper(RAMInputStream(name=_1_MockRandom_0.sd)))
   [junit4]   2> 	at org.apache.lucene.codecs.CodecUtil.retrieveChecksum(CodecUtil.java:430)
   [junit4]   2> 	at org.apache.solr.handler.ReplicationHandler.getFileList(ReplicationHandler.java:564)
   [junit4]   2> 	at org.apache.solr.handler.ReplicationHandler.handleRequestBody(ReplicationHandler.java:252)
   [junit4]   2> 	at org.apache.solr.handler.RequestHandlerBase.handleRequest(RequestHandlerBase.java:155)
   [junit4]   2> 	at org.apache.solr.core.SolrCore.execute(SolrCore.java:2018)
   [junit4]   2> 	at org.apache.solr.servlet.HttpSolrCall.execute(HttpSolrCall.java:652)
   [junit4]   2> 	at org.apache.solr.servlet.HttpSolrCall.call(HttpSolrCall.java:460)
   [junit4]   2> 	at org.apache.solr.servlet.SolrDispatchFilter.doFilter(SolrDispatchFilter.java:229)
   [junit4]   2> 	at org.apache.solr.servlet.SolrDispatchFilter.doFilter(SolrDispatchFilter.java:184)
   [junit4]   2> 	at org.eclipse.jetty.servlet.ServletHandler$CachedChain.doFilter(ServletHandler.java:1676)
   [junit4]   2> 	at org.apache.solr.client.solrj.embedded.JettySolrRunner$DebugFilter.doFilter(JettySolrRunner.java:109)
   [junit4]   2> 	at org.eclipse.jetty.servlet.ServletHandler$CachedChain.doFilter(ServletHandler.java:1676)
   [junit4]   2> 	at org.eclipse.jetty.servlet.ServletHandler.doHandle(ServletHandler.java:581)
   [junit4]   2> 	at org.eclipse.jetty.server.session.SessionHandler.doHandle(SessionHandler.java:224)
   [junit4]   2> 	at org.eclipse.jetty.server.handler.ContextHandler.doHandle(ContextHandler.java:1160)
   [junit4]   2> 	at org.eclipse.jetty.servlet.ServletHandler.doScope(ServletHandler.java:511)
   [junit4]   2> 	at org.eclipse.jetty.server.session.SessionHandler.doScope(SessionHandler.java:185)
   [junit4]   2> 	at org.eclipse.jetty.server.handler.ContextHandler.doScope(ContextHandler.java:1092)
   [junit4]   2> 	at org.eclipse.jetty.server.handler.ScopedHandler.handle(ScopedHandler.java:141)
   [junit4]   2> 	at org.eclipse.jetty.server.handler.gzip.GzipHandler.handle(GzipHandler.java:462)
   [junit4]   2> 	at org.eclipse.jetty.server.handler.HandlerWrapper.handle(HandlerWrapper.java:134)
   [junit4]   2> 	at org.eclipse.jetty.server.Server.handle(Server.java:518)
   [junit4]   2> 	at org.eclipse.jetty.server.HttpChannel.handle(HttpChannel.java:308)
   [junit4]   2> 	at org.eclipse.jetty.server.HttpConnection.onFillable(HttpConnection.java:244)
   [junit4]   2> 	at org.eclipse.jetty.io.AbstractConnection$ReadCallback.succeeded(AbstractConnection.java:273)
   [junit4]   2> 	at org.eclipse.jetty.io.FillInterest.fillable(FillInterest.java:95)
   [junit4]   2> 	at org.eclipse.jetty.io.SelectChannelEndPoint$2.run(SelectChannelEndPoint.java:93)
   [junit4]   2> 	at org.eclipse.jetty.util.thread.strategy.ExecuteProduceConsume.produceAndRun(ExecuteProduceConsume.java:246)
   [junit4]   2> 	at org.eclipse.jetty.util.thread.strategy.ExecuteProduceConsume.run(ExecuteProduceConsume.java:156)
   [junit4]   2> 	at org.eclipse.jetty.util.thread.QueuedThreadPool.runJob(QueuedThreadPool.java:654)
   [junit4]   2> 	at org.eclipse.jetty.util.thread.QueuedThreadPool$3.run(QueuedThreadPool.java:572)
   [junit4]   2> 	at java.lang.Thread.run(Thread.java:745)
   [junit4]   2> 105429 INFO  (qtp932891691-528) [    x:collection1] o.a.s.c.S.Request [collection1]  webapp=/solr path=/replication params={generation=3&qt=/replication&wt=javabin&version=2&command=filelist} status=0 QTime=2
   [junit4]   2> 105430 INFO  (explicit-fetchindex-cmd) [    x:collection1] o.a.s.h.IndexFetcher Number of files in latest index in master: 21
   [junit4]   2> 105431 INFO  (explicit-fetchindex-cmd) [    x:collection1] o.a.s.c.CachingDirectoryFactory return new directory for /Users/jenkins/workspace/Lucene-Solr-6.x-MacOSX/solr/build/solr-core/test/J0/temp/solr.handler.TestReplicationHandler_9802D92CA5285819-001/solr-instance-002/./collection1/data/index.20160415045108726
   [junit4]   2> 105431 INFO  (explicit-fetchindex-cmd) [    x:collection1] o.a.s.u.DefaultSolrCoreState Rollback old IndexWriter... core=collection1
   [junit4]   2> 105432 INFO  (explicit-fetchindex-cmd) [    x:collection1] o.a.s.u.RandomMergePolicy RandomMergePolicy wrapping class org.apache.lucene.index.TieredMergePolicy: [TieredMergePolicy: maxMergeAtOnce=20, maxMergeAtOnceExplicit=43, maxMergedSegmentMB=79.65625, floorSegmentMB=0.7314453125, forceMergeDeletesPctAllowed=0.34800920566322, segmentsPerTier=25.0, maxCFSSegmentSizeMB=8.796093022207999E12, noCFSRatio=0.0
   [junit4]   2> 105433 INFO  (explicit-fetchindex-cmd) [    x:collection1] o.a.s.c.SolrDeletionPolicy SolrDeletionPolicy.onInit: commits: num=1
   [junit4]   2> 	commit{dir=MockDirectoryWrapper(RAMDirectory@69a8e1a8 lockFactory=org.apache.lucene.store.SingleInstanceLockFactory@2f891ae5),segFN=segments_2,generation=2}
   [junit4]   2> 105433 INFO  (explicit-fetchindex-cmd) [    x:collection1] o.a.s.c.SolrDeletionPolicy newest commit generation = 2
   [junit4]   2> 105433 INFO  (explicit-fetchindex-cmd) [    x:collection1] o.a.s.u.DefaultSolrCoreState New IndexWriter is ready to be used.
   [junit4]   2> 105433 INFO  (explicit-fetchindex-cmd) [    x:collection1] o.a.s.c.SolrDeletionPolicy SolrDeletionPolicy.onCommit: commits: num=1
   [junit4]   2> 	commit{dir=MockDirectoryWrapper(RAMDirectory@69a8e1a8 lockFactory=org.apache.lucene.store.SingleInstanceLockFactory@2f891ae5),segFN=segments_2,generation=2}
   [junit4]   2> 105433 INFO  (explicit-fetchindex-cmd) [    x:collection1] o.a.s.c.SolrDeletionPolicy newest commit generation = 2
   [junit4]   2> 105434 INFO  (explicit-fetchindex-cmd) [    x:collection1] o.a.s.u.DefaultSolrCoreState Rollback old IndexWriter... core=collection1
   [junit4]   2> 105434 INFO  (explicit-fetchindex-cmd) [    x:collection1] o.a.s.h.IndexFetcher Starting download (fullCopy=false) to MockDirectoryWrapper(RAMDirectory@e9c91b5 lockFactory=org.apache.lucene.store.SingleInstanceLockFactory@32cc902c)
   [junit4]   2> 105434 INFO  (explicit-fetchindex-cmd) [    x:collection1] o.a.s.h.IndexFetcher Skipping download for _0.si because it already exists
   [junit4]   2> 105434 INFO  (explicit-fetchindex-cmd) [    x:collection1] o.a.s.h.IndexFetcher Skipping download for _0_MockRandom_0.doc because it already exists
   [junit4]   2> 105434 INFO  (explicit-fetchindex-cmd) [    x:collection1] o.a.s.h.IndexFetcher Skipping download for _0.nvd because it already exists
   [junit4]   2> 105434 INFO  (explicit-fetchindex-cmd) [    x:collection1] o.a.s.h.IndexFetcher Skipping download for _0_MockRandom_0.tib because it already exists
   [junit4]   2> 105437 INFO  (qtp932891691-529) [    x:collection1] o.a.s.c.S.Request [collection1]  webapp=/solr path=/replication params={generation=3&qt=/replication&file=_0_MockRandom_0.sd&checksum=true&wt=filestream&command=filecontent} status=0 QTime=0
   [junit4]   2> 105439 INFO  (explicit-fetchindex-cmd) [    x:collection1] o.a.s.h.IndexFetcher Skipping download for _0.fdx because it already exists
   [junit4]   2> 105439 INFO  (explicit-fetchindex-cmd) [    x:collection1] o.a.s.h.IndexFetcher Skipping download for _0_MockRandom_0.tiv because it already exists
   [junit4]   2> 105439 INFO  (explicit-fetchindex-cmd) [    x:collection1] o.a.s.h.IndexFetcher Skipping download for _0.fdt because it already exists
   [junit4]   2> 105439 INFO  (explicit-fetchindex-cmd) [    x:collection1] o.a.s.h.IndexFetcher Skipping download for _0.fnm because it already exists
   [junit4]   2> 105439 INFO  (explicit-fetchindex-cmd) [    x:collection1] o.a.s.h.IndexFetcher Skipping download for _0.nvm because it already exists
   [junit4]   2> 105442 INFO  (qtp932891691-530) [    x:collection1] o.a.s.c.S.Request [collection1]  webapp=/solr path=/replication params={generation=3&qt=/replication&file=_1_MockRandom_0.doc&checksum=true&wt=filestream&command=filecontent} status=0 QTime=0
   [junit4]   2> 105447 INFO  (qtp932891691-526) [    x:collection1] o.a.s.c.S.Request [collection1]  webapp=/solr path=/replication params={generation=3&qt=/replication&file=_1_MockRandom_0.sd&checksum=true&wt=filestream&command=filecontent} status=0 QTime=0
   [junit4]   2> 105452 INFO  (qtp932891691-525) [    x:collection1] o.a.s.c.S.Request [collection1]  webapp=/solr path=/replication params={generation=3&qt=/replication&file=_1.si&checksum=true&wt=filestream&command=filecontent} status=0 QTime=0
   [junit4]   2> 105457 INFO  (qtp932891691-525) [    x:collection1] o.a.s.c.S.Request [collection1]  webapp=/solr path=/replication params={generation=3&qt=/replication&file=_1.nvd&checksum=true&wt=filestream&command=filecontent} status=0 QTime=0
   [junit4]   2> 105463 INFO  (qtp932891691-527) [    x:collection1] o.a.s.c.S.Request [collection1]  webapp=/solr path=/replication params={generation=3&qt=/replication&file=_1_MockRandom_0.tix&checksum=true&wt=filestream&command=filecontent} status=0 QTime=0
   [junit4]   2> 105474 INFO  (qtp932891691-528) [    x:collection1] o.a.s.c.S.Request [collection1]  webapp=/solr path=/replication params={generation=3&qt=/replication&file=_1.fdx&checksum=true&wt=filestream&command=filecontent} status=0 QTime=0
   [junit4]   2> 105477 INFO  (qtp932891691-529) [    x:collection1] o.a.s.c.S.Request [collection1]  webapp=/solr path=/replication params={generation=3&qt=/replication&file=_1.fnm&checksum=true&wt=filestream&command=filecontent} status=0 QTime=0
   [junit4]   2> 105481 INFO  (qtp932891691-530) [    x:collection1] o.a.s.c.S.Request [collection1]  webapp=/solr path=/replication params={generation=3&qt=/replication&file=_1.nvm&checksum=true&wt=filestream&command=filecontent} status=0 QTime=0
   [junit4]   2> 105486 INFO  (qtp932891691-526) [    x:collection1] o.a.s.c.S.Request [collection1]  webapp=/solr path=/replication params={generation=3&qt=/replication&file=_1.fdt&checksum=true&wt=filestream&command=filecontent} status=0 QTime=0
   [junit4]   2> 105490 INFO  (qtp932891691-523) [    x:collection1] o.a.s.c.S.Request [collection1]  webapp=/solr path=/replication params={generation=3&qt=/replication&file=_1_MockRandom_0.tbk&checksum=true&wt=filestream&command=filecontent} status=0 QTime=0
   [junit4]   2> 105494 INFO  (qtp932891691-525) [    x:collection1] o.a.s.c.S.Request [collection1]  webapp=/solr path=/replication params={generation=3&qt=/replication&file=segments_3&checksum=true&wt=filestream&command=filecontent} status=0 QTime=0
   [junit4]   2> 105495 INFO  (explicit-fetchindex-cmd) [    x:collection1] o.a.s.h.IndexFetcher Total time taken for download (fullCopy=false,bytesDownloaded=1678) : 0 secs (null bytes/sec) to MockDirectoryWrapper(RAMDirectory@e9c91b5 lockFactory=org.apache.lucene.store.SingleInstanceLockFactory@32cc902c)
   [junit4]   2> 105496 WARN  (explicit-fetchindex-cmd) [    x:collection1] o.a.s.h.IndexFetcher Cannot complete replication attempt because file already exists:_0_MockRandom_0.sd
   [junit4]   2> 105496 INFO  (explicit-fetchindex-cmd) [    x:collection1] o.a.s.u.RandomMergePolicy RandomMergePolicy wrapping class org.apache.lucene.index.TieredMergePolicy: [TieredMergePolicy: maxMergeAtOnce=42, maxMergeAtOnceExplicit=41, maxMergedSegmentMB=18.3193359375, floorSegmentMB=0.810546875, forceMergeDeletesPctAllowed=3.7833433472621047, segmentsPerTier=22.0, maxCFSSegmentSizeMB=8.796093022207999E12, noCFSRatio=0.6392356448949622
   [junit4]   2> 105498 INFO  (explicit-fetchindex-cmd) [    x:collection1] o.a.s.c.SolrDeletionPolicy SolrDeletionPolicy.onInit: commits: num=1
   [junit4]   2> 	commit{dir=MockDirectoryWrapper(RAMDirectory@69a8e1a8 lockFactory=org.apache.lucene.store.SingleInstanceLockFactory@2f891ae5),segFN=segments_2,generation=2}
   [junit4]   2> 105498 INFO  (explicit-fetchindex-cmd) [    x:collection1] o.a.s.c.SolrDeletionPolicy newest commit generation = 2
   [junit4]   2> 105498 INFO  (explicit-fetchindex-cmd) [    x:collection1] o.a.s.u.DefaultSolrCoreState New IndexWriter is ready to be used.
   [junit4]   2> 105499 INFO  (explicit-fetchindex-cmd) [    x:collection1] o.a.s.c.CachingDirectoryFactory looking to close /Users/jenkins/workspace/Lucene-Solr-6.x-MacOSX/solr/build/solr-core/test/J0/temp/solr.handler.TestReplicationHandler_9802D92CA5285819-001/solr-instance-002/./collection1/data/index.20160415045108726 [CachedDir<<refCount=0;path=/Users/jenkins/workspace/Lucene-Solr-6.x-MacOSX/solr/build/solr-core/test/J0/temp/solr.handler.TestReplicationHandler_9802D92CA5285819-001/solr-instance-002/./collection1/data/index.20160415045108726;done=true>>]
   [junit4]   2> 105499 INFO  (explicit-fetchindex-cmd) [    x:collection1] o.a.s.c.CachingDirectoryFactory Closing directory, CoreContainer#isShutdown=false
   [junit4]   2> 105499 INFO  (explicit-fetchindex-cmd) [    x:collection1] o.a.s.c.CachingDirectoryFactory Closing directory: /Users/jenkins/workspace/Lucene-Solr-6.x-MacOSX/solr/build/solr-core/test/J0/temp/solr.handler.TestReplicationHandler_9802D92CA5285819-001/solr-instance-002/./collection1/data/index.20160415045108726
   [junit4]   2> 105499 WARN  (explicit-fetchindex-cmd) [    x:collection1] o.a.s.h.IndexFetcher Replication attempt was not successful - trying a full index replication reloadCore=false
   [junit4]   2> 105503 INFO  (qtp932891691-527) [    x:collection1] o.a.s.c.S.Request [collection1]  webapp=/solr path=/replication params={qt=/replication&wt=javabin&version=2&command=indexversion} status=0 QTime=0
   [junit4]   2> 105503 INFO  (explicit-fetchindex-cmd) [    x:collection1] o.a.s.h.IndexFetcher Master's generation: 3
   [junit4]   2> 105503 INFO  (explicit-fetchindex-cmd) [    x:collection1] o.a.s.h.IndexFetcher Slave's generation: 2
   [junit4]   2> 105503 INFO  (explicit-fetchindex-cmd) [    x:collection1] o.a.s.h.IndexFetcher Starting replication process
   [junit4]   2> 105507 WARN  (qtp932891691-528) [    x:collection1] o.a.s.h.ReplicationHandler Could not read checksum from index file: _0_MockRandom_0.sd
   [junit4]   2> org.apache.lucene.index.CorruptIndexException: misplaced codec footer (file truncated?): length=8 but footerLength==16 (resource=MockIndexInputWrapper(RAMInputStream(name=_0_MockRandom_0.sd)))
   [junit4]   2> 	at org.apache.lucene.codecs.CodecUtil.retrieveChecksum(CodecUtil.java:430)
   [junit4]   2> 	at org.apache.solr.handler.ReplicationHandler.getFileList(ReplicationHandler.java:564)
   [junit4]   2> 	at org.apache.solr.handler.ReplicationHandler.handleRequestBody(ReplicationHandler.java:252)
   [junit4]   2> 	at org.apache.solr.handler.RequestHandlerBase.handleRequest(RequestHandlerBase.java:155)
   [junit4]   2> 	at org.apache.solr.core.SolrCore.execute(SolrCore.java:2018)
   [junit4]   2> 	at org.apache.solr.servlet.HttpSolrCall.execute(HttpSolrCall.java:652)
   [junit4]   2> 	at org.apache.solr.servlet.HttpSolrCall.call(HttpSolrCall.java:460)
   [junit4]   2> 	at org.apache.solr.servlet.SolrDispatchFilter.doFilter(SolrDispatchFilter.java:229)
   [junit4]   2> 	at org.apache.solr.servlet.SolrDispatchFilter.doFilter(SolrDispatchFilter.java:184)
   [junit4]   2> 	at org.eclipse.jetty.servlet.ServletHandler$CachedChain.doFilter(ServletHandler.java:1676)
   [junit4]   2> 	at org.apache.solr.client.solrj.embedded.JettySolrRunner$DebugFilter.doFilter(JettySolrRunner.java:109)
   [junit4]   2> 	at org.eclipse.jetty.servlet.ServletHandler$CachedChain.doFilter(ServletHandler.java:1676)
   [junit4]   2> 	at org.eclipse.jetty.servlet.ServletHandler.doHandle(ServletHandler.java:581)
   [junit4]   2> 	at org.eclipse.jetty.server.session.SessionHandler.doHandle(SessionHandler.java:224)
   [junit4]   2> 	at org.eclipse.jetty.server.handler.ContextHandler.doHandle(ContextHandler.java:1160)
   [junit4]   2> 	at org.eclipse.jetty.servlet.ServletHandler.doScope(ServletHandler.java:511)
   [junit4]   2> 	at org.eclipse.jetty.server.session.SessionHandler.doScope(SessionHandler.java:185)
   [junit4]   2> 	at org.eclipse.jetty.server.handler.ContextHandler.doScope(ContextHandler.java:1092)
   [junit4]   2> 	at org.eclipse.jetty.server.handler.ScopedHandler.handle(ScopedHandler.java:141)
   [junit4]   2> 	at org.eclipse.jetty.server.handler.gzip.GzipHandler.handle(GzipHandler.java:462)
   [junit4]   2> 	at org.eclipse.jetty.server.handler.HandlerWrapper.handle(HandlerWrapper.java:134)
   [junit4]   2> 	at org.eclipse.jetty.server.Server.handle(Server.java:518)
   [junit4]   2> 	at org.eclipse.jetty.server.HttpChannel.handle(HttpChannel.java:308)
   [junit4]   2> 	at org.eclipse.jetty.server.HttpConnection.onFillable(HttpConnection.java:244)
   [junit4]   2> 	at org.eclipse.jetty.io.AbstractConnection$ReadCallback.succeeded(AbstractConnection.java:273)
   [junit4]   2> 	at org.eclipse.jetty.io.FillInterest.fillable(FillInterest.java:95)
   [junit4]   2> 	at org.eclipse.jetty.io.SelectChannelEndPoint$2.run(SelectChannelEndPoint.java:93)
   [junit4]   2> 	at org.eclipse.jetty.util.thread.strategy.ExecuteProduceConsume.produceAndRun(ExecuteProduceConsume.java:246)
   [junit4]   2> 	at org.eclipse.jetty.util.thread.strategy.ExecuteProduceConsume.run(ExecuteProduceConsume.java:156)
   [junit4]   2> 	at org.eclipse.jetty.util.thread.QueuedThreadPool.runJob(QueuedThreadPool.java:654)
   [junit4]   2> 	at org.eclipse.jetty.util.thread.QueuedThreadPool$3.run(QueuedThreadPool.java:572)
   [junit4]   2> 	at java.lang.Thread.run(Thread.java:745)
   [junit4]   2> 105507 WARN  (qtp932891691-528) [    x:collection1] o.a.s.h.ReplicationHandler Could not read checksum from index file: _1_MockRandom_0.sd
   [junit4]   2> org.apache.lucene.index.CorruptIndexException: misplaced codec footer (file truncated?): length=8 but footerLength==16 (resource=MockIndexInputWrapper(RAMInputStream(name=_1_MockRandom_0.sd)))
   [junit4]   2> 	at org.apache.lucene.codecs.CodecUtil.retrieveChecksum(CodecUtil.java:430)
   [junit4]   2> 	at org.apache.solr.handler.ReplicationHandler.getFileList(ReplicationHandler.java:564)
   [junit4]   2> 	at org.apache.solr.handler.ReplicationHandler.handleRequestBody(ReplicationHandler.java:252)
   [junit4]   2> 	at org.apache.solr.handler.RequestHandlerBase.handleRequest(RequestHandlerBase.java:155)
   [junit4]   2> 	at org.apache.solr.core.SolrCore.execute(SolrCore.java:2018)
   [junit4]   2> 	at org.apache.solr.servlet.HttpSolrCall.execute(HttpSolrCall.java:652)
   [junit4]   2> 	at org.apache.solr.servlet.HttpSolrCall.call(HttpSolrCall.java:460)
   [junit4]   2> 	at org.apache.solr.servlet.SolrDispatchFilter.doFilter(SolrDispatchFilter.java:229)
   [junit4]   2> 	at org.apache.solr.servlet.SolrDispatchFilter.doFilter(SolrDispatchFilter.java:184)
   [junit4]   2> 	at org.eclipse.jetty.servlet.ServletHandler$CachedChain.doFilter(ServletHandler.java:1676)
   [junit4]   2> 	at org.apache.solr.client.solrj.embedded.JettySolrRunner$DebugFilter.doFilter(JettySolrRunner.java:109)
   [junit4]   2> 	at org.eclipse.jetty.servlet.ServletHandler$CachedChain.doFilter(ServletHandler.java:1676)
   [junit4]   2> 	at org.eclipse.jetty.servlet.ServletHandler.doHandle(ServletHandler.java:581)
   [junit4]   2> 	at org.eclipse.jetty.server.session.SessionHandler.doHandle(SessionHandler.java:224)
   [junit4]   2> 	at org.eclipse.jetty.server.handler.ContextHandler.doHandle(ContextHandler.java:1160)
   [junit4]   2> 	at org.eclipse.jetty.servlet.ServletHandler.doScope(ServletHandler.java:511)
   [junit4]   2> 	at org.eclipse.jetty.server.session.SessionHandler.doScope(SessionHandler.java:185)
   [junit4]   2> 	at org.eclipse.jetty.server.handler.ContextHandler.doScope(ContextHandler.java:1092)
   [junit4]   2> 	at org.eclipse.jetty.server.handler.ScopedHandler.handle(ScopedHandler.java:141)
   [junit4]   2> 	at org.eclipse.jetty.server.handler.gzip.GzipHandler.handle(GzipHandler.java:462)
   [junit4]   2> 	at org.eclipse.jetty.server.handler.HandlerWrapper.handle(HandlerWrapper.java:134)
   [junit4]   2> 	at org.eclipse.jetty.server.Server.handle(Server.java:518)
   [junit4]   2> 	at org.eclipse.jetty.server.HttpChannel.handle(HttpChannel.java:308)
   [junit4]   2> 	at org.eclipse.jetty.server.HttpConnection.onFillable(HttpConnection.java:244)
   [junit4]   2> 	at org.eclipse.jetty.io.AbstractConnection$ReadCallback.succeeded(AbstractConnection.java:273)
   [junit4]   2> 	at org.eclipse.jetty.io.FillInterest.fillable(FillInterest.java:95)
   [junit4]   2> 	at org.eclipse.jetty.io.SelectChannelEndPoint$2.run(SelectChannelEndPoint.java:93)
   [junit4]   2> 	at org.eclipse.jetty.util.thread.strategy.ExecuteProduceConsume.produceAndRun(ExecuteProduceConsume.java:246)
   [junit4]   2> 	at org.eclipse.jetty.util.thread.strategy.ExecuteProduceConsume.run(ExecuteProduceConsume.java:156)
   [junit4]   2> 	at org.eclipse.jetty.util.thread.QueuedThreadPool.runJob(QueuedThreadPool.java:654)
   [junit4]   2> 	at org.eclipse.jetty.util.thread.QueuedThreadPool$3.run(QueuedThreadPool.java:572)
   [junit4]   2> 	at java.lang.Thread.run(Thread.java:745)
   [junit4]   2> 105508 INFO  (qtp932891691-528) [    x:collection1] o.a.s.c.S.Request [collection1]  webapp=/solr path=/replication params={generation=3&qt=/replication&wt=javabin&version=2&command=filelist} status=0 QTime=2
   [junit4]   2> 105510 INFO  (explicit-fetchindex-cmd) [    x:collection1] o.a.s.h.IndexFetcher Number of files in latest index in master: 21
   [junit4]   2> 105510 INFO  (explicit-fetchindex-cmd) [    x:collection1] o.a.s.c.CachingDirectoryFactory return new directory for /Users/jenkins/workspace/Lucene-Solr-6.x-MacOSX/solr/build/solr-core/test/J0/temp/solr.handler.TestReplicationHandler_9802D92CA5285819-001/solr-instance-002/./collection1/data/index.20160415045108806
   [junit4]   2> 105510 INFO  (explicit-fetchindex-cmd) [    x:collection1] o.a.s.h.IndexFetcher Starting download (fullCopy=true) to MockDirectoryWrapper(RAMDirectory@786d8321 lo

[...truncated too long message...]

nsume.run(ExecuteProduceConsume.java:156)
   [junit4]   2> 	at org.eclipse.jetty.util.thread.QueuedThreadPool.runJob(QueuedThreadPool.java:654)
   [junit4]   2> 	at org.eclipse.jetty.util.thread.QueuedThreadPool$3.run(QueuedThreadPool.java:572)
   [junit4]   2> 	at java.lang.Thread.run(Thread.java:745)
   [junit4]   2> 
   [junit4]   2> 1046700 INFO  (qtp1183721087-6606) [n:127.0.0.1:52577_    ] o.a.s.s.HttpSolrCall [admin] webapp=null path=/admin/cores params={nodeName=127.0.0.1:52572_&onlyIfLeaderActive=true&core=c8n_1x3_lf_shard1_replica1&coreNodeName=core_node2&action=PREPRECOVERY&checkLive=true&state=recovering&onlyIfLeader=true&wt=javabin&version=2} status=400 QTime=67349
   [junit4]   2> 1046702 INFO  (TEST-LeaderFailoverAfterPartitionTest.test-seed#[9802D92CA5285819]) [    ] o.a.s.c.ChaosMonkey monkey: stop shard! 52582
   [junit4]   2> 1046704 INFO  (TEST-LeaderFailoverAfterPartitionTest.test-seed#[9802D92CA5285819]) [    ] o.a.s.c.ZkTestServer connecting to 127.0.0.1:52562 52562
   [junit4]   2> 1046729 INFO  (Thread-2247) [    ] o.a.s.c.ZkTestServer connecting to 127.0.0.1:52562 52562
   [junit4]   2> 1048221 WARN  (Thread-2247) [    ] o.a.s.c.ZkTestServer Watch limit violations: 
   [junit4]   2> Maximum concurrent create/delete watches above limit:
   [junit4]   2> 
   [junit4]   2> 	5	/solr/aliases.json
   [junit4]   2> 	4	/solr/security.json
   [junit4]   2> 	4	/solr/configs/conf1
   [junit4]   2> 
   [junit4]   2> Maximum concurrent data watches above limit:
   [junit4]   2> 
   [junit4]   2> 	5	/solr/clusterstate.json
   [junit4]   2> 
   [junit4]   2> Maximum concurrent children watches above limit:
   [junit4]   2> 
   [junit4]   2> 	5	/solr/live_nodes
   [junit4]   2> 	5	/solr/collections
   [junit4]   2> 	3	/solr/overseer/queue
   [junit4]   2> 	3	/solr/overseer/collection-queue-work
   [junit4]   2> 
   [junit4]   2> 1048222 WARN  (TEST-LeaderFailoverAfterPartitionTest.test-seed#[9802D92CA5285819]) [    ] o.a.s.c.SocketProxy Closing 1 connections to: http://127.0.0.1:52565/, target: http://127.0.0.1:52566/
   [junit4]   2> 1048223 WARN  (TEST-LeaderFailoverAfterPartitionTest.test-seed#[9802D92CA5285819]) [    ] o.a.s.c.SocketProxy Closing 0 connections to: http://127.0.0.1:52582/, target: http://127.0.0.1:52583/
   [junit4]   2> 1048223 WARN  (TEST-LeaderFailoverAfterPartitionTest.test-seed#[9802D92CA5285819]) [    ] o.a.s.c.SocketProxy Closing 7 connections to: http://127.0.0.1:52577/, target: http://127.0.0.1:52578/
   [junit4]   2> 1048223 WARN  (TEST-LeaderFailoverAfterPartitionTest.test-seed#[9802D92CA5285819]) [    ] o.a.s.c.SocketProxy Closing 1 connections to: http://127.0.0.1:52572/, target: http://127.0.0.1:52573/
   [junit4]   2> NOTE: reproduce with: ant test  -Dtestcase=LeaderFailoverAfterPartitionTest -Dtests.method=test -Dtests.seed=9802D92CA5285819 -Dtests.slow=true -Dtests.locale=sr-Latn-BA -Dtests.timezone=America/Whitehorse -Dtests.asserts=true -Dtests.file.encoding=UTF-8
   [junit4] FAILURE  125s J0 | LeaderFailoverAfterPartitionTest.test <<<
   [junit4]    > Throwable #1: java.lang.AssertionError: Expected 2 of 3 replicas to be active but only found 1; [core_node3:{"core":"c8n_1x3_lf_shard1_replica1","base_url":"http://127.0.0.1:52577","node_name":"127.0.0.1:52577_","state":"active","leader":"true"}]; clusterState: DocCollection(c8n_1x3_lf)={
   [junit4]    >   "replicationFactor":"3",
   [junit4]    >   "shards":{"shard1":{
   [junit4]    >       "range":"80000000-7fffffff",
   [junit4]    >       "state":"active",
   [junit4]    >       "replicas":{
   [junit4]    >         "core_node1":{
   [junit4]    >           "core":"c8n_1x3_lf_shard1_replica3",
   [junit4]    >           "base_url":"http://127.0.0.1:52582",
   [junit4]    >           "node_name":"127.0.0.1:52582_",
   [junit4]    >           "state":"down"},
   [junit4]    >         "core_node2":{
   [junit4]    >           "state":"down",
   [junit4]    >           "base_url":"http://127.0.0.1:52572",
   [junit4]    >           "core":"c8n_1x3_lf_shard1_replica2",
   [junit4]    >           "node_name":"127.0.0.1:52572_"},
   [junit4]    >         "core_node3":{
   [junit4]    >           "core":"c8n_1x3_lf_shard1_replica1",
   [junit4]    >           "base_url":"http://127.0.0.1:52577",
   [junit4]    >           "node_name":"127.0.0.1:52577_",
   [junit4]    >           "state":"active",
   [junit4]    >           "leader":"true"}}}},
   [junit4]    >   "router":{"name":"compositeId"},
   [junit4]    >   "maxShardsPerNode":"1",
   [junit4]    >   "autoAddReplicas":"false"}
   [junit4]    > 	at __randomizedtesting.SeedInfo.seed([9802D92CA5285819:1056E6F60BD435E1]:0)
   [junit4]    > 	at org.apache.solr.cloud.LeaderFailoverAfterPartitionTest.testRf3WithLeaderFailover(LeaderFailoverAfterPartitionTest.java:168)
   [junit4]    > 	at org.apache.solr.cloud.LeaderFailoverAfterPartitionTest.test(LeaderFailoverAfterPartitionTest.java:55)
   [junit4]    > 	at org.apache.solr.BaseDistributedSearchTestCase$ShardsRepeatRule$ShardsFixedStatement.callStatement(BaseDistributedSearchTestCase.java:992)
   [junit4]    > 	at org.apache.solr.BaseDistributedSearchTestCase$ShardsRepeatRule$ShardsStatement.evaluate(BaseDistributedSearchTestCase.java:967)
   [junit4]    > 	at java.lang.Thread.run(Thread.java:745)
   [junit4]   2> 1048227 INFO  (SUITE-LeaderFailoverAfterPartitionTest-seed#[9802D92CA5285819]-worker) [    ] o.a.s.SolrTestCaseJ4 ###deleteCore
   [junit4]   2> NOTE: leaving temporary files on disk at: /Users/jenkins/workspace/Lucene-Solr-6.x-MacOSX/solr/build/solr-core/test/J0/temp/solr.cloud.LeaderFailoverAfterPartitionTest_9802D92CA5285819-001
   [junit4]   2> NOTE: test params are: codec=Asserting(Lucene60): {range_facet_l_dv=FST50, _version_=PostingsFormat(name=LuceneVarGapFixedInterval), multiDefault=Lucene50(blocksize=128), a_t=Lucene50(blocksize=128), intDefault=PostingsFormat(name=LuceneVarGapFixedInterval), id=FST50, range_facet_i_dv=Lucene50(blocksize=128), text=PostingsFormat(name=Memory doPackFST= false), range_facet_l=Lucene50(blocksize=128), timestamp=Lucene50(blocksize=128)}, docValues:{range_facet_l_dv=DocValuesFormat(name=Lucene54), range_facet_i_dv=DocValuesFormat(name=Asserting), timestamp=DocValuesFormat(name=Asserting)}, maxPointsInLeafNode=1648, maxMBSortInHeap=5.527702087738637, sim=ClassicSimilarity, locale=sr-Latn-BA, timezone=America/Whitehorse
   [junit4]   2> NOTE: Mac OS X 10.11.4 x86_64/Oracle Corporation 1.8.0_72 (64-bit)/cpus=3,threads=1,free=91679648,total=397410304
   [junit4]   2> NOTE: All tests run in this JVM: [ActionThrottleTest, TestAnalyzedSuggestions, AddBlockUpdateTest, JSONWriterTest, DeleteReplicaTest, TestReloadAndDeleteDocs, ClusterStateUpdateTest, TestTolerantSearch, TestReplicationHandler, ZkStateWriterTest, SolrTestCaseJ4Test, TestCoreContainer, TestSweetSpotSimilarityFactory, BlockDirectoryTest, DOMUtilTest, ExitableDirectoryReaderTest, TestAnalyzeInfixSuggestions, ZkCLITest, TestFaceting, DistributedQueryComponentOptimizationTest, HdfsChaosMonkeySafeLeaderTest, TestFunctionQuery, XsltUpdateRequestHandlerTest, CoreAdminCreateDiscoverTest, PreAnalyzedFieldTest, TestConfigSetImmutable, DeleteStatusTest, BlockJoinFacetDistribTest, TestRemoteStreaming, TestLFUCache, TestSchemaNameResource, AnalysisAfterCoreReloadTest, MultiThreadedOCPTest, TestFieldSortValues, SpatialFilterTest, TestNamedUpdateProcessors, TestSerializedLuceneMatchVersion, TestShortCircuitedRequests, TestCursorMarkWithoutUniqueKey, TestSolrQueryParserResource, TestInitParams, DistributedFacetPivotWhiteBoxTest, TestJmxIntegration, DocumentAnalysisRequestHandlerTest, TermsComponentTest, AssignTest, TestXmlQParser, TestPivotHelperCode, TestSolrCLIRunExample, TestCollationFieldDocValues, DirectUpdateHandlerTest, TestGroupingSearch, CircularListTest, DocValuesMultiTest, DateRangeFieldTest, DirectSolrSpellCheckerTest, TestSchemaManager, TestRandomDVFaceting, TestReplicationHandlerBackup, TestRebalanceLeaders, TestDynamicFieldCollectionResource, TestXIncludeConfig, CollectionStateFormat2Test, CdcrRequestHandlerTest, OverseerTest, SOLR749Test, TestSmileRequest, TestSurroundQueryParser, TestSchemaSimilarityResource, TestSearchPerf, PolyFieldTest, TestRuleBasedAuthorizationPlugin, TestLMDirichletSimilarityFactory, CursorPagingTest, SharedFSAutoReplicaFailoverUtilsTest, TestGeoJSONResponseWriter, TestCollectionAPI, MBeansHandlerTest, FastVectorHighlighterTest, ClusterStateTest, ReturnFieldsTest, TestCryptoKeys, SSLMigrationTest, ResponseHeaderTest, TestJsonRequest, TestAuthorizationFramework, RuleEngineTest, TestExactStatsCache, TestHashPartitioner, SampleTest, LeaderFailoverAfterPartitionTest]
   [junit4] Completed [181/587 (2!)] on J0 in 124.67s, 1 test, 1 failure <<< FAILURES!

[...truncated 1335 lines...]
BUILD FAILED
/Users/jenkins/workspace/Lucene-Solr-6.x-MacOSX/build.xml:740: The following error occurred while executing this line:
/Users/jenkins/workspace/Lucene-Solr-6.x-MacOSX/build.xml:684: The following error occurred while executing this line:
/Users/jenkins/workspace/Lucene-Solr-6.x-MacOSX/build.xml:59: The following error occurred while executing this line:
/Users/jenkins/workspace/Lucene-Solr-6.x-MacOSX/solr/build.xml:233: The following error occurred while executing this line:
/Users/jenkins/workspace/Lucene-Solr-6.x-MacOSX/solr/common-build.xml:529: The following error occurred while executing this line:
/Users/jenkins/workspace/Lucene-Solr-6.x-MacOSX/lucene/common-build.xml:1457: The following error occurred while executing this line:
/Users/jenkins/workspace/Lucene-Solr-6.x-MacOSX/lucene/common-build.xml:1014: There were test failures: 587 suites (10 ignored), 2366 tests, 2 failures, 119 ignored (69 assumptions) [seed: 9802D92CA5285819]

Total time: 83 minutes 46 seconds
Build step 'Invoke Ant' marked build as failure
Archiving artifacts
[WARNINGS] Skipping publisher since build result is FAILURE
Recording test results
Email was triggered for: Failure - Any
Sending email for trigger: Failure - Any



[JENKINS] Lucene-Solr-6.x-MacOSX (64bit/jdk1.8.0) - Build # 79 - Still Failing!

Posted by Policeman Jenkins Server <je...@thetaphi.de>.
Build: http://jenkins.thetaphi.de/job/Lucene-Solr-6.x-MacOSX/79/
Java: 64bit/jdk1.8.0 -XX:+UseCompressedOops -XX:+UseParallelGC

1 tests failed.
FAILED:  org.apache.solr.handler.TestReplicationHandler.doTestIndexAndConfigAliasReplication

Error Message:
Index: 0, Size: 0

Stack Trace:
java.lang.IndexOutOfBoundsException: Index: 0, Size: 0
	at __randomizedtesting.SeedInfo.seed([1129F0CFA8D8E4AE:E65A1E976E304B48]:0)
	at java.util.ArrayList.rangeCheck(ArrayList.java:653)
	at java.util.ArrayList.get(ArrayList.java:429)
	at org.apache.solr.handler.TestReplicationHandler.doTestIndexAndConfigAliasReplication(TestReplicationHandler.java:1245)
	at sun.reflect.NativeMethodAccessorImpl.invoke0(Native Method)
	at sun.reflect.NativeMethodAccessorImpl.invoke(NativeMethodAccessorImpl.java:62)
	at sun.reflect.DelegatingMethodAccessorImpl.invoke(DelegatingMethodAccessorImpl.java:43)
	at java.lang.reflect.Method.invoke(Method.java:498)
	at com.carrotsearch.randomizedtesting.RandomizedRunner.invoke(RandomizedRunner.java:1764)
	at com.carrotsearch.randomizedtesting.RandomizedRunner$8.evaluate(RandomizedRunner.java:871)
	at com.carrotsearch.randomizedtesting.RandomizedRunner$9.evaluate(RandomizedRunner.java:907)
	at com.carrotsearch.randomizedtesting.RandomizedRunner$10.evaluate(RandomizedRunner.java:921)
	at com.carrotsearch.randomizedtesting.rules.SystemPropertiesRestoreRule$1.evaluate(SystemPropertiesRestoreRule.java:57)
	at org.apache.lucene.util.TestRuleSetupTeardownChained$1.evaluate(TestRuleSetupTeardownChained.java:49)
	at org.apache.lucene.util.AbstractBeforeAfterRule$1.evaluate(AbstractBeforeAfterRule.java:45)
	at org.apache.lucene.util.TestRuleThreadAndTestName$1.evaluate(TestRuleThreadAndTestName.java:48)
	at org.apache.lucene.util.TestRuleIgnoreAfterMaxFailures$1.evaluate(TestRuleIgnoreAfterMaxFailures.java:64)
	at org.apache.lucene.util.TestRuleMarkFailure$1.evaluate(TestRuleMarkFailure.java:47)
	at com.carrotsearch.randomizedtesting.rules.StatementAdapter.evaluate(StatementAdapter.java:36)
	at com.carrotsearch.randomizedtesting.ThreadLeakControl$StatementRunner.run(ThreadLeakControl.java:367)
	at com.carrotsearch.randomizedtesting.ThreadLeakControl.forkTimeoutingTask(ThreadLeakControl.java:809)
	at com.carrotsearch.randomizedtesting.ThreadLeakControl$3.evaluate(ThreadLeakControl.java:460)
	at com.carrotsearch.randomizedtesting.RandomizedRunner.runSingleTest(RandomizedRunner.java:880)
	at com.carrotsearch.randomizedtesting.RandomizedRunner$5.evaluate(RandomizedRunner.java:781)
	at com.carrotsearch.randomizedtesting.RandomizedRunner$6.evaluate(RandomizedRunner.java:816)
	at com.carrotsearch.randomizedtesting.RandomizedRunner$7.evaluate(RandomizedRunner.java:827)
	at com.carrotsearch.randomizedtesting.rules.StatementAdapter.evaluate(StatementAdapter.java:36)
	at com.carrotsearch.randomizedtesting.rules.SystemPropertiesRestoreRule$1.evaluate(SystemPropertiesRestoreRule.java:57)
	at org.apache.lucene.util.AbstractBeforeAfterRule$1.evaluate(AbstractBeforeAfterRule.java:45)
	at com.carrotsearch.randomizedtesting.rules.StatementAdapter.evaluate(StatementAdapter.java:36)
	at org.apache.lucene.util.TestRuleStoreClassName$1.evaluate(TestRuleStoreClassName.java:41)
	at com.carrotsearch.randomizedtesting.rules.NoShadowingOrOverridesOnMethodsRule$1.evaluate(NoShadowingOrOverridesOnMethodsRule.java:40)
	at com.carrotsearch.randomizedtesting.rules.NoShadowingOrOverridesOnMethodsRule$1.evaluate(NoShadowingOrOverridesOnMethodsRule.java:40)
	at com.carrotsearch.randomizedtesting.rules.StatementAdapter.evaluate(StatementAdapter.java:36)
	at com.carrotsearch.randomizedtesting.rules.StatementAdapter.evaluate(StatementAdapter.java:36)
	at com.carrotsearch.randomizedtesting.rules.StatementAdapter.evaluate(StatementAdapter.java:36)
	at org.apache.lucene.util.TestRuleAssertionsRequired$1.evaluate(TestRuleAssertionsRequired.java:53)
	at org.apache.lucene.util.TestRuleMarkFailure$1.evaluate(TestRuleMarkFailure.java:47)
	at org.apache.lucene.util.TestRuleIgnoreAfterMaxFailures$1.evaluate(TestRuleIgnoreAfterMaxFailures.java:64)
	at org.apache.lucene.util.TestRuleIgnoreTestSuites$1.evaluate(TestRuleIgnoreTestSuites.java:54)
	at com.carrotsearch.randomizedtesting.rules.StatementAdapter.evaluate(StatementAdapter.java:36)
	at com.carrotsearch.randomizedtesting.ThreadLeakControl$StatementRunner.run(ThreadLeakControl.java:367)
	at java.lang.Thread.run(Thread.java:745)




Build Log:
[...truncated 10602 lines...]
   [junit4] Suite: org.apache.solr.handler.TestReplicationHandler
   [junit4]   2> Creating dataDir: /Users/jenkins/workspace/Lucene-Solr-6.x-MacOSX/solr/build/solr-core/test/J0/temp/solr.handler.TestReplicationHandler_1129F0CFA8D8E4AE-001/init-core-data-001
   [junit4]   2> 133872 INFO  (TEST-TestReplicationHandler.doTestStressReplication-seed#[1129F0CFA8D8E4AE]) [    ] o.a.s.SolrTestCaseJ4 ###Starting doTestStressReplication
   [junit4]   2> 133873 INFO  (TEST-TestReplicationHandler.doTestStressReplication-seed#[1129F0CFA8D8E4AE]) [    ] o.a.s.SolrTestCaseJ4 Writing core.properties file to /Users/jenkins/workspace/Lucene-Solr-6.x-MacOSX/solr/build/solr-core/test/J0/temp/solr.handler.TestReplicationHandler_1129F0CFA8D8E4AE-001/solr-instance-001/collection1
   [junit4]   2> 133905 INFO  (TEST-TestReplicationHandler.doTestStressReplication-seed#[1129F0CFA8D8E4AE]) [    ] o.e.j.s.Server jetty-9.3.8.v20160314
   [junit4]   2> 133911 INFO  (TEST-TestReplicationHandler.doTestStressReplication-seed#[1129F0CFA8D8E4AE]) [    ] o.e.j.s.h.ContextHandler Started o.e.j.s.ServletContextHandler@282962a5{/solr,null,AVAILABLE}
   [junit4]   2> 133920 INFO  (TEST-TestReplicationHandler.doTestStressReplication-seed#[1129F0CFA8D8E4AE]) [    ] o.e.j.s.ServerConnector Started ServerConnector@3e4be29{HTTP/1.1,[http/1.1]}{127.0.0.1:50424}
   [junit4]   2> 133920 INFO  (TEST-TestReplicationHandler.doTestStressReplication-seed#[1129F0CFA8D8E4AE]) [    ] o.e.j.s.Server Started @142058ms
   [junit4]   2> 133921 INFO  (TEST-TestReplicationHandler.doTestStressReplication-seed#[1129F0CFA8D8E4AE]) [    ] o.a.s.c.s.e.JettySolrRunner Jetty properties: {solr.data.dir=/Users/jenkins/workspace/Lucene-Solr-6.x-MacOSX/solr/build/solr-core/test/J0/temp/solr.handler.TestReplicationHandler_1129F0CFA8D8E4AE-001/solr-instance-001/collection1/data, hostContext=/solr, hostPort=50424}
   [junit4]   2> 133921 INFO  (TEST-TestReplicationHandler.doTestStressReplication-seed#[1129F0CFA8D8E4AE]) [    ] o.a.s.s.SolrDispatchFilter SolrDispatchFilter.init(): sun.misc.Launcher$AppClassLoader@4554617c
   [junit4]   2> 133922 INFO  (TEST-TestReplicationHandler.doTestStressReplication-seed#[1129F0CFA8D8E4AE]) [    ] o.a.s.c.SolrResourceLoader new SolrResourceLoader for directory: '/Users/jenkins/workspace/Lucene-Solr-6.x-MacOSX/solr/build/solr-core/test/J0/temp/solr.handler.TestReplicationHandler_1129F0CFA8D8E4AE-001/solr-instance-001'
   [junit4]   2> 133923 INFO  (TEST-TestReplicationHandler.doTestStressReplication-seed#[1129F0CFA8D8E4AE]) [    ] o.a.s.c.SolrResourceLoader JNDI not configured for solr (NoInitialContextEx)
   [junit4]   2> 133923 INFO  (TEST-TestReplicationHandler.doTestStressReplication-seed#[1129F0CFA8D8E4AE]) [    ] o.a.s.c.SolrResourceLoader solr home defaulted to 'solr/' (could not find system property or JNDI)
   [junit4]   2> 133923 INFO  (TEST-TestReplicationHandler.doTestStressReplication-seed#[1129F0CFA8D8E4AE]) [    ] o.a.s.c.SolrXmlConfig Loading container configuration from /Users/jenkins/workspace/Lucene-Solr-6.x-MacOSX/solr/build/solr-core/test/J0/temp/solr.handler.TestReplicationHandler_1129F0CFA8D8E4AE-001/solr-instance-001/solr.xml
   [junit4]   2> 133938 INFO  (TEST-TestReplicationHandler.doTestStressReplication-seed#[1129F0CFA8D8E4AE]) [    ] o.a.s.c.CorePropertiesLocator Config-defined core root directory: /Users/jenkins/workspace/Lucene-Solr-6.x-MacOSX/solr/build/solr-core/test/J0/temp/solr.handler.TestReplicationHandler_1129F0CFA8D8E4AE-001/solr-instance-001/.
   [junit4]   2> 133938 INFO  (TEST-TestReplicationHandler.doTestStressReplication-seed#[1129F0CFA8D8E4AE]) [    ] o.a.s.c.CoreContainer New CoreContainer 834993428
   [junit4]   2> 133938 INFO  (TEST-TestReplicationHandler.doTestStressReplication-seed#[1129F0CFA8D8E4AE]) [    ] o.a.s.c.CoreContainer Loading cores into CoreContainer [instanceDir=/Users/jenkins/workspace/Lucene-Solr-6.x-MacOSX/solr/build/solr-core/test/J0/temp/solr.handler.TestReplicationHandler_1129F0CFA8D8E4AE-001/solr-instance-001]
   [junit4]   2> 133938 WARN  (TEST-TestReplicationHandler.doTestStressReplication-seed#[1129F0CFA8D8E4AE]) [    ] o.a.s.c.CoreContainer Couldn't add files from /Users/jenkins/workspace/Lucene-Solr-6.x-MacOSX/solr/build/solr-core/test/J0/temp/solr.handler.TestReplicationHandler_1129F0CFA8D8E4AE-001/solr-instance-001/lib to classpath: /Users/jenkins/workspace/Lucene-Solr-6.x-MacOSX/solr/build/solr-core/test/J0/temp/solr.handler.TestReplicationHandler_1129F0CFA8D8E4AE-001/solr-instance-001/lib
   [junit4]   2> 133939 INFO  (TEST-TestReplicationHandler.doTestStressReplication-seed#[1129F0CFA8D8E4AE]) [    ] o.a.s.h.c.HttpShardHandlerFactory created with socketTimeout : 90000,urlScheme : ,connTimeout : 15000,maxConnectionsPerHost : 20,maxConnections : 10000,corePoolSize : 0,maximumPoolSize : 2147483647,maxThreadIdleTime : 5,sizeOfQueue : -1,fairnessPolicy : false,useRetries : false,
   [junit4]   2> 133944 INFO  (TEST-TestReplicationHandler.doTestStressReplication-seed#[1129F0CFA8D8E4AE]) [    ] o.a.s.u.UpdateShardHandler Creating UpdateShardHandler HTTP client with params: socketTimeout=340000&connTimeout=45000&retry=true
   [junit4]   2> 133944 INFO  (TEST-TestReplicationHandler.doTestStressReplication-seed#[1129F0CFA8D8E4AE]) [    ] o.a.s.l.LogWatcher SLF4J impl is org.slf4j.impl.Log4jLoggerFactory
   [junit4]   2> 133944 INFO  (TEST-TestReplicationHandler.doTestStressReplication-seed#[1129F0CFA8D8E4AE]) [    ] o.a.s.l.LogWatcher Registering Log Listener [Log4j (org.slf4j.impl.Log4jLoggerFactory)]
   [junit4]   2> 133945 INFO  (TEST-TestReplicationHandler.doTestStressReplication-seed#[1129F0CFA8D8E4AE]) [    ] o.a.s.c.CoreContainer Security conf doesn't exist. Skipping setup for authorization module.
   [junit4]   2> 133945 INFO  (TEST-TestReplicationHandler.doTestStressReplication-seed#[1129F0CFA8D8E4AE]) [    ] o.a.s.c.CoreContainer No authentication plugin used.
   [junit4]   2> 133975 INFO  (TEST-TestReplicationHandler.doTestStressReplication-seed#[1129F0CFA8D8E4AE]) [    ] o.a.s.c.CorePropertiesLocator Looking for core definitions underneath /Users/jenkins/workspace/Lucene-Solr-6.x-MacOSX/solr/build/solr-core/test/J0/temp/solr.handler.TestReplicationHandler_1129F0CFA8D8E4AE-001/solr-instance-001/.
   [junit4]   2> 133978 INFO  (TEST-TestReplicationHandler.doTestStressReplication-seed#[1129F0CFA8D8E4AE]) [    ] o.a.s.c.CoreDescriptor Created CoreDescriptor: {name=collection1, config=solrconfig.xml, loadOnStartup=true, schema=schema.xml, configSetProperties=configsetprops.json, transient=false, dataDir=data/}
   [junit4]   2> 133978 INFO  (TEST-TestReplicationHandler.doTestStressReplication-seed#[1129F0CFA8D8E4AE]) [    ] o.a.s.c.CorePropertiesLocator Found core collection1 in /Users/jenkins/workspace/Lucene-Solr-6.x-MacOSX/solr/build/solr-core/test/J0/temp/solr.handler.TestReplicationHandler_1129F0CFA8D8E4AE-001/solr-instance-001/./collection1
   [junit4]   2> 133979 INFO  (TEST-TestReplicationHandler.doTestStressReplication-seed#[1129F0CFA8D8E4AE]) [    ] o.a.s.c.CorePropertiesLocator Found 1 core definitions
   [junit4]   2> 133980 INFO  (coreLoadExecutor-118-thread-1) [    ] o.a.s.c.SolrResourceLoader new SolrResourceLoader for directory: '/Users/jenkins/workspace/Lucene-Solr-6.x-MacOSX/solr/build/solr-core/test/J0/temp/solr.handler.TestReplicationHandler_1129F0CFA8D8E4AE-001/solr-instance-001/collection1'
   [junit4]   2> 133981 INFO  (coreLoadExecutor-118-thread-1) [    ] o.a.s.c.SolrResourceLoader JNDI not configured for solr (NoInitialContextEx)
   [junit4]   2> 133981 INFO  (coreLoadExecutor-118-thread-1) [    ] o.a.s.c.SolrResourceLoader solr home defaulted to 'solr/' (could not find system property or JNDI)
   [junit4]   2> 133983 INFO  (TEST-TestReplicationHandler.doTestStressReplication-seed#[1129F0CFA8D8E4AE]) [    ] o.a.s.s.SolrDispatchFilter user.dir=/Users/jenkins/workspace/Lucene-Solr-6.x-MacOSX/solr/build/solr-core/test/J0
   [junit4]   2> 133983 INFO  (TEST-TestReplicationHandler.doTestStressReplication-seed#[1129F0CFA8D8E4AE]) [    ] o.a.s.s.SolrDispatchFilter SolrDispatchFilter.init() done
   [junit4]   2> 134006 INFO  (coreLoadExecutor-118-thread-1) [    ] o.a.s.c.SolrConfig current version of requestparams : -1
   [junit4]   2> 134010 WARN  (coreLoadExecutor-118-thread-1) [    ] o.a.s.c.Config Beginning with Solr 5.5, <mergePolicy> is deprecated, use <mergePolicyFactory> instead.
   [junit4]   2> 134010 INFO  (coreLoadExecutor-118-thread-1) [    ] o.a.s.c.SolrConfig Using Lucene MatchVersion: 6.1.0
   [junit4]   2> 134018 INFO  (coreLoadExecutor-118-thread-1) [    ] o.a.s.c.SolrConfig Loaded SolrConfig: solrconfig.xml
   [junit4]   2> 134025 INFO  (coreLoadExecutor-118-thread-1) [    ] o.a.s.s.IndexSchema [collection1] Schema name=test
   [junit4]   2> 134033 INFO  (coreLoadExecutor-118-thread-1) [    ] o.a.s.s.IndexSchema unique key field: id
   [junit4]   2> 134039 INFO  (coreLoadExecutor-118-thread-1) [    ] o.a.s.c.ConfigSetProperties Did not find ConfigSet properties, assuming default properties: Can't find resource 'configsetprops.json' in classpath or '/Users/jenkins/workspace/Lucene-Solr-6.x-MacOSX/solr/build/solr-core/test/J0/temp/solr.handler.TestReplicationHandler_1129F0CFA8D8E4AE-001/solr-instance-001/collection1'
   [junit4]   2> 134039 INFO  (coreLoadExecutor-118-thread-1) [    ] o.a.s.c.CoreContainer Creating SolrCore 'collection1' using configuration from instancedir /Users/jenkins/workspace/Lucene-Solr-6.x-MacOSX/solr/build/solr-core/test/J0/temp/solr.handler.TestReplicationHandler_1129F0CFA8D8E4AE-001/solr-instance-001/./collection1
   [junit4]   2> 134040 INFO  (coreLoadExecutor-118-thread-1) [    x:collection1] o.a.s.c.SolrCore org.apache.solr.core.MockDirectoryFactory
   [junit4]   2> 134041 INFO  (coreLoadExecutor-118-thread-1) [    x:collection1] o.a.s.c.SolrCore [[collection1] ] Opening new SolrCore at [/Users/jenkins/workspace/Lucene-Solr-6.x-MacOSX/solr/build/solr-core/test/J0/temp/solr.handler.TestReplicationHandler_1129F0CFA8D8E4AE-001/solr-instance-001/collection1], dataDir=[/Users/jenkins/workspace/Lucene-Solr-6.x-MacOSX/solr/build/solr-core/test/J0/temp/solr.handler.TestReplicationHandler_1129F0CFA8D8E4AE-001/solr-instance-001/./collection1/data/]
   [junit4]   2> 134041 INFO  (coreLoadExecutor-118-thread-1) [    x:collection1] o.a.s.c.SolrCore JMX monitoring not detected for core: collection1
   [junit4]   2> 134042 INFO  (coreLoadExecutor-118-thread-1) [    x:collection1] o.a.s.c.CachingDirectoryFactory return new directory for /Users/jenkins/workspace/Lucene-Solr-6.x-MacOSX/solr/build/solr-core/test/J0/temp/solr.handler.TestReplicationHandler_1129F0CFA8D8E4AE-001/solr-instance-001/./collection1/data
   [junit4]   2> 134053 INFO  (coreLoadExecutor-118-thread-1) [    x:collection1] o.a.s.c.SolrCore New index directory detected: old=null new=/Users/jenkins/workspace/Lucene-Solr-6.x-MacOSX/solr/build/solr-core/test/J0/temp/solr.handler.TestReplicationHandler_1129F0CFA8D8E4AE-001/solr-instance-001/./collection1/data/index/
   [junit4]   2> 134053 WARN  (coreLoadExecutor-118-thread-1) [    x:collection1] o.a.s.c.SolrCore [collection1] Solr index directory '/Users/jenkins/workspace/Lucene-Solr-6.x-MacOSX/solr/build/solr-core/test/J0/temp/solr.handler.TestReplicationHandler_1129F0CFA8D8E4AE-001/solr-instance-001/./collection1/data/index' doesn't exist. Creating new index...
   [junit4]   2> 134053 INFO  (coreLoadExecutor-118-thread-1) [    x:collection1] o.a.s.c.CachingDirectoryFactory return new directory for /Users/jenkins/workspace/Lucene-Solr-6.x-MacOSX/solr/build/solr-core/test/J0/temp/solr.handler.TestReplicationHandler_1129F0CFA8D8E4AE-001/solr-instance-001/./collection1/data/index
   [junit4]   2> 134054 INFO  (coreLoadExecutor-118-thread-1) [    x:collection1] o.a.s.u.RandomMergePolicy RandomMergePolicy wrapping class org.apache.lucene.index.LogDocMergePolicy: [LogDocMergePolicy: minMergeSize=1000, mergeFactor=19, maxMergeSize=9223372036854775807, maxMergeSizeForForcedMerge=9223372036854775807, calibrateSizeByDeletes=false, maxMergeDocs=2147483647, maxCFSSegmentSizeMB=8.796093022207999E12, noCFSRatio=0.2822471013939566]
   [junit4]   2> 134092 INFO  (coreLoadExecutor-118-thread-1) [    x:collection1] o.a.s.c.SolrDeletionPolicy SolrDeletionPolicy.onCommit: commits: num=1
   [junit4]   2> 	commit{dir=MockDirectoryWrapper(RAMDirectory@5951d628 lockFactory=org.apache.lucene.store.SingleInstanceLockFactory@5ae12ce),segFN=segments_1,generation=1}
   [junit4]   2> 134092 INFO  (coreLoadExecutor-118-thread-1) [    x:collection1] o.a.s.c.SolrDeletionPolicy newest commit generation = 1
   [junit4]   2> 134092 INFO  (OldIndexDirectoryCleanupThreadForCore-collection1) [    x:collection1] o.a.s.c.SolrCore Looking for old index directories to cleanup for core collection1 in /Users/jenkins/workspace/Lucene-Solr-6.x-MacOSX/solr/build/solr-core/test/J0/temp/solr.handler.TestReplicationHandler_1129F0CFA8D8E4AE-001/solr-instance-001/./collection1/data/
   [junit4]   2> 134095 INFO  (coreLoadExecutor-118-thread-1) [    x:collection1] o.a.s.c.SolrCore no updateRequestProcessorChain defined as default, creating implicit default
   [junit4]   2> 134100 INFO  (coreLoadExecutor-118-thread-1) [    x:collection1] o.a.s.h.l.XMLLoader xsltCacheLifetimeSeconds=60
   [junit4]   2> 134102 INFO  (coreLoadExecutor-118-thread-1) [    x:collection1] o.a.s.h.l.XMLLoader xsltCacheLifetimeSeconds=60
   [junit4]   2> 134103 INFO  (coreLoadExecutor-118-thread-1) [    x:collection1] o.a.s.h.l.XMLLoader xsltCacheLifetimeSeconds=60
   [junit4]   2> 134104 INFO  (coreLoadExecutor-118-thread-1) [    x:collection1] o.a.s.h.l.XMLLoader xsltCacheLifetimeSeconds=60
   [junit4]   2> 134107 INFO  (coreLoadExecutor-118-thread-1) [    x:collection1] o.a.s.c.PluginBag requestHandler : 'lazy' created with startup=lazy 
   [junit4]   2> 134107 INFO  (coreLoadExecutor-118-thread-1) [    x:collection1] o.a.s.c.RequestHandlers Registered paths: /admin/mbeans,standard,lazy,/update/json/docs,/admin/luke,/export,/get,/admin/properties,/update/json,/admin/threads,/update/csv,/sql,/admin/segments,/admin/system,/replication,defaults,/config,/stream,/schema,/admin/plugins,/admin/logging,/admin/ping,/update,/admin/file
   [junit4]   2> 134108 INFO  (coreLoadExecutor-118-thread-1) [    x:collection1] o.a.s.c.SolrCore Using default statsCache cache: org.apache.solr.search.stats.LocalStatsCache
   [junit4]   2> 134109 INFO  (coreLoadExecutor-118-thread-1) [    x:collection1] o.a.s.u.CommitTracker Hard AutoCommit: disabled
   [junit4]   2> 134109 INFO  (coreLoadExecutor-118-thread-1) [    x:collection1] o.a.s.u.CommitTracker Soft AutoCommit: disabled
   [junit4]   2> 134122 INFO  (coreLoadExecutor-118-thread-1) [    x:collection1] o.a.s.u.RandomMergePolicy RandomMergePolicy wrapping class org.apache.lucene.index.TieredMergePolicy: [TieredMergePolicy: maxMergeAtOnce=26, maxMergeAtOnceExplicit=48, maxMergedSegmentMB=48.6943359375, floorSegmentMB=0.462890625, forceMergeDeletesPctAllowed=24.698680062694773, segmentsPerTier=36.0, maxCFSSegmentSizeMB=8.796093022207999E12, noCFSRatio=1.0
   [junit4]   2> 134166 INFO  (coreLoadExecutor-118-thread-1) [    x:collection1] o.a.s.c.SolrDeletionPolicy SolrDeletionPolicy.onInit: commits: num=1
   [junit4]   2> 	commit{dir=MockDirectoryWrapper(RAMDirectory@5951d628 lockFactory=org.apache.lucene.store.SingleInstanceLockFactory@5ae12ce),segFN=segments_1,generation=1}
   [junit4]   2> 134166 INFO  (coreLoadExecutor-118-thread-1) [    x:collection1] o.a.s.c.SolrDeletionPolicy newest commit generation = 1
   [junit4]   2> 134167 INFO  (coreLoadExecutor-118-thread-1) [    x:collection1] o.a.s.s.SolrIndexSearcher Opening [Searcher@20a55feb[collection1] main]
   [junit4]   2> 134167 INFO  (coreLoadExecutor-118-thread-1) [    x:collection1] o.a.s.r.ManagedResourceStorage File-based storage initialized to use dir: /Users/jenkins/workspace/Lucene-Solr-6.x-MacOSX/solr/build/solr-core/test/J0/temp/solr.handler.TestReplicationHandler_1129F0CFA8D8E4AE-001/solr-instance-001/collection1/conf
   [junit4]   2> 134167 INFO  (coreLoadExecutor-118-thread-1) [    x:collection1] o.a.s.r.RestManager Initializing RestManager with initArgs: {storageDir=/Users/jenkins/workspace/Lucene-Solr-6.x-MacOSX/solr/build/solr-core/test/J0/temp/solr.handler.TestReplicationHandler_1129F0CFA8D8E4AE-001/solr-instance-001/collection1/conf}
   [junit4]   2> 134167 INFO  (coreLoadExecutor-118-thread-1) [    x:collection1] o.a.s.r.ManagedResourceStorage Reading _rest_managed.json using file:dir=/Users/jenkins/workspace/Lucene-Solr-6.x-MacOSX/solr/build/solr-core/test/J0/temp/solr.handler.TestReplicationHandler_1129F0CFA8D8E4AE-001/solr-instance-001/collection1/conf
   [junit4]   2> 134168 INFO  (coreLoadExecutor-118-thread-1) [    x:collection1] o.a.s.r.RestManager Initializing 0 registered ManagedResources
   [junit4]   2> 134168 INFO  (coreLoadExecutor-118-thread-1) [    x:collection1] o.a.s.h.ReplicationHandler Replication enabled for following config files: schema.xml,xslt/dummy.xsl
   [junit4]   2> 134168 INFO  (coreLoadExecutor-118-thread-1) [    x:collection1] o.a.s.h.ReplicationHandler Commits will be reserved for  10000
   [junit4]   2> 134169 INFO  (searcherExecutor-119-thread-1-processing-x:collection1) [    x:collection1] o.a.s.c.SolrCore [collection1] Registered new searcher Searcher@20a55feb[collection1] main{ExitableDirectoryReader(UninvertingDirectoryReader())}
   [junit4]   2> 134169 INFO  (coreLoadExecutor-118-thread-1) [    x:collection1] o.a.s.c.CoreContainer registering core: collection1
   [junit4]   2> 134491 INFO  (TEST-TestReplicationHandler.doTestStressReplication-seed#[1129F0CFA8D8E4AE]) [    ] o.a.s.SolrTestCaseJ4 Writing core.properties file to /Users/jenkins/workspace/Lucene-Solr-6.x-MacOSX/solr/build/solr-core/test/J0/temp/solr.handler.TestReplicationHandler_1129F0CFA8D8E4AE-001/solr-instance-002/collection1
   [junit4]   2> 134503 INFO  (TEST-TestReplicationHandler.doTestStressReplication-seed#[1129F0CFA8D8E4AE]) [    ] o.e.j.s.Server jetty-9.3.8.v20160314
   [junit4]   2> 134507 INFO  (TEST-TestReplicationHandler.doTestStressReplication-seed#[1129F0CFA8D8E4AE]) [    ] o.e.j.s.h.ContextHandler Started o.e.j.s.ServletContextHandler@9012568{/solr,null,AVAILABLE}
   [junit4]   2> 134508 INFO  (TEST-TestReplicationHandler.doTestStressReplication-seed#[1129F0CFA8D8E4AE]) [    ] o.e.j.s.ServerConnector Started ServerConnector@3cf54000{HTTP/1.1,[http/1.1]}{127.0.0.1:50426}
   [junit4]   2> 134509 INFO  (TEST-TestReplicationHandler.doTestStressReplication-seed#[1129F0CFA8D8E4AE]) [    ] o.e.j.s.Server Started @142646ms
   [junit4]   2> 134509 INFO  (TEST-TestReplicationHandler.doTestStressReplication-seed#[1129F0CFA8D8E4AE]) [    ] o.a.s.c.s.e.JettySolrRunner Jetty properties: {solr.data.dir=/Users/jenkins/workspace/Lucene-Solr-6.x-MacOSX/solr/build/solr-core/test/J0/temp/solr.handler.TestReplicationHandler_1129F0CFA8D8E4AE-001/solr-instance-002/collection1/data, hostContext=/solr, hostPort=50426}
   [junit4]   2> 134509 INFO  (TEST-TestReplicationHandler.doTestStressReplication-seed#[1129F0CFA8D8E4AE]) [    ] o.a.s.s.SolrDispatchFilter SolrDispatchFilter.init(): sun.misc.Launcher$AppClassLoader@4554617c
   [junit4]   2> 134510 INFO  (TEST-TestReplicationHandler.doTestStressReplication-seed#[1129F0CFA8D8E4AE]) [    ] o.a.s.c.SolrResourceLoader new SolrResourceLoader for directory: '/Users/jenkins/workspace/Lucene-Solr-6.x-MacOSX/solr/build/solr-core/test/J0/temp/solr.handler.TestReplicationHandler_1129F0CFA8D8E4AE-001/solr-instance-002'
   [junit4]   2> 134510 INFO  (TEST-TestReplicationHandler.doTestStressReplication-seed#[1129F0CFA8D8E4AE]) [    ] o.a.s.c.SolrResourceLoader JNDI not configured for solr (NoInitialContextEx)
   [junit4]   2> 134510 INFO  (TEST-TestReplicationHandler.doTestStressReplication-seed#[1129F0CFA8D8E4AE]) [    ] o.a.s.c.SolrResourceLoader solr home defaulted to 'solr/' (could not find system property or JNDI)
   [junit4]   2> 134511 INFO  (TEST-TestReplicationHandler.doTestStressReplication-seed#[1129F0CFA8D8E4AE]) [    ] o.a.s.c.SolrXmlConfig Loading container configuration from /Users/jenkins/workspace/Lucene-Solr-6.x-MacOSX/solr/build/solr-core/test/J0/temp/solr.handler.TestReplicationHandler_1129F0CFA8D8E4AE-001/solr-instance-002/solr.xml
   [junit4]   2> 134518 INFO  (TEST-TestReplicationHandler.doTestStressReplication-seed#[1129F0CFA8D8E4AE]) [    ] o.a.s.c.CorePropertiesLocator Config-defined core root directory: /Users/jenkins/workspace/Lucene-Solr-6.x-MacOSX/solr/build/solr-core/test/J0/temp/solr.handler.TestReplicationHandler_1129F0CFA8D8E4AE-001/solr-instance-002/.
   [junit4]   2> 134519 INFO  (TEST-TestReplicationHandler.doTestStressReplication-seed#[1129F0CFA8D8E4AE]) [    ] o.a.s.c.CoreContainer New CoreContainer 335652435
   [junit4]   2> 134519 INFO  (TEST-TestReplicationHandler.doTestStressReplication-seed#[1129F0CFA8D8E4AE]) [    ] o.a.s.c.CoreContainer Loading cores into CoreContainer [instanceDir=/Users/jenkins/workspace/Lucene-Solr-6.x-MacOSX/solr/build/solr-core/test/J0/temp/solr.handler.TestReplicationHandler_1129F0CFA8D8E4AE-001/solr-instance-002]
   [junit4]   2> 134519 WARN  (TEST-TestReplicationHandler.doTestStressReplication-seed#[1129F0CFA8D8E4AE]) [    ] o.a.s.c.CoreContainer Couldn't add files from /Users/jenkins/workspace/Lucene-Solr-6.x-MacOSX/solr/build/solr-core/test/J0/temp/solr.handler.TestReplicationHandler_1129F0CFA8D8E4AE-001/solr-instance-002/lib to classpath: /Users/jenkins/workspace/Lucene-Solr-6.x-MacOSX/solr/build/solr-core/test/J0/temp/solr.handler.TestReplicationHandler_1129F0CFA8D8E4AE-001/solr-instance-002/lib
   [junit4]   2> 134520 INFO  (TEST-TestReplicationHandler.doTestStressReplication-seed#[1129F0CFA8D8E4AE]) [    ] o.a.s.h.c.HttpShardHandlerFactory created with socketTimeout : 90000,urlScheme : ,connTimeout : 15000,maxConnectionsPerHost : 20,maxConnections : 10000,corePoolSize : 0,maximumPoolSize : 2147483647,maxThreadIdleTime : 5,sizeOfQueue : -1,fairnessPolicy : false,useRetries : false,
   [junit4]   2> 134521 INFO  (TEST-TestReplicationHandler.doTestStressReplication-seed#[1129F0CFA8D8E4AE]) [    ] o.a.s.u.UpdateShardHandler Creating UpdateShardHandler HTTP client with params: socketTimeout=340000&connTimeout=45000&retry=true
   [junit4]   2> 134521 INFO  (TEST-TestReplicationHandler.doTestStressReplication-seed#[1129F0CFA8D8E4AE]) [    ] o.a.s.l.LogWatcher SLF4J impl is org.slf4j.impl.Log4jLoggerFactory
   [junit4]   2> 134521 INFO  (TEST-TestReplicationHandler.doTestStressReplication-seed#[1129F0CFA8D8E4AE]) [    ] o.a.s.l.LogWatcher Registering Log Listener [Log4j (org.slf4j.impl.Log4jLoggerFactory)]
   [junit4]   2> 134521 INFO  (TEST-TestReplicationHandler.doTestStressReplication-seed#[1129F0CFA8D8E4AE]) [    ] o.a.s.c.CoreContainer Security conf doesn't exist. Skipping setup for authorization module.
   [junit4]   2> 134522 INFO  (TEST-TestReplicationHandler.doTestStressReplication-seed#[1129F0CFA8D8E4AE]) [    ] o.a.s.c.CoreContainer No authentication plugin used.
   [junit4]   2> 134523 INFO  (TEST-TestReplicationHandler.doTestStressReplication-seed#[1129F0CFA8D8E4AE]) [    ] o.a.s.c.CorePropertiesLocator Looking for core definitions underneath /Users/jenkins/workspace/Lucene-Solr-6.x-MacOSX/solr/build/solr-core/test/J0/temp/solr.handler.TestReplicationHandler_1129F0CFA8D8E4AE-001/solr-instance-002/.
   [junit4]   2> 134528 INFO  (TEST-TestReplicationHandler.doTestStressReplication-seed#[1129F0CFA8D8E4AE]) [    ] o.a.s.c.CoreDescriptor Created CoreDescriptor: {name=collection1, config=solrconfig.xml, loadOnStartup=true, schema=schema.xml, configSetProperties=configsetprops.json, transient=false, dataDir=data/}
   [junit4]   2> 134528 INFO  (TEST-TestReplicationHandler.doTestStressReplication-seed#[1129F0CFA8D8E4AE]) [    ] o.a.s.c.CorePropertiesLocator Found core collection1 in /Users/jenkins/workspace/Lucene-Solr-6.x-MacOSX/solr/build/solr-core/test/J0/temp/solr.handler.TestReplicationHandler_1129F0CFA8D8E4AE-001/solr-instance-002/./collection1
   [junit4]   2> 134529 INFO  (TEST-TestReplicationHandler.doTestStressReplication-seed#[1129F0CFA8D8E4AE]) [    ] o.a.s.c.CorePropertiesLocator Found 1 core definitions
   [junit4]   2> 134530 INFO  (coreLoadExecutor-128-thread-1) [    ] o.a.s.c.SolrResourceLoader new SolrResourceLoader for directory: '/Users/jenkins/workspace/Lucene-Solr-6.x-MacOSX/solr/build/solr-core/test/J0/temp/solr.handler.TestReplicationHandler_1129F0CFA8D8E4AE-001/solr-instance-002/collection1'
   [junit4]   2> 134531 INFO  (TEST-TestReplicationHandler.doTestStressReplication-seed#[1129F0CFA8D8E4AE]) [    ] o.a.s.s.SolrDispatchFilter user.dir=/Users/jenkins/workspace/Lucene-Solr-6.x-MacOSX/solr/build/solr-core/test/J0
   [junit4]   2> 134531 INFO  (TEST-TestReplicationHandler.doTestStressReplication-seed#[1129F0CFA8D8E4AE]) [    ] o.a.s.s.SolrDispatchFilter SolrDispatchFilter.init() done
   [junit4]   2> 134531 INFO  (coreLoadExecutor-128-thread-1) [    ] o.a.s.c.SolrResourceLoader JNDI not configured for solr (NoInitialContextEx)
   [junit4]   2> 134531 INFO  (coreLoadExecutor-128-thread-1) [    ] o.a.s.c.SolrResourceLoader solr home defaulted to 'solr/' (could not find system property or JNDI)
   [junit4]   2> 134545 INFO  (coreLoadExecutor-128-thread-1) [    ] o.a.s.c.SolrConfig current version of requestparams : -1
   [junit4]   2> 134548 WARN  (coreLoadExecutor-128-thread-1) [    ] o.a.s.c.Config Beginning with Solr 5.5, <mergePolicy> is deprecated, use <mergePolicyFactory> instead.
   [junit4]   2> 134548 INFO  (coreLoadExecutor-128-thread-1) [    ] o.a.s.c.SolrConfig Using Lucene MatchVersion: 6.1.0
   [junit4]   2> 134571 INFO  (coreLoadExecutor-128-thread-1) [    ] o.a.s.c.SolrConfig Loaded SolrConfig: solrconfig.xml
   [junit4]   2> 134576 INFO  (coreLoadExecutor-128-thread-1) [    ] o.a.s.s.IndexSchema [collection1] Schema name=test
   [junit4]   2> 134581 INFO  (coreLoadExecutor-128-thread-1) [    ] o.a.s.s.IndexSchema unique key field: id
   [junit4]   2> 134584 INFO  (coreLoadExecutor-128-thread-1) [    ] o.a.s.c.ConfigSetProperties Did not find ConfigSet properties, assuming default properties: Can't find resource 'configsetprops.json' in classpath or '/Users/jenkins/workspace/Lucene-Solr-6.x-MacOSX/solr/build/solr-core/test/J0/temp/solr.handler.TestReplicationHandler_1129F0CFA8D8E4AE-001/solr-instance-002/collection1'
   [junit4]   2> 134584 INFO  (coreLoadExecutor-128-thread-1) [    ] o.a.s.c.CoreContainer Creating SolrCore 'collection1' using configuration from instancedir /Users/jenkins/workspace/Lucene-Solr-6.x-MacOSX/solr/build/solr-core/test/J0/temp/solr.handler.TestReplicationHandler_1129F0CFA8D8E4AE-001/solr-instance-002/./collection1
   [junit4]   2> 134584 INFO  (coreLoadExecutor-128-thread-1) [    x:collection1] o.a.s.c.SolrCore org.apache.solr.core.MockDirectoryFactory
   [junit4]   2> 134585 INFO  (coreLoadExecutor-128-thread-1) [    x:collection1] o.a.s.c.SolrCore [[collection1] ] Opening new SolrCore at [/Users/jenkins/workspace/Lucene-Solr-6.x-MacOSX/solr/build/solr-core/test/J0/temp/solr.handler.TestReplicationHandler_1129F0CFA8D8E4AE-001/solr-instance-002/collection1], dataDir=[/Users/jenkins/workspace/Lucene-Solr-6.x-MacOSX/solr/build/solr-core/test/J0/temp/solr.handler.TestReplicationHandler_1129F0CFA8D8E4AE-001/solr-instance-002/./collection1/data/]
   [junit4]   2> 134585 INFO  (coreLoadExecutor-128-thread-1) [    x:collection1] o.a.s.c.SolrCore JMX monitoring not detected for core: collection1
   [junit4]   2> 134585 INFO  (coreLoadExecutor-128-thread-1) [    x:collection1] o.a.s.c.CachingDirectoryFactory return new directory for /Users/jenkins/workspace/Lucene-Solr-6.x-MacOSX/solr/build/solr-core/test/J0/temp/solr.handler.TestReplicationHandler_1129F0CFA8D8E4AE-001/solr-instance-002/./collection1/data
   [junit4]   2> 134596 INFO  (coreLoadExecutor-128-thread-1) [    x:collection1] o.a.s.c.SolrCore New index directory detected: old=null new=/Users/jenkins/workspace/Lucene-Solr-6.x-MacOSX/solr/build/solr-core/test/J0/temp/solr.handler.TestReplicationHandler_1129F0CFA8D8E4AE-001/solr-instance-002/./collection1/data/index/
   [junit4]   2> 134596 WARN  (coreLoadExecutor-128-thread-1) [    x:collection1] o.a.s.c.SolrCore [collection1] Solr index directory '/Users/jenkins/workspace/Lucene-Solr-6.x-MacOSX/solr/build/solr-core/test/J0/temp/solr.handler.TestReplicationHandler_1129F0CFA8D8E4AE-001/solr-instance-002/./collection1/data/index' doesn't exist. Creating new index...
   [junit4]   2> 134597 INFO  (coreLoadExecutor-128-thread-1) [    x:collection1] o.a.s.c.CachingDirectoryFactory return new directory for /Users/jenkins/workspace/Lucene-Solr-6.x-MacOSX/solr/build/solr-core/test/J0/temp/solr.handler.TestReplicationHandler_1129F0CFA8D8E4AE-001/solr-instance-002/./collection1/data/index
   [junit4]   2> 134598 INFO  (coreLoadExecutor-128-thread-1) [    x:collection1] o.a.s.u.RandomMergePolicy RandomMergePolicy wrapping class org.apache.lucene.index.LogDocMergePolicy: [LogDocMergePolicy: minMergeSize=1000, mergeFactor=19, maxMergeSize=9223372036854775807, maxMergeSizeForForcedMerge=9223372036854775807, calibrateSizeByDeletes=false, maxMergeDocs=2147483647, maxCFSSegmentSizeMB=8.796093022207999E12, noCFSRatio=0.2822471013939566]
   [junit4]   2> 134636 INFO  (coreLoadExecutor-128-thread-1) [    x:collection1] o.a.s.c.SolrDeletionPolicy SolrDeletionPolicy.onCommit: commits: num=1
   [junit4]   2> 	commit{dir=MockDirectoryWrapper(RAMDirectory@5462f974 lockFactory=org.apache.lucene.store.SingleInstanceLockFactory@481a4be6),segFN=segments_1,generation=1}
   [junit4]   2> 134636 INFO  (coreLoadExecutor-128-thread-1) [    x:collection1] o.a.s.c.SolrDeletionPolicy newest commit generation = 1
   [junit4]   2> 134637 INFO  (OldIndexDirectoryCleanupThreadForCore-collection1) [    x:collection1] o.a.s.c.SolrCore Looking for old index directories to cleanup for core collection1 in /Users/jenkins/workspace/Lucene-Solr-6.x-MacOSX/solr/build/solr-core/test/J0/temp/solr.handler.TestReplicationHandler_1129F0CFA8D8E4AE-001/solr-instance-002/./collection1/data/
   [junit4]   2> 134639 INFO  (coreLoadExecutor-128-thread-1) [    x:collection1] o.a.s.c.SolrCore no updateRequestProcessorChain defined as default, creating implicit default
   [junit4]   2> 134641 INFO  (coreLoadExecutor-128-thread-1) [    x:collection1] o.a.s.h.l.XMLLoader xsltCacheLifetimeSeconds=60
   [junit4]   2> 134643 INFO  (coreLoadExecutor-128-thread-1) [    x:collection1] o.a.s.h.l.XMLLoader xsltCacheLifetimeSeconds=60
   [junit4]   2> 134645 INFO  (coreLoadExecutor-128-thread-1) [    x:collection1] o.a.s.h.l.XMLLoader xsltCacheLifetimeSeconds=60
   [junit4]   2> 134647 INFO  (coreLoadExecutor-128-thread-1) [    x:collection1] o.a.s.h.l.XMLLoader xsltCacheLifetimeSeconds=60
   [junit4]   2> 134650 INFO  (coreLoadExecutor-128-thread-1) [    x:collection1] o.a.s.c.PluginBag requestHandler : 'lazy' created with startup=lazy 
   [junit4]   2> 134650 INFO  (coreLoadExecutor-128-thread-1) [    x:collection1] o.a.s.c.RequestHandlers Registered paths: /admin/mbeans,standard,lazy,/update/json/docs,/admin/luke,/export,/get,/admin/properties,/update/json,/admin/threads,/update/csv,/sql,/admin/segments,/admin/system,/replication,defaults,/config,/stream,/schema,/admin/plugins,/admin/logging,/admin/ping,/update,/admin/file
   [junit4]   2> 134650 INFO  (coreLoadExecutor-128-thread-1) [    x:collection1] o.a.s.c.SolrCore Using default statsCache cache: org.apache.solr.search.stats.LocalStatsCache
   [junit4]   2> 134650 INFO  (coreLoadExecutor-128-thread-1) [    x:collection1] o.a.s.u.CommitTracker Hard AutoCommit: disabled
   [junit4]   2> 134650 INFO  (coreLoadExecutor-128-thread-1) [    x:collection1] o.a.s.u.CommitTracker Soft AutoCommit: disabled
   [junit4]   2> 134662 INFO  (coreLoadExecutor-128-thread-1) [    x:collection1] o.a.s.u.RandomMergePolicy RandomMergePolicy wrapping class org.apache.lucene.index.TieredMergePolicy: [TieredMergePolicy: maxMergeAtOnce=26, maxMergeAtOnceExplicit=48, maxMergedSegmentMB=48.6943359375, floorSegmentMB=0.462890625, forceMergeDeletesPctAllowed=24.698680062694773, segmentsPerTier=36.0, maxCFSSegmentSizeMB=8.796093022207999E12, noCFSRatio=1.0
   [junit4]   2> 134707 INFO  (coreLoadExecutor-128-thread-1) [    x:collection1] o.a.s.c.SolrDeletionPolicy SolrDeletionPolicy.onInit: commits: num=1
   [junit4]   2> 	commit{dir=MockDirectoryWrapper(RAMDirectory@5462f974 lockFactory=org.apache.lucene.store.SingleInstanceLockFactory@481a4be6),segFN=segments_1,generation=1}
   [junit4]   2> 134707 INFO  (coreLoadExecutor-128-thread-1) [    x:collection1] o.a.s.c.SolrDeletionPolicy newest commit generation = 1
   [junit4]   2> 134707 INFO  (coreLoadExecutor-128-thread-1) [    x:collection1] o.a.s.s.SolrIndexSearcher Opening [Searcher@319aff9c[collection1] main]
   [junit4]   2> 134708 INFO  (coreLoadExecutor-128-thread-1) [    x:collection1] o.a.s.r.ManagedResourceStorage File-based storage initialized to use dir: /Users/jenkins/workspace/Lucene-Solr-6.x-MacOSX/solr/build/solr-core/test/J0/temp/solr.handler.TestReplicationHandler_1129F0CFA8D8E4AE-001/solr-instance-002/collection1/conf
   [junit4]   2> 134708 INFO  (coreLoadExecutor-128-thread-1) [    x:collection1] o.a.s.r.RestManager Initializing RestManager with initArgs: {storageDir=/Users/jenkins/workspace/Lucene-Solr-6.x-MacOSX/solr/build/solr-core/test/J0/temp/solr.handler.TestReplicationHandler_1129F0CFA8D8E4AE-001/solr-instance-002/collection1/conf}
   [junit4]   2> 134708 INFO  (coreLoadExecutor-128-thread-1) [    x:collection1] o.a.s.r.ManagedResourceStorage Reading _rest_managed.json using file:dir=/Users/jenkins/workspace/Lucene-Solr-6.x-MacOSX/solr/build/solr-core/test/J0/temp/solr.handler.TestReplicationHandler_1129F0CFA8D8E4AE-001/solr-instance-002/collection1/conf
   [junit4]   2> 134709 INFO  (coreLoadExecutor-128-thread-1) [    x:collection1] o.a.s.r.RestManager Initializing 0 registered ManagedResources
   [junit4]   2> 134748 INFO  (coreLoadExecutor-128-thread-1) [    x:collection1] o.a.s.h.ReplicationHandler Poll scheduled at an interval of 1000ms
   [junit4]   2> 134748 INFO  (searcherExecutor-129-thread-1-processing-x:collection1) [    x:collection1] o.a.s.c.SolrCore [collection1] Registered new searcher Searcher@319aff9c[collection1] main{ExitableDirectoryReader(UninvertingDirectoryReader())}
   [junit4]   2> 134750 INFO  (coreLoadExecutor-128-thread-1) [    x:collection1] o.a.s.c.CoreContainer registering core: collection1
   [junit4]   2> 134780 INFO  (qtp787699417-129) [    x:collection1] o.a.s.c.S.Request [collection1]  webapp=/solr path=/replication params={qt=/replication&wt=javabin&version=2&command=indexversion} status=0 QTime=1
   [junit4]   2> 135039 INFO  (TEST-TestReplicationHandler.doTestStressReplication-seed#[1129F0CFA8D8E4AE]) [    ] o.e.j.s.ServerConnector Stopped ServerConnector@3cf54000{HTTP/1.1,[http/1.1]}{127.0.0.1:0}
   [junit4]   2> 135039 INFO  (TEST-TestReplicationHandler.doTestStressReplication-seed#[1129F0CFA8D8E4AE]) [    ] o.a.s.c.CoreContainer Shutting down CoreContainer instance=335652435
   [junit4]   2> 135041 INFO  (coreCloseExecutor-134-thread-1) [    x:collection1] o.a.s.c.SolrCore [collection1]  CLOSING SolrCore org.apache.solr.core.SolrCore@51a9e11a
   [junit4]   2> 135041 INFO  (coreCloseExecutor-134-thread-1) [    x:collection1] o.a.s.u.DirectUpdateHandler2 closing DirectUpdateHandler2{commits=0,autocommits=0,soft autocommits=0,optimizes=0,rollbacks=0,expungeDeletes=0,docsPending=0,adds=0,deletesById=0,deletesByQuery=0,errors=0,cumulative_adds=0,cumulative_deletesById=0,cumulative_deletesByQuery=0,cumulative_errors=0}
   [junit4]   2> 135042 INFO  (coreCloseExecutor-134-thread-1) [    x:collection1] o.a.s.u.SolrCoreState Closing SolrCoreState
   [junit4]   2> 135042 INFO  (coreCloseExecutor-134-thread-1) [    x:collection1] o.a.s.u.DefaultSolrCoreState SolrCoreState ref count has reached 0 - closing IndexWriter
   [junit4]   2> 135042 INFO  (coreCloseExecutor-134-thread-1) [    x:collection1] o.a.s.u.DefaultSolrCoreState closing IndexWriter with IndexWriterCloser
   [junit4]   2> 135047 INFO  (coreCloseExecutor-134-thread-1) [    x:collection1] o.a.s.c.SolrCore [collection1] Closing main searcher on request.
   [junit4]   2> 135047 INFO  (coreCloseExecutor-134-thread-1) [    x:collection1] o.a.s.c.CachingDirectoryFactory Closing MockDirectoryFactory - 2 directories currently being tracked
   [junit4]   2> 135047 INFO  (coreCloseExecutor-134-thread-1) [    x:collection1] o.a.s.c.CachingDirectoryFactory looking to close /Users/jenkins/workspace/Lucene-Solr-6.x-MacOSX/solr/build/solr-core/test/J0/temp/solr.handler.TestReplicationHandler_1129F0CFA8D8E4AE-001/solr-instance-002/./collection1/data/index [CachedDir<<refCount=0;path=/Users/jenkins/workspace/Lucene-Solr-6.x-MacOSX/solr/build/solr-core/test/J0/temp/solr.handler.TestReplicationHandler_1129F0CFA8D8E4AE-001/solr-instance-002/./collection1/data/index;done=false>>]
   [junit4]   2> 135047 INFO  (coreCloseExecutor-134-thread-1) [    x:collection1] o.a.s.c.CachingDirectoryFactory Closing directory, CoreContainer#isShutdown=true
   [junit4]   2> 135047 INFO  (coreCloseExecutor-134-thread-1) [    x:collection1] o.a.s.c.CachingDirectoryFactory Closing directory: /Users/jenkins/workspace/Lucene-Solr-6.x-MacOSX/solr/build/solr-core/test/J0/temp/solr.handler.TestReplicationHandler_1129F0CFA8D8E4AE-001/solr-instance-002/./collection1/data/index
   [junit4]   2> 135047 INFO  (coreCloseExecutor-134-thread-1) [    x:collection1] o.a.s.c.CachingDirectoryFactory looking to close /Users/jenkins/workspace/Lucene-Solr-6.x-MacOSX/solr/build/solr-core/test/J0/temp/solr.handler.TestReplicationHandler_1129F0CFA8D8E4AE-001/solr-instance-002/./collection1/data [CachedDir<<refCount=0;path=/Users/jenkins/workspace/Lucene-Solr-6.x-MacOSX/solr/build/solr-core/test/J0/temp/solr.handler.TestReplicationHandler_1129F0CFA8D8E4AE-001/solr-instance-002/./collection1/data;done=false>>]
   [junit4]   2> 135047 INFO  (coreCloseExecutor-134-thread-1) [    x:collection1] o.a.s.c.CachingDirectoryFactory Closing directory, CoreContainer#isShutdown=true
   [junit4]   2> 135047 INFO  (coreCloseExecutor-134-thread-1) [    x:collection1] o.a.s.c.CachingDirectoryFactory Closing directory: /Users/jenkins/workspace/Lucene-Solr-6.x-MacOSX/solr/build/solr-core/test/J0/temp/solr.handler.TestReplicationHandler_1129F0CFA8D8E4AE-001/solr-instance-002/./collection1/data
   [junit4]   2> 135061 INFO  (TEST-TestReplicationHandler.doTestStressReplication-seed#[1129F0CFA8D8E4AE]) [    ] o.e.j.s.h.ContextHandler Stopped o.e.j.s.ServletContextHandler@9012568{/solr,null,UNAVAILABLE}
   [junit4]   2> 135068 INFO  (TEST-TestReplicationHandler.doTestStressReplication-seed#[1129F0CFA8D8E4AE]) [    ] o.e.j.s.Server jetty-9.3.8.v20160314
   [junit4]   2> 135073 INFO  (TEST-TestReplicationHandler.doTestStressReplication-seed#[1129F0CFA8D8E4AE]) [    ] o.e.j.s.h.ContextHandler Started o.e.j.s.ServletContextHandler@43ef5e78{/solr,null,AVAILABLE}
   [junit4]   2> 135077 INFO  (TEST-TestReplicationHandler.doTestStressReplication-seed#[1129F0CFA8D8E4AE]) [    ] o.e.j.s.ServerConnector Started ServerConnector@19b80fcf{HTTP/1.1,[http/1.1]}{127.0.0.1:50432}
   [junit4]   2> 135077 INFO  (TEST-TestReplicationHandler.doTestStressReplication-seed#[1129F0CFA8D8E4AE]) [    ] o.e.j.s.Server Started @143214ms
   [junit4]   2> 135078 INFO  (TEST-TestReplicationHandler.doTestStressReplication-seed#[1129F0CFA8D8E4AE]) [    ] o.a.s.c.s.e.JettySolrRunner Jetty properties: {solr.data.dir=/Users/jenkins/workspace/Lucene-Solr-6.x-MacOSX/solr/build/solr-core/test/J0/temp/solr.handler.TestReplicationHandler_1129F0CFA8D8E4AE-001/solr-instance-002/collection1/data, hostContext=/solr, hostPort=50432}
   [junit4]   2> 135078 INFO  (TEST-TestReplicationHandler.doTestStressReplication-seed#[1129F0CFA8D8E4AE]) [    ] o.a.s.s.SolrDispatchFilter SolrDispatchFilter.init(): sun.misc.Launcher$AppClassLoader@4554617c
   [junit4]   2> 135078 INFO  (TEST-TestReplicationHandler.doTestStressReplication-seed#[1129F0CFA8D8E4AE]) [    ] o.a.s.c.SolrResourceLoader new SolrResourceLoader for directory: '/Users/jenkins/workspace/Lucene-Solr-6.x-MacOSX/solr/build/solr-core/test/J0/temp/solr.handler.TestReplicationHandler_1129F0CFA8D8E4AE-001/solr-instance-002'
   [junit4]   2> 135078 INFO  (TEST-TestReplicationHandler.doTestStressReplication-seed#[1129F0CFA8D8E4AE]) [    ] o.a.s.c.SolrResourceLoader JNDI not configured for solr (NoInitialContextEx)
   [junit4]   2> 135078 INFO  (TEST-TestReplicationHandler.doTestStressReplication-seed#[1129F0CFA8D8E4AE]) [    ] o.a.s.c.SolrResourceLoader solr home defaulted to 'solr/' (could not find system property or JNDI)
   [junit4]   2> 135078 INFO  (TEST-TestReplicationHandler.doTestStressReplication-seed#[1129F0CFA8D8E4AE]) [    ] o.a.s.c.SolrXmlConfig Loading container configuration from /Users/jenkins/workspace/Lucene-Solr-6.x-MacOSX/solr/build/solr-core/test/J0/temp/solr.handler.TestReplicationHandler_1129F0CFA8D8E4AE-001/solr-instance-002/solr.xml
   [junit4]   2> 135098 INFO  (TEST-TestReplicationHandler.doTestStressReplication-seed#[1129F0CFA8D8E4AE]) [    ] o.a.s.c.CorePropertiesLocator Config-defined core root directory: /Users/jenkins/workspace/Lucene-Solr-6.x-MacOSX/solr/build/solr-core/test/J0/temp/solr.handler.TestReplicationHandler_1129F0CFA8D8E4AE-001/solr-instance-002/.
   [junit4]   2> 135098 INFO  (TEST-TestReplicationHandler.doTestStressReplication-seed#[1129F0CFA8D8E4AE]) [    ] o.a.s.c.CoreContainer New CoreContainer 616441465
   [junit4]   2> 135099 INFO  (TEST-TestReplicationHandler.doTestStressReplication-seed#[1129F0CFA8D8E4AE]) [    ] o.a.s.c.CoreContainer Loading cores into CoreContainer [instanceDir=/Users/jenkins/workspace/Lucene-Solr-6.x-MacOSX/solr/build/solr-core/test/J0/temp/solr.handler.TestReplicationHandler_1129F0CFA8D8E4AE-001/solr-instance-002]
   [junit4]   2> 135099 WARN  (TEST-TestReplicationHandler.doTestStressReplication-seed#[1129F0CFA8D8E4AE]) [    ] o.a.s.c.CoreContainer Couldn't add files from /Users/jenkins/workspace/Lucene-Solr-6.x-MacOSX/solr/build/solr-core/test/J0/temp/solr.handler.TestReplicationHandler_1129F0CFA8D8E4AE-001/solr-instance-002/lib to classpath: /Users/jenkins/workspace/Lucene-Solr-6.x-MacOSX/solr/build/solr-core/test/J0/temp/solr.handler.TestReplicationHandler_1129F0CFA8D8E4AE-001/solr-instance-002/lib
   [junit4]   2> 135100 INFO  (TEST-TestReplicationHandler.doTestStressReplication-seed#[1129F0CFA8D8E4AE]) [    ] o.a.s.h.c.HttpShardHandlerFactory created with socketTimeout : 90000,urlScheme : ,connTimeout : 15000,maxConnectionsPerHost : 20,maxConnections : 10000,corePoolSize : 0,maximumPoolSize : 2147483647,maxThreadIdleTime : 5,sizeOfQueue : -1,fairnessPolicy : false,useRetries : false,
   [junit4]   2> 135103 INFO  (TEST-TestReplicationHandler.doTestStressReplication-seed#[1129F0CFA8D8E4AE]) [    ] o.a.s.u.UpdateShardHandler Creating UpdateShardHandler HTTP client with params: socketTimeout=340000&connTimeout=45000&retry=true
   [junit4]   2> 135104 INFO  (TEST-TestReplicationHandler.doTestStressReplication-seed#[1129F0CFA8D8E4AE]) [    ] o.a.s.l.LogWatcher SLF4J impl is org.slf4j.impl.Log4jLoggerFactory
   [junit4]   2> 135104 INFO  (TEST-TestReplicationHandler.doTestStressReplication-seed#[1129F0CFA8D8E4AE]) [    ] o.a.s.l.LogWatcher Registering Log Listener [Log4j (org.slf4j.impl.Log4jLoggerFactory)]
   [junit4]   2> 135104 INFO  (TEST-TestReplicationHandler.doTestStressReplication-seed#[1129F0CFA8D8E4AE]) [    ] o.a.s.c.CoreContainer Security conf doesn't exist. Skipping setup for authorization module.
   [junit4]   2> 135104 INFO  (TEST-TestReplicationHandler.doTestStressReplication-seed#[1129F0CFA8D8E4AE]) [    ] o.a.s.c.CoreContainer No authentication plugin used.
   [junit4]   2> 135106 INFO  (TEST-TestReplicationHandler.doTestStressReplication-seed#[1129F0CFA8D8E4AE]) [    ] o.a.s.c.CorePropertiesLocator Looking for core definitions underneath /Users/jenkins/workspace/Lucene-Solr-6.x-MacOSX/solr/build/solr-core/test/J0/temp/solr.handler.TestReplicationHandler_1129F0CFA8D8E4AE-001/solr-instance-002/.
   [junit4]   2> 135108 INFO  (TEST-TestReplicationHandler.doTestStressReplication-seed#[1129F0CFA8D8E4AE]) [    ] o.a.s.c.CoreDescriptor Created CoreDescriptor: {name=collection1, config=solrconfig.xml, loadOnStartup=true, schema=schema.xml, configSetProperties=configsetprops.json, transient=false, dataDir=data/}
   [junit4]   2> 135108 INFO  (TEST-TestReplicationHandler.doTestStressReplication-seed#[1129F0CFA8D8E4AE]) [    ] o.a.s.c.CorePropertiesLocator Found core collection1 in /Users/jenkins/workspace/Lucene-Solr-6.x-MacOSX/solr/build/solr-core/test/J0/temp/solr.handler.TestReplicationHandler_1129F0CFA8D8E4AE-001/solr-instance-002/./collection1
   [junit4]   2> 135108 INFO  (TEST-TestReplicationHandler.doTestStressReplication-seed#[1129F0CFA8D8E4AE]) [    ] o.a.s.c.CorePropertiesLocator Found 1 core definitions
   [junit4]   2> 135110 INFO  (coreLoadExecutor-141-thread-1) [    ] o.a.s.c.SolrResourceLoader new SolrResourceLoader for directory: '/Users/jenkins/workspace/Lucene-Solr-6.x-MacOSX/solr/build/solr-core/test/J0/temp/solr.handler.TestReplicationHandler_1129F0CFA8D8E4AE-001/solr-instance-002/collection1'
   [junit4]   2> 135110 INFO  (TEST-TestReplicationHandler.doTestStressReplication-seed#[1129F0CFA8D8E4AE]) [    ] o.a.s.s.SolrDispatchFilter user.dir=/Users/jenkins/workspace/Lucene-Solr-6.x-MacOSX/solr/build/solr-core/test/J0
   [junit4]   2> 135111 INFO  (TEST-TestReplicationHandler.doTestStressReplication-seed#[1129F0CFA8D8E4AE]) [    ] o.a.s.s.SolrDispatchFilter SolrDispatchFilter.init() done
   [junit4]   2> 135111 INFO  (coreLoadExecutor-141-thread-1) [    ] o.a.s.c.SolrResourceLoader JNDI not configured for solr (NoInitialContextEx)
   [junit4]   2> 135111 INFO  (coreLoadExecutor-141-thread-1) [    ] o.a.s.c.SolrResourceLoader solr home defaulted to 'solr/' (could not find system property or JNDI)
   [junit4]   2> 135129 INFO  (coreLoadExecutor-141-thread-1) [    ] o.a.s.c.SolrConfig current version of requestparams : -1
   [junit4]   2> 135132 WARN  (coreLoadExecutor-141-thread-1) [    ] o.a.s.c.Config Beginning with Solr 5.5, <mergePolicy> is deprecated, use <mergePolicyFactory> instead.
   [junit4]   2> 135132 INFO  (coreLoadExecutor-141-thread-1) [    ] o.a.s.c.SolrConfig Using Lucene MatchVersion: 6.1.0
   [junit4]   2> 135140 INFO  (coreLoadExecutor-141-thread-1) [    ] o.a.s.c.SolrConfig Loaded SolrConfig: solrconfig.xml
   [junit4]   2> 135145 INFO  (coreLoadExecutor-141-thread-1) [    ] o.a.s.s.IndexSchema [collection1] Schema name=test
   [junit4]   2> 135152 INFO  (coreLoadExecutor-141-thread-1) [    ] o.a.s.s.IndexSchema unique key field: id
   [junit4]   2> 135153 INFO  (coreLoadExecutor-141-thread-1) [    ] o.a.s.c.ConfigSetProperties Did not find ConfigSet properties, assuming default properties: Can't find resource 'configsetprops.json' in classpath or '/Users/jenkins/workspace/Lucene-Solr-6.x-MacOSX/solr/build/solr-core/test/J0/temp/solr.handler.TestReplicationHandler_1129F0CFA8D8E4AE-001/solr-instance-002/collection1'
   [junit4]   2> 135153 INFO  (coreLoadExecutor-141-thread-1) [    ] o.a.s.c.CoreContainer Creating SolrCore 'collection1' using configuration from instancedir /Users/jenkins/workspace/Lucene-Solr-6.x-MacOSX/solr/build/solr-core/test/J0/temp/solr.handler.TestReplicationHandler_1129F0CFA8D8E4AE-001/solr-instance-002/./collection1
   [junit4]   2> 135153 INFO  (coreLoadExecutor-141-thread-1) [    x:collection1] o.a.s.c.SolrCore solr.NRTCachingDirectoryFactory
   [junit4]   2> 135180 INFO  (coreLoadExecutor-141-thread-1) [    x:collection1] o.a.s.c.SolrCore [[collection1] ] Opening new SolrCore at [/Users/jenkins/workspace/Lucene-Solr-6.x-MacOSX/solr/build/solr-core/test/J0/temp/solr.handler.TestReplicationHandler_1129F0CFA8D8E4AE-001/solr-instance-002/collection1], dataDir=[/Users/jenkins/workspace/Lucene-Solr-6.x-MacOSX/solr/build/solr-core/test/J0/temp/solr.handler.TestReplicationHandler_1129F0CFA8D8E4AE-001/solr-instance-002/./collection1/data/]
   [junit4]   2> 135180 INFO  (coreLoadExecutor-141-thread-1) [    x:collection1] o.a.s.c.SolrCore JMX monitoring not detected for core: collection1
   [junit4]   2> 135183 INFO  (coreLoadExecutor-141-thread-1) [    x:collection1] o.a.s.c.CachingDirectoryFactory return new directory for /Users/jenkins/workspace/Lucene-Solr-6.x-MacOSX/solr/build/solr-core/test/J0/temp/solr.handler.TestReplicationHandler_1129F0CFA8D8E4AE-001/solr-instance-002/collection1/data
   [junit4]   2> 135183 INFO  (coreLoadExecutor-141-thread-1) [    x:collection1] o.a.s.c.SolrCore New index directory detected: old=null new=/Users/jenkins/workspace/Lucene-Solr-6.x-MacOSX/solr/build/solr-core/test/J0/temp/solr.handler.TestReplicationHandler_1129F0CFA8D8E4AE-001/solr-instance-002/./collection1/data/index/
   [junit4]   2> 135184 WARN  (coreLoadExecutor-141-thread-1) [    x:collection1] o.a.s.c.SolrCore [collection1] Solr index directory '/Users/jenkins/workspace/Lucene-Solr-6.x-MacOSX/solr/build/solr-core/test/J0/temp/solr.handler.TestReplicationHandler_1129F0CFA8D8E4AE-001/solr-instance-002/./collection1/data/index' doesn't exist. Creating new index...
   [junit4]   2> 135185 INFO  (coreLoadExecutor-141-thread-1) [    x:collection1] o.a.s.c.CachingDirectoryFactory return new directory for /Users/jenkins/workspace/Lucene-Solr-6.x-MacOSX/solr/build/solr-core/test/J0/temp/solr.handler.TestReplicationHandler_1129F0CFA8D8E4AE-001/solr-instance-002/collection1/data/index
   [junit4]   2> 135185 INFO  (coreLoadExecutor-141-thread-1) [    x:collection1] o.a.s.u.RandomMergePolicy RandomMergePolicy wrapping class org.apache.lucene.index.LogByteSizeMergePolicy: [LogByteSizeMergePolicy: minMergeSize=1677721, mergeFactor=37, maxMergeSize=2147483648, maxMergeSizeForForcedMerge=9223372036854775807, calibrateSizeByDeletes=false, maxMergeDocs=2147483647, maxCFSSegmentSizeMB=8.796093022207999E12, noCFSRatio=0.2408972304015916]
   [junit4]   2> 135207 INFO  (coreLoadExecutor-141-thread-1) [    x:collection1] o.a.s.c.SolrDeletionPolicy SolrDeletionPolicy.onCommit: commits: num=1
   [junit4]   2> 	commit{dir=NRTCachingDirectory(MMapDirectory@/Users/jenkins/workspace/Lucene-Solr-6.x-MacOSX/solr/build/solr-core/test/J0/temp/solr.handler.TestReplicationHandler_1129F0CFA8D8E4AE-001/solr-instance-002/collection1/data/index lockFactory=org.apache.lucene.store.SingleInstanceLockFactory@5ed4a4aa; maxCacheMB=48.0 maxMergeSizeMB=4.0),segFN=segments_1,generation=1}
   [junit4]   2> 135208 INFO  (coreLoadExecutor-141-thread-1) [    x:collection1] o.a.s.c.SolrDeletionPolicy newest commit generation = 1
   [junit4]   2> 135209 INFO  (OldIndexDirectoryCleanupThreadForCore-collection1) [    x:collection1] o.a.s.c.SolrCore Looking for old index directories to cleanup for core collection1 in /Users/jenkins/workspace/Lucene-Solr-6.x-MacOSX/solr/build/solr-core/test/J0/temp/solr.handler.TestReplicationHandler_1129F0CFA8D8E4AE-001/solr-instance-002/./collection1/data/
   [junit4]   2> 135211 INFO  (coreLoadExecutor-141-thread-1) [    x:collection1] o.a.s.c.SolrCore no updateRequestProcessorChain defined as default, creating implicit default
   [junit4]   2> 135219 INFO  (coreLoadExecutor-141-thread-1) [    x:collection1] o.a.s.h.l.XMLLoader xsltCacheLifetimeSeconds=60
   [junit4]   2> 135221 INFO  (coreLoadExecutor-141-thread-1) [    x:collection1] o.a.s.h.l.XMLLoader xsltCacheLifetimeSeconds=60
   [junit4]   2> 135222 INFO  (coreLoadExecutor-141-thread-1) [    x:collection1] o.a.s.h.l.XMLLoader xsltCacheLifetimeSeconds=60
   [junit4]   2> 135224 INFO  (coreLoadExecutor-141-thread-1) [    x:collection1] o.a.s.h.l.XMLLoader xsltCacheLifetimeSeconds=60
   [junit4]   2> 135227 INFO  (coreLoadExecutor-141-thread-1) [    x:collection1] o.a.s.c.PluginBag requestHandler : 'lazy' created with startup=lazy 
   [junit4]   2> 135227 INFO  (coreLoadExecutor-141-thread-1) [    x:collection1] o.a.s.c.RequestHandlers Registered paths: /admin/mbeans,standard,lazy,/update/json/docs,/admin/luke,/export,/get,/admin/properties,/update/json,/admin/threads,/update/csv,/sql,/admin/segments,/admin/system,/replication,defaults,/config,/stream,/schema,/admin/plugins,/admin/logging,/admin/ping,/update,/admin/file
   [junit4]   2> 135227 INFO  (coreLoadExecutor-141-thread-1) [    x:collection1] o.a.s.c.SolrCore Using default statsCache cache: org.apache.solr.search.stats.LocalStatsCache
   [junit4]   2> 135227 INFO  (coreLoadExecutor-141-thread-1) [    x:collection1] o.a.s.u.CommitTracker Hard AutoCommit: disabled
   [junit4]   2> 135227 INFO  (coreLoadExecutor-141-thread-1) [    x:collection1] o.a.s.u.CommitTracker Soft AutoCommit: disabled
   [junit4]   2> 135228 INFO  (coreLoadExecutor-141-thread-1) [    x:collection1] o.a.s.u.RandomMergePolicy RandomMergePolicy wrapping class org.apache.lucene.index.LogByteSizeMergePolicy: [LogByteSizeMergePolicy: minMergeSize=1677721, mergeFactor=22, maxMergeSize=2147483648, maxMergeSizeForForcedMerge=9223372036854775807, calibrateSizeByDeletes=true, maxMergeDocs=2147483647, maxCFSSegmentSizeMB=8.796093022207999E12, noCFSRatio=0.0]
   [junit4]   2> 135229 INFO  (coreLoadExecutor-141-thread-1) [    x:collection1] o.a.s.c.SolrDeletionPolicy SolrDeletionPolicy.onInit: commits: num=1
   [junit4]   2> 	commit{dir=NRTCachingDirectory(MMapDirectory@/Users/jenkins/workspace/Lucene-Solr-6.x-MacOSX/solr/build/solr-core/test/J0/temp/solr.handler.TestReplicationHandler_1129F0CFA8D8E4AE-001/solr-instance-002/collection1/data/index lockFactory=org.apache.lucene.store.SingleInstanceLockFactory@5ed4a4aa; maxCacheMB=48.0 maxMergeSizeMB=4.0),segFN=segments_1,generation=1}
   [junit4]   2> 135229 INFO  (coreLoadExecutor-141-thread-1) [    x:collection1] o.a.s.c.SolrDeletionPolicy newest commit generation = 1
   [junit4]   2> 135229 INFO  (coreLoadExecutor-141-thread-1) [    x:collection1] o.a.s.s.SolrIndexSearcher Opening [Searcher@597e51f3[collection1] main]
   [junit4]   2> 135230 INFO  (coreLoadExecutor-141-thread-1) [    x:collection1] o.a.s.r.ManagedResourceStorage File-based storage initialized to use dir: /Users/jenkins/workspace/Lucene-Solr-6.x-MacOSX/solr/build/solr-core/test/J0/temp/solr.handler.TestReplicationHandler_1129F0CFA8D8E4AE-001/solr-instance-002/collection1/conf
   [junit4]   2> 135230 INFO  (coreLoadExecutor-141-thread-1) [    x:collection1] o.a.s.r.RestManager Initializing RestManager with initArgs: {storageDir=/Users/jenkins/workspace/Lucene-Solr-6.x-MacOSX/solr/build/solr-core/test/J0/temp/solr.handler.TestReplicationHandler_1129F0CFA8D8E4AE-001/solr-instance-002/collection1/conf}
   [junit4]   2> 135230 INFO  (coreLoadExecutor-141-thread-1) [    x:collection1] o.a.s.r.ManagedResourceStorage Reading _rest_managed.json using file:dir=/Users/jenkins/workspace/Lucene-Solr-6.x-MacOSX/solr/build/solr-core/test/J0/temp/solr.handler.TestReplicationHandler_1129F0CFA8D8E4AE-001/solr-instance-002/collection1/conf
   [junit4]   2> 135231 INFO  (coreLoadExecutor-141-thread-1) [    x:collection1] o.a.s.r.RestManager Initializing 0 registered ManagedResources
   [junit4]   2> 135231 INFO  (coreLoadExecutor-141-thread-1) [    x:collection1] o.a.s.h.ReplicationHandler Commits will be reserved for  10000
   [junit4]   2> 135231 INFO  (searcherExecutor-142-thread-1-processing-x:collection1) [    x:collection1] o.a.s.c.SolrCore [collection1] Registered new searcher Searcher@597e51f3[collection1] main{ExitableDirectoryReader(UninvertingDirectoryReader())}
   [junit4]   2> 135231 INFO  (coreLoadExecutor-141-thread-1) [    x:collection1] o.a.s.c.CoreContainer registering core: collection1
   [junit4]   2> 135617 INFO  (TEST-TestReplicationHandler.doTestStressReplication-seed#[1129F0CFA8D8E4AE]) [    ] o.e.j.s.ServerConnector Stopped ServerConnector@3e4be29{HTTP/1.1,[http/1.1]}{127.0.0.1:0}
   [junit4]   2> 135617 INFO  (TEST-TestReplicationHandler.doTestStressReplication-seed#[1129F0CFA8D8E4AE]) [    ] o.a.s.c.CoreContainer Shutting down CoreContainer instance=834993428
   [junit4]   2> 135618 INFO  (coreCloseExecutor-146-thread-1) [    x:collection1] o.a.s.c.SolrCore [collection1]  CLOSING SolrCore org.apache.solr.core.SolrCore@705e8678
   [junit4]   2> 135619 INFO  (coreCloseExecutor-146-thread-1) [    x:collection1] o.a.s.u.DirectUpdateHandler2 closing DirectUpdateHandler2{commits=0,autocommits=0,soft autocommits=0,optimizes=0,rollbacks=0,expungeDeletes=0,docsPending=0,adds=0,deletesById=0,deletesByQuery=0,errors=0,cumulative_adds=0,cumulative_deletesById=0,cumulative_deletesByQuery=0,cumulative_errors=0}
   [junit4]   2> 135619 INFO  (coreCloseExecutor-146-thread-1) [    x:collection1] o.a.s.u.SolrCoreState Closing SolrCoreState
   [junit4]   2> 135619 INFO  (coreCloseExecutor-146-thread-1) [    x:collection1] o.a.s.u.DefaultSolrCoreState SolrCoreState ref count has reached 0 - closing IndexWriter
   [junit4]   2> 135619 INFO  (coreCloseExecutor-146-thread-1) [    x:collection1] o.a.s.u.DefaultSolrCoreState closing IndexWriter with IndexWriterCloser
   [junit4]   2> 135621 INFO  (coreCloseExecutor-146-thread-1) [    x:collection1] o.a.s.c.SolrCore [collection1] Closing main searcher on request.
   [junit4]   2> 135622 INFO  (coreCloseExecutor-146-thread-1) [    x:collection1] o.a.s.c.CachingDirectoryFactory Closing MockDirectoryFactory - 2 directories currently being tracked
   [junit4]   2> 135622 INFO  (coreCloseExecutor-146-thread-1) [    x:collection1] o.a.s.c.CachingDirectoryFactory looking to close /Users/jenkins/workspace/Lucene-Solr-6.x-MacOSX/solr/build/solr-core/test/J0/temp/solr.handler.TestReplicationHandler_1129F0CFA8D8E4AE-001/solr-instance-001/./collection1/data [CachedDir<<refCount=0;path=/Users/jenkins/workspace/Lucene-Solr-6.x-MacOSX/solr/build/solr-core/test/J0/temp/solr.handler.TestReplicationHandler_1129F0CFA8D8E4AE-001/solr-instance-001/./collection1/data;done=false>>]
   [junit4]   2> 135622 INFO  (coreCloseExecutor-146-thread-1) [    x:collection1] o.a.s.c.CachingDirectoryFactory Closing directory, CoreContainer#isShutdown=true
   [junit4]   2> 135622 INFO  (coreCloseExecutor-146-thread-1) [    x:collection1] o.a.s.c.CachingDirectoryFactory Closing directory: /Users/jenkins/workspace/Lucene-Solr-6.x-MacOSX/solr/build/solr-core/test/J0/temp/solr.handler.TestReplicationHandler_1129F0CFA8D8E4AE-001/solr-instance-001/./collection1/data
   [junit4]   2> 135622 INFO  (coreCloseExecutor-146-thread-1) [    x:collection1] o.a.s.c.CachingDirectoryFactory looking to close /Users/jenkins/workspace/Lucene-Solr-6.x-MacOSX/solr/build/solr-core/test/J0/temp/solr.handler.TestReplicationHandler_1129F0CFA8D8E4AE-001/solr-instance-001/./collection1/data/index [CachedDir<<refCount=0;path=/Users/jenkins/workspace/Lucene-Solr-6.x-MacOSX/solr/build/solr-core/test/J0/temp/solr.handler.TestReplicationHandler_1129F0CFA8D8E4AE-001/solr-instance-001/./collection1/data/index;done=false>>]
   [junit4]   2> 135622 INFO  (coreCloseExecutor-146-thread-1) [    x:collection1] o.a.s.c.CachingDirectoryFactory Closing directory, CoreContainer#isShutdown=true
   [junit4]   2> 135622 INFO  (coreCloseExecutor-146-thread-1) [    x:collection1] o.a.s.c.CachingDirectoryFactory Closing directory: /Users/jenkins/workspace/Lucene-Solr-6.x-MacOSX/solr/build/solr-core/test/J0/temp/solr.handler.TestReplicationHandler_1129F0CFA8D8E4AE-001/solr-instance-001/./collection1/data/index
   [junit4]   2> 135623 INFO  (TEST-TestReplicationHandler.doTestStressReplication-seed#[1129F0CFA8D8E4AE]) [    ] o.e.j.s.h.ContextHandler Stopped o.e.j.s.ServletContextHandler@282962a5{/solr,null,UNAVAILABLE}
   [junit4]   2> 135627 INFO  (TEST-TestReplicationHandler.doTestStressReplication-seed#[1129F0CFA8D8E4AE]) [    ] o.e.j.s.Server jetty-9.3.8.v20160314
   [junit4]   2> 135631 INFO  (TEST-TestReplicationHandler.doTestStressReplication-seed#[1129F0CFA8D8E4AE]) [    ] o.e.j.s.h.ContextHandler Started o.e.j.s.ServletContextHandler@790a7f37{/solr,null,AVAILABLE}
   [junit4]   2> 135632 INFO  (TEST-TestReplicationHandler.doTestStressReplication-seed#[1129F0CFA8D8E4AE]) [    ] o.e.j.s.ServerConnector Started ServerConnector@6aa9c24f{HTTP/1.1,[http/1.1]}{127.0.0.1:50433}
   [junit4]   2> 135632 INFO  (TEST-TestReplicationHandler.doTestStressReplication-seed#[1129F0CFA8D8E4AE]) [    ] o.e.j.s.Server Started @143769ms
   [junit4]   2> 135632 INFO  (TEST-TestReplicationHandler.doTestStressReplication-seed#[1129F0CFA8D8E4AE]) [    ] o.a.s.c.s.e.JettySolrRunner Jetty properties: {solr.data.dir=/Users/jenkins/workspace/Lucene-Solr-6.x-MacOSX/solr/build/solr-core/test/J0/temp/solr.handler.TestReplicationHandler_1129F0CFA8D8E4AE-001/solr-instance-001/collection1/data, hostContext=/solr, hostPort=50433}
   [junit4]   2> 135632 INFO  (TEST-TestReplicationHandler.doTestStressReplication-seed#[1129F0CFA8D8E4AE]) [    ] o.a.s.s.SolrDispatchFilter SolrDispatchFilter.init(): sun.misc.Launcher$AppClassLoader@4554617c
   [junit4]   2> 135632 INFO  (TEST-TestReplicationHandler.doTestStressReplication-seed#[1129F0CFA8D8E4AE]) [    ] o.a.s.c.SolrResourceLoader new SolrResourceLoader for directory: '/Users/jenkins/workspace/Lucene-Solr-6.x-MacOSX/solr/build/solr-core/test/J0/temp/solr.handler.TestReplicationHandler_1129F0CFA8D8E4AE-001/solr-instance-001'
   [junit4]   2> 135633 INFO  (TEST-TestReplicationHandler.doTestStressReplication-seed#[1129F0CFA8D8E4AE]) [    ] o.a.s.c.SolrResourceLoader JNDI not configured for solr (NoInitialContextEx)
   [junit4]   2> 135633 INFO  (TEST-TestReplicationHandler.doTestStressReplication-seed#[1129F0CFA8D8E4AE]) [    ] o.a.s.c.SolrResourceLoader solr home defaulted to 'solr/' (could not find system property or JNDI)
   [junit4]   2> 135633 INFO  (TEST-TestReplicationHandler.doTestStressReplication-seed#[1129F0CFA8D8E4AE]) [    ] o.a.s.c.SolrXmlConfig Loading container configuration from /Users/jenkins/workspace/Lucene-Solr-6.x-MacOSX/solr/build/solr-core/test/J0/temp/solr.handler.TestReplicationHandler_1129F0CFA8D8E4AE-001/solr-instance-001/solr.xml
   [junit4]   2> 135670 INFO  (TEST-TestReplicationHandler.doTestStressReplication-seed#[1129F0CFA8D8E4AE]) [    ] o.a.s.c.CorePropertiesLocator Config-defined core root directory: /Users/jenkins/workspace/Lucene-Solr-6.x-MacOSX/solr/build/solr-core/test/J0/temp/solr.handler.TestReplicationHandler_1129F0CFA8D8E4AE-001/solr-instance-001/.
   [junit4]   2> 135670 INFO  (TEST-TestReplicationHandler.doTestStressReplication-seed#[1129F0CFA8D8E4AE]) [    ] o.a.s.c.CoreContainer New CoreContainer 563459766
   [junit4]   2> 135670 INFO  (TEST-TestReplicationHandler.doTestStressReplication-seed#[1129F0CFA8D8E4AE]) [    ] o.a.s.c.CoreContainer Loading cores into CoreContainer [instanceDir=/Users/jenkins/workspace/Lucene-Solr-6.x-MacOSX/solr/build/solr-core/test/J0/temp/solr.handler.TestReplicationHandler_1129F0CFA8D8E4AE-001/solr-instance-001]
   [junit4]   2> 135670 WARN  (TEST-TestReplicationHandler.doTestStressReplication-seed#[1129F0CFA8D8E4AE]) [    ] o.a.s.c.CoreContainer Couldn't add files from /Users/jenkins/workspace/Lucene-Solr-6.x-MacOSX/solr/build/solr-core/test/J0/temp/solr.handler.TestReplicationHandler_1129F0CFA8D8E4AE-001/solr-instance-001/lib to classpath: /Users/jenkins/workspace/Lucene-Solr-6.x-MacOSX/solr/build/solr-core/test/J0/temp/solr.handler.TestReplicationHandler_1129F0CFA8D8E4AE-001/solr-instance-001/lib
   [junit4]   2> 135671 INFO  (TEST-TestReplicationHandler.doTestStressReplication-seed#[1129F0CFA8D8E4AE]) [    ] o.a.s.h.c.HttpShardHandlerFactory created with socketTimeout : 90000,urlScheme : ,connTimeout : 15000,maxConnectionsPerHost : 20,maxConnections : 10000,corePoolSize : 0,maximumPoolSize : 2147483647,maxThreadIdleTime : 5,sizeOfQueue : -1,fairnessPolicy : false,useRetries : false,
   [junit4]   2> 135673 INFO  (TEST-TestReplicationHandler.doTestStressReplication-seed#[1129F0CFA8D8E4AE]) [    ] o.a.s.u.UpdateShardHandler Creating UpdateShardHandler HTTP client with params: socketTimeout=340000&connTimeout=45000&retry=true
   [junit4]   2> 135673 INFO  (TEST-TestReplicationHandler.doTestStressReplication-seed#[1129F0CFA8D8E4AE]) [    ] o.a.s.l.LogWatcher SLF4J impl is org.slf4j.impl.Log4jLoggerFactory
   [junit4]   2> 135673 INFO  (TEST-TestReplicationHandler.doTestStressReplication-seed#[1129F0CFA8D8E4AE]) [    ] o.a.s.l.LogWatcher Registering Log Listener [Log4j (org.slf4j.impl.Log4jLoggerFactory)]
   [junit4]   2> 135674 INFO  (TEST-TestReplicationHandler.doTestStressReplication-seed#[1129F0CFA8D8E4AE]) [    ] o.a.s.c.CoreContainer Security conf doesn't exist. Skipping setup for authorization module.
   [junit4]   2> 135674 INFO  (TEST-TestReplicationHandler.doTestStressReplication-seed#[1129F0CFA8D8E4AE]) [    ] o.a.s.c.CoreContainer No authentication plugin used.
   [junit4]   2> 135675 INFO  (TEST-TestReplicationHandler.doTestStressReplication-seed#[1129F0CFA8D8E4AE]) [    ] o.a.s.c.CorePropertiesLocator Looking for core definitions underneath /Users/jenkins/workspace/Lucene-Solr-6.x-MacOSX/solr/build/solr-core/test/J0/temp/solr.handler.TestReplicationHandler_1129F0CFA8D8E4AE-001/solr-instance-001/.
   [junit4]   2> 135678 INFO  (TEST-TestReplicationHandler.doTestStressReplication-seed#[1129F0CFA8D8E4AE]) [    ] o.a.s.c.CoreDescriptor Created CoreDescriptor: {name=collection1, config=solrconfig.xml, loadOnStartup=true, schema=schema.xml, configSetProperties=configsetprops.json, transient=false, dataDir=data/}
   [junit4]   2> 135678 INFO  (TEST-TestReplicationHandler.doTestStressReplication-seed#[1129F0CFA8D8E4AE]) [    ] o.a.s.c.CorePropertiesLocator Found core collection1 in /Users/jenkins/workspace/Lucene-Solr-6.x-MacOSX/solr/build/solr-core/test/J0/temp/solr.handler.TestReplicationHandler_1129F0CFA8D8E4AE-001/solr-instance-001/./collection1
   [junit4]   2> 135679 INFO  (TEST-TestReplicationHandler.doTestStressReplication-seed#[1129F0CFA8D8E4AE]) [    ] o.a.s.c.CorePropertiesLocator Found 1 core definitions
   [junit4]   2> 135680 INFO  (TEST-TestReplicationHandler.doTestStressReplication-seed#[1129F0CFA8D8E4AE]) [    ] o.a.s.s.SolrDispatchFilter user.dir=/Users/jenkins/workspace/Lucene-Solr-6.x-MacOSX/solr/build/solr-core/test/J0
   [junit4]   2> 135681 INFO  (coreLoadExecutor-153-thread-1) [    ] o.a.s.c.SolrResourceLoader new SolrResourceLoader for directory: '/Users/jenkins/workspace/Lucene-Solr-6.x-MacOSX/solr/build/solr-core/test/J0/temp/solr.handler.TestReplicationHandler_1129F0CFA8D8E4AE-001/solr-instance-001/collection1'
   [junit4]   2> 135681 INFO  (TEST-TestReplicationHandler.doTestStressReplication-seed#[1129F0CFA8D8E4AE]) [    ] o.a.s.s.SolrDispatchFilter SolrDispatchFilter.init() done
   [junit4]   2> 135681 INFO  (coreLoadExecutor-153-thread-1) [    ] o.a.s.c.SolrResourceLoader JNDI not configured for solr (NoInitialContextEx)
   [junit4]   2> 135681 INFO  (coreLoadExecutor-153-thread-1) [    ] o.a.s.c.SolrResourceLoader solr home defaulted to 'solr/' (could not find system property or JNDI)
   [junit4]   2> 135694 INFO  (coreLoadExecutor-153-thread-1) [    ] o.a.s.c.SolrConfig current version of requestparams : -1
   [junit4]   2> 135697 WARN  (coreLoadExecutor-153-thread-1) [    ] o.a.s.c.Config Beginning with Solr 5.5, <mergePolicy> is deprecated, use <mergePolicyFactory> instead.
   [junit4]   2> 135698 INFO  (coreLoadExecutor-153-thread-1) [    ] o.a.s.c.SolrConfig Using Lucene MatchVersion: 6.1.0
   [junit4]   2> 135706 INFO  (coreLoadExecutor-153-thread-1) [    ] o.a.s.c.SolrConfig Loaded SolrConfig: solrconfig.xml
   [junit4]   2> 135711 INFO  (coreLoadExecutor-153-thread-1) [    ] o.a.s.s.IndexSchema [collection1] Schema name=test
   [junit4]   2> 135714 INFO  (coreLoadExecutor-153-thread-1) [    ] o.a.s.s.IndexSchema unique key field: id
   [junit4]   2> 135720 INFO  (coreLoadExecutor-153-thread-1) [    ] o.a.s.c.ConfigSetProperties Did not find ConfigSet properties, assuming default properties: Can't find resource 'configsetprops.json' in classpath or '/Users/jenkins/workspace/Lucene-Solr-6.x-MacOSX/solr/build/solr-core/test/J0/temp/solr.handler.TestReplicationHandler_1129F0CFA8D8E4AE-001/solr-instance-001/collection1'
   [junit4]   2> 135720 INFO  (coreLoadExecutor-153-thread-1) [    ] o.a.s.c.CoreContainer Creating SolrCore 'collection1' using configuration from instancedir /Users/jenkins/workspace/Lucene-Solr-6.x-MacOSX/solr/build/solr-core/test/J0/temp/solr.handler.TestReplicationHandler_1129F0CFA8D8E4AE-001/solr-instance-001/./collection1
   [junit4]   2> 135721 INFO  (coreLoadExecutor-153-thread-1) [    x:collection1] o.a.s.c.SolrCore solr.NRTCachingDirectoryFactory
   [junit4]   2> 135721 INFO  (coreLoadExecutor-153-thread-1) [    x:collection1] o.a.s.c.SolrCore [[collection1] ] Opening new SolrCore at [/Users/jenkins/workspace/Lucene-Solr-6.x-MacOSX/solr/build/solr-core/test/J0/temp/solr.handler.TestReplicationHandler_1129F0CFA8D8E4AE-001/solr-instance-001/collection1], dataDir=[/Users/jenkins/workspace/Lucene-Solr-6.x-MacOSX/solr/build/solr-core/test/J0/temp/solr.handler.TestReplicationHandler_1129F0CFA8D8E4AE-001/solr-instance-001/./collection1/data/]
   [junit4]   2> 135721 INFO  (coreLoadExecutor-153-thread-1) [    x:collection1] o.a.s.c.SolrCore JMX monitoring not detected for core: collection1
   [junit4]   2> 135722 INFO  (coreLoadExecutor-153-thread-1) [    x:collection1] o.a.s.c.CachingDirectoryFactory return new directory for /Users/jenkins/workspace/Lucene-Solr-6.x-MacOSX/solr/build/solr-core/test/J0/temp/solr.handler.TestReplicationHandler_1129F0CFA8D8E4AE-001/solr-instance-001/collection1/data
   [junit4]   2> 135722 INFO  (coreLoadExecutor-153-thread-1) [    x:collection1] o.a.s.c.SolrCore New index directory detected: old=null new=/Users/jenkins/workspace/Lucene-Solr-6.x-MacOSX/solr/build/solr-core/test/J0/temp/solr.handler.TestReplicationHandler_1129F0CFA8D8E4AE-001/solr-instance-001/./collection1/data/index/
   [junit4]   2> 135723 WARN  (coreLoadExecutor-153-thread-1) [    x:collection1] o.a.s.c.SolrCore [collection1] Solr index directory '/Users/jenkins/workspace/Lucene-Solr-6.x-MacOSX/solr/build/solr-core/test/J0/temp/solr.handler.TestReplicationHandler_1129F0CFA8D8E4AE-001/solr-instance-001/./collection1/data/index' doesn't exist. Creating new index...
   [junit4]   2> 135724 INFO  (coreLoadExecutor-153-thread-1) [    x:collection1] o.a.s.c.CachingDirectoryFactory return new directory for /Users/jenkins/workspace/Lucene-Solr-6.x-MacOSX/solr/build/solr-core/test/J0/temp/solr.handler.TestReplicationHandler_1129F0CFA8D8E4AE-001/solr-instance-001/collection1/data/index
   [junit4]   2> 135724 INFO  (coreLoadExecutor-153-thread-1) [    x:collection1] o.a.s.u.RandomMergePolicy RandomMergePolicy wrapping class org.apache.lucene.index.LogByteSizeMergePolicy: [LogByteSizeMergePolicy: minMergeSize=1677721, mergeFactor=37, maxMergeSize=2147483648, maxMergeSizeForForcedMerge=9223372036854775807, calibrateSizeByDeletes=false, maxMergeDocs=2147483647, maxCFSSegmentSizeMB=8.796093022207999E12, noCFSRatio=0.2408972304015916]
   [junit4]   2> 135751 INFO  (coreLoadExecutor-153-thread-1) [    x:collection1] o.a.s.c.SolrDeletionPolicy SolrDeletionPolicy.onCommit: commits: num=1
   [junit4]   2> 	commit{dir=NRTCachingDirectory(MMapDirectory@/Users/jenkins/workspace/Lucene-Solr-6.x-MacOSX/solr/build/solr-core/test/J0/temp/solr.handler.TestReplicationHandler_1129F0CFA8D8E4AE-001/solr-instance-001/collection1/data/index lockFactory=org.apache.lucene.store.SingleInstanceLockFactory@1de9a2c8; maxCacheMB=48.0 maxMergeSizeMB=4.0),segFN=segments_1,generation=1}
   [junit4]   2> 135751 INFO  (coreLoadExecutor-153-thread-1) [    x:collection1] o.a.s.c.SolrDeletionPolicy newest commit generation = 1
   [junit4]   2> 135752 INFO  (OldIndexDirectoryCleanupThreadForCore-collection1) [    x:collection1] o.a.s.c.SolrCore Looking for old index directories to cleanup for core collection1 in /Users/jenkins/workspace/Lucene-Solr-6.x-MacOSX/solr/build/solr-core/test/J0/temp/solr.handler.TestReplicationHandler_1129F0CFA8D8E4AE-001/solr-instance-001/./collection1/data/
   [junit4]   2> 135754 INFO  (coreLoadExecutor-153-thread-1) [    x:collection1] o.a.s.c.SolrCore no updateRequestProcessorChain defined as default, creating implicit default
   [junit4]   2> 135756 INFO  (coreLoadExecutor-153-thread-1) [    x:collection1] o.a.s.h.l.XMLLoader xsltCacheLifetimeSeconds=60
   [junit4]   2> 135758 INFO  (coreLoadExecutor-153-thread-1) [    x:collection1] o.a.s.h.l.XMLLoader xsltCacheLifetimeSeconds=60
   [junit4]   2> 135760 INFO  (coreLoadExecutor-153-thread-1) [    x:collection1] o.a.s.h.l.XMLLoader xsltCacheLifetimeSeconds=60
   [junit4]   2> 135761 INFO  (coreLoadExecutor-153-thread-1) [    x:collection1] o.a.s.h.l.XMLLoader xsltCacheLifetimeSeconds=60
   [junit4]   2> 135764 INFO  (coreLoadExecutor-153-thread-1) [    x:collection1] o.a.s.c.PluginBag requestHandler : 'lazy' created with startup=lazy 
   [junit4]   2> 135764 INFO  (coreLoadExecutor-153-thread-1) [    x:collection1] o.a.s.c.RequestHandlers Registered paths: /admin/mbeans,standard,lazy,/update/json/docs,/admin/luke,/export,/get,/admin/properties,/update/json,/admin/threads,/update/csv,/sql,/admin/segments,/admin/system,/replication,defaults,/config,/stream,/schema,/admin/plugins,/admin/logging,/admin/ping,/update,/admin/file
   [junit4]   2> 135764 INFO  (coreLoadExecutor-153-thread-1) [    x:collection1] o.a.s.c.SolrCore Using default statsCache cache: org.apache.solr.search.stats.LocalStatsCache
   [junit4]   2> 135765 INFO  (coreLoadExecutor-153-thread-1) [    x:collection1] o.a.s.u.CommitTracker Hard AutoCommit: disabled
   [junit4]   2> 135765 INFO  (coreLoadExecutor-153-thread-1) [    x:collection1] o.a.s.u.CommitTracker Soft AutoCommit: disabled
   [junit4]   2> 135765 INFO  (coreLoadExecutor-153-thread-1) [    x:collection1] o.a.s.u.RandomMergePolicy RandomMergePolicy wrapping class org.apache.lucene.index.LogByteSizeMergePolicy: [LogByteSizeMergePolicy: minMergeSize=1677721, mergeFactor=22, maxMergeSize=2147483648, maxMergeSizeForForcedMerge=9223372036854775807, calibrateSizeByDeletes=true, maxMergeDocs=2147483647, maxCFSSegmentSizeMB=8.796093022207999E12, noCFSRatio=0.0]
   [junit4]   2> 135766 INFO  (coreLoadExecutor-153-thread-1) [    x:collection1] o.a.s.c.SolrDeletionPolicy SolrDeletionPolicy.onInit: commits: num=1
   [junit4]   2> 	commit{dir=NRTCachingDirectory(MMapDirectory@/Users/jenkins/workspace/Lucene-Solr-6.x-MacOSX/solr/build/solr-core/test/J0/temp/solr.handler.TestReplicationHandler_1129F0CFA8D8E4AE-001/solr-instance-001/collection1/data/index lockFactory=org.apache.lucene.store.SingleInstanceLockFactory@1de9a2c8; maxCacheMB=48.0 maxMergeSizeMB=4.0),segFN=segments_1,generation=1}
   [junit4]   2> 135766 INFO  (coreLoadExecutor-153-thread-1) [    x:collection1] o.a.s.c.SolrDeletionPolicy newest commit generation = 1
   [junit4]   2> 135766 INFO  (coreLoadExecutor-153-thread-1) [    x:collection1] o.a.s.s.SolrIndexSearcher Opening [Searcher@51ad9574[collection1] main]
   [junit4]   2> 135767 INFO  (coreLoadExecutor-153-thread-1) [    x:collection1] o.a.s.r.ManagedResourceStorage File-based storage initialized to use dir: /Users/jenkins/workspace/Lucene-Solr-6.x-MacOSX/solr/build/solr-core/test/J0/temp/solr.handler.TestReplicationHandler_1129F0CFA8D8E4AE-001/solr-instance-001/collection1/conf
   [junit4]   2> 135767 INFO  (coreLoadExecutor-153-thread-1) [    x:collection1] o.a.s.r.RestManager Initializing RestManager with initArgs: {storageDir=/Users/jenkins/workspace/Lucene-Solr-6.x-MacOSX/solr/build/solr-core/test/J0/temp/solr.handler.TestReplicationHandler_1129F0CFA8D8E4AE-001/solr-instance-001/collection1/conf}
   [junit4]   2> 135767 INFO  (coreLoadExecutor-153-thread-1) [    x:collection1] o.a.s.r.ManagedResourceStorage Reading _rest_managed.json using file:dir=/Users/jenkins/workspace/Lucene-Solr-6.x-MacOSX/solr/build/solr-core/test/J0/temp/solr.handler.TestReplicationHandler_1129F0CFA8D8E4AE-001/solr-instance-001/collection1/conf
   [junit4]   2> 135768 INFO  (coreLoadExecutor-153-thread-1) [    x:collection1] o.a.s.r.RestManager Initializing 0 registered ManagedResources
   [junit4]   2> 135768 INFO  (coreLoadExecutor-153-thread-1) [    x:collection1] o.a.s.h.ReplicationHandler Replication enabled for following config files: schema.xml
   [junit4]   2> 135768 INFO  (coreLoadExecutor-153-thread-1) [    x:collection1] o.a.s.h.ReplicationHandler Commits will be reserved for  10000
   [junit4]   2> 135768 INFO  (searcherExecutor-154-thread-1-processing-x:collection1) [    x:collection1] o.a.s.c.SolrCore [collection1] Registered new searcher Searcher@51ad9574[collection1] main{ExitableDirectoryReader(UninvertingDirectoryReader())}
   [junit4]   2> 135768 INFO  (coreLoadExecutor-153-thread-1) [    x:collection1] o.a.s.c.CoreContainer registering core: collection1
   [junit4]   2> 136195 INFO  (qtp2008211581-184) [    x:collection1] o.a.s.u.DirectUpdateHandler2 [collection1] REMOVING ALL DOCUMENTS FROM INDEX
   [junit4]   2> 136197 INFO  (qtp2008211581-184) [    x:collection1] o.a.s.u.p.LogUpdateProcessorFactory [collection1]  webapp=/solr path=/update params={wt=javabin&version=2}{deleteByQuery=*:*} 0 4
   [junit4]   2> 136205 INFO  (qtp763858257-166) [    x:collection1] o.a.s.u.DirectUpdateHandler2 [collection1] REMOVING ALL DOCUMENTS FROM INDEX
   [junit4]   2> 136206 INFO  (qtp763858257-166) [    x:collection1] o.a.s.u.p.LogUpdateProcessorFactory [collection1]  webapp=/solr path=/update params={wt=javabin&version=2}{deleteByQuery=*:*} 0 2
   [junit4]   2> 136209 INFO  (qtp763858257-167) [    x:collection1] o.a.s.u.DirectUpdateHandler2 start commit{,optimize=false,openSearcher=true,waitSearcher=true,expungeDeletes=false,softCommit=false,prepareCommit=false}
   [junit4]   2> 136233 INFO  (qtp763858257-167) [    x:collection1] o.a.s.c.SolrDeletionPolicy SolrDeletionPolicy.onCommit: commits: num=2
   [junit4]   2> 	commit{dir=NRTCachingDirectory(MMapDirectory@/Users/jenkins/workspace/Lucene-Solr-6.x-MacOSX/solr/build/solr-core/test/J0/temp/solr.handler.TestReplicationHandler_1129F0CFA8D8E4AE-001/solr-instance-002/collection1/data/index lockFactory=org.apache.lucene.store.SingleInstanceLockFactory@5ed4a4aa; maxCacheMB=48.0 maxMergeSizeMB=4.0),segFN=segments_1,generation=1}
   [junit4]   2> 	commit{dir=NRTCachingDirectory(MMapDirectory@/Users/jenkins/workspace/Lucene-Solr-6.x-MacOSX/solr/build/solr-core/test/J0/temp/solr.handler.TestReplicationHandler_1129F0CFA8D8E4AE-001/solr-instance-002/collection1/data/index lockFactory=org.apache.lucene.store.SingleInstanceLockFactory@5ed4a4aa; maxCacheMB=48.0 maxMergeSizeMB=4.0),segFN=segments_2,generation=2}
   [junit4]   2> 136233 INFO  (qtp763858257-167) [    x:collection1] o.a.s.c.SolrDeletionPolicy newest commit generation = 2
   [junit4]   2> 136235 INFO  (qtp763858257-167) [    x:collection1] o.a.s.s.SolrIndexSearcher Opening [Searcher@7c3637e0[collection1] main]
   [junit4]   2> 136235 INFO  (qtp763858257-167) [    x:collection1] o.a.s.u.DirectUpdateHandler2 end_commit_flush
   [junit4]   2> 136236 INFO  (searcherExecutor-142-thread-1-processing-x:collection1) [    x:collection1] o.a.s.c.SolrCore [collection1] Registered new searcher Searcher@7c3637e0[collection1] main{ExitableDirectoryReader(UninvertingDirectoryReader())}
   [junit4]   2> 136236 INFO  (qtp763858257-167) [    x:collection1] o.a.s.u.p.LogUpdateProcessorFactory [collection1]  webapp=/solr path=/update params={waitSearcher=true&commit=true&softCommit=false&wt=javabin&version=2}{commit=} 0 27
   [junit4]   2> 136243 INFO  (qtp2008211581-185) [    x:collection1] o.a.s.u.p.LogUpdateProcessorFactory [collection1]  webapp=/solr path=/update params={wt=javabin&version=2}{add=[0]} 0 4
   [junit4]   2> 136247 INFO  (qtp2008211581-186) [    x:collection1] o.a.s.u.p.LogUpdateProcessorFactory [collection1]  webapp=/solr path=/update params={wt=javabin&version=2}{add=[1]} 0 0
   [junit4]   2> 136250 INFO  (qtp2008211581-187) [    x:collection1] o.a.s.u.p.LogUpdateProcessorFactory [collection1]  webapp=/solr path=/update params={wt=javabin&version=2}{add=[2]} 0 1
   [junit4]   2> 136254 INFO  (qtp2008211581-188) [    x:collection1] o.a.s.u.p.LogUpdateProcessorFactory [collection1]  webapp=/solr path=/update params={wt=javabin&version=2}{add=[3]} 0 0
   [junit4]   2> 136257 INFO  (qtp2008211581-189) [    x:collection1] o.a.s.u.p.LogUpdateProcessorFactory [collection1]  webapp=/solr path=/update params={wt=javabin&version=2}{add=[4]} 0 0
   [junit4]   2> 136260 INFO  (qtp2008211581-182) [    x:collection1] o.a.s.u.p.LogUpdateProcessorFactory [collection1]  webapp=/solr path=/update params={wt=javabin&version=2}{add=[5]} 0 0
   [junit4]   2> 136264 INFO  (qtp2008211581-184) [    x:collection1] o.a.s.u.p.LogUpdateProcessorFactory [collection1]  webapp=/solr path=/update params={wt=javabin&version=2}{add=[6]} 0 0
   [junit4]   2> 136268 INFO  (qtp2008211581-185) [    x:collection1] o.a.s.u.p.LogUpdateProcessorFactory [collection1]  webapp=/solr path=/update params={wt=javabin&version=2}{add=[7]} 0 0
   [junit4]   2> 136271 INFO  (qtp2008211581-186) [    x:collection1] o.a.s.u.p.LogUpdateProcessorFactory [collection1]  webapp=/solr path=/update params={wt=javabin&version=2}{add=[8]} 0 0
   [junit4]   2> 136274 INFO  (qtp2008211581-187) [    x:collection1] o.a.s.u.p.LogUpdateProcessorFactory [collection1]  webapp=/solr path=/update params={wt=javabin&version=2}{add=[9]} 0 0
   [junit4]   2> 136277 INFO  (qtp2008211581-188) [    x:collection1] o.a.s.u.DirectUpdateHandler2 start commit{,optimize=false,openSearcher=true,waitSearcher=true,expungeDeletes=false,softCommit=false,prepareCommit=false}
   [junit4]   2> 136335 INFO  (qtp2008211581-188) [    x:collection1] o.a.s.c.SolrDeletionPolicy SolrDeletionPolicy.onCommit: commits: num=2
   [junit4]   2> 	commit{dir=NRTCachingDirectory(MMapDirectory@/Users/jenkins/workspace/Lucene-Solr-6.x-MacOSX/solr/build/solr-core/test/J0/temp/solr.handler.TestReplicationHandler_1129F0CFA8D8E4AE-001/solr-instance-001/collection1/data/index lockFactory=org.apache.lucene.store.SingleInstanceLockFactory@1de9a2c8; maxCacheMB=48.0 maxMergeSizeMB=4.0),segFN=segments_1,generation=1}
   [junit4]   2> 	commit{dir=NRTCachingDirectory(MMapDirectory@/Users/jenkins/workspace/Lucene-Solr-6.x-MacOSX/solr/build/solr-core/test/J0/temp/solr.handler.TestReplicationHandler_1129F0CFA8D8E4AE-001/solr-instance-001/collection1/data/index lockFactory=org.apache.lucene.store.SingleInstanceLockFactory@1de9a2c8; maxCacheMB=48.0 maxMergeSizeMB=4.0),segFN=segments_2,generation=2}
   [junit4]   2> 136336 INFO  (qtp2008211581-188) [    x:collection1] o.a.s.c.SolrDeletionPolicy newest commit generation = 2
   [junit4]   2> 136339 INFO  (qtp2008211581-188) [    x:collection1] o.a.s.s.SolrIndexSearcher Opening [Searcher@266f998d[collection1] main]
   [junit4]   2> 136339 INFO  (qtp2008211581-188) [    x:collection1] o.a.s.u.DirectUpdateHandler2 end_commit_flush
   [junit4]   2> 136340 INFO  (searcherExecutor-154-thread-1-processing-x:collection1) [    x:collection1] o.a.s.c.SolrCore [collection1] Registered new searcher Searcher@266f998d[collection1] main{ExitableDirectoryReader(UninvertingDirectoryReader(Uninverting(_0(6.1.0):c10)))}
   [junit4]   2> 136340 INFO  (qtp2008211581-188) [    x:collection1] o.a.s.u.p.LogUpdateProcessorFactory [collection1]  webapp=/solr path=/update params={waitSearcher=true&commit=true&softCommit=false&wt=javabin&version=2}{commit=} 0 62
   [junit4]   2> 136350 INFO  (qtp2008211581-189) [    x:collection1] o.a.s.c.S.Request [collection1]  webapp=/solr path=/select params={q=*:*&sort=id+desc&wt=javabin&version=2} hits=10 status=0 QTime=7
   [junit4]   2> 136353 INFO  (TEST-TestReplicationHandler.doTestStressReplication-seed#[1129F0CFA8D8E4AE]) [    ] o.a.s.h.TestReplicationHandler Waited for 0ms and found 10 docs
   [junit4]   2> 136367 INFO  (qtp763858257-168) [    ] o.a.s.s.HttpSolrCall [admin] webapp=null path=/admin/cores params={core=collection1&action=status&wt=javabin&version=2} status=0 QTime=11
   [junit4]   2> 136413 WARN  (explicit-fetchindex-cmd) [    x:collection1] o.a.s.h.IndexFetcher 'masterUrl' must be specified without the /replication suffix
   [junit4]   2> 136418 INFO  (qtp2008211581-182) [    x:collection1] o.a.s.c.S.Request [collection1]  webapp=/solr path=/replication params={qt=/replication&wt=javabin&version=2&command=indexversion} status=0 QTime=0
   [junit4]   2> 136419 INFO  (explicit-fetchindex-cmd) [    x:collection1] o.a.s.h.IndexFetcher Master's generation: 2
   [junit4]   2> 136419 INFO  (explicit-fetchindex-cmd) [    x:collection1] o.a.s.h.IndexFetcher Slave's generation: 2
   [junit4]   2> 136419 INFO  (explicit-fetchindex-cmd) [    x:collection1] o.a.s.h.IndexFetcher Starting replication process
   [junit4]   2> 136429 INFO  (qtp2008211581-182) [    x:collection1] o.a.s.c.S.Request [collection1]  webapp=/solr path=/replication params={generation=2&qt=/replication&wt=javabin&version=2&command=filelist} status=0 QTime=7
   [junit4]   2> 136430 INFO  (explicit-fetchindex-cmd) [    x:collection1] o.a.s.h.IndexFetcher Number of files in latest index in master: 4
   [junit4]   2> 136435 INFO  (explicit-fetchindex-cmd) [    x:collection1] o.a.s.c.CachingDirectoryFactory return new directory for /Users/jenkins/workspace/Lucene-Solr-6.x-MacOSX/solr/build/solr-core/test/J0/temp/solr.handler.TestReplicationHandler_1129F0CFA8D8E4AE-001/solr-instance-002/collection1/data/index.20160415105530272
   [junit4]   2> 136435 INFO  (explicit-fetchindex-cmd) [    x:co

[...truncated too long message...]

] o.a.s.c.CoreContainer Shutting down CoreContainer instance=717196854
   [junit4]   2> 272268 INFO  (coreCloseExecutor-736-thread-1) [    x:collection1] o.a.s.c.SolrCore [collection1]  CLOSING SolrCore org.apache.solr.core.SolrCore@6dc4c620
   [junit4]   2> 272268 INFO  (coreCloseExecutor-736-thread-1) [    x:collection1] o.a.s.u.DirectUpdateHandler2 closing DirectUpdateHandler2{commits=2,autocommits=0,soft autocommits=0,optimizes=0,rollbacks=0,expungeDeletes=0,docsPending=0,adds=0,deletesById=0,deletesByQuery=0,errors=0,cumulative_adds=6,cumulative_deletesById=0,cumulative_deletesByQuery=0,cumulative_errors=0}
   [junit4]   2> 272268 INFO  (coreCloseExecutor-736-thread-1) [    x:collection1] o.a.s.u.SolrCoreState Closing SolrCoreState
   [junit4]   2> 272268 INFO  (coreCloseExecutor-736-thread-1) [    x:collection1] o.a.s.u.DefaultSolrCoreState SolrCoreState ref count has reached 0 - closing IndexWriter
   [junit4]   2> 272268 INFO  (coreCloseExecutor-736-thread-1) [    x:collection1] o.a.s.u.DefaultSolrCoreState closing IndexWriter with IndexWriterCloser
   [junit4]   2> 272279 INFO  (coreCloseExecutor-736-thread-1) [    x:collection1] o.a.s.c.SolrCore [collection1] Closing main searcher on request.
   [junit4]   2> 272279 INFO  (coreCloseExecutor-736-thread-1) [    x:collection1] o.a.s.c.CachingDirectoryFactory Closing MockDirectoryFactory - 2 directories currently being tracked
   [junit4]   2> 272279 INFO  (coreCloseExecutor-736-thread-1) [    x:collection1] o.a.s.c.CachingDirectoryFactory looking to close /Users/jenkins/workspace/Lucene-Solr-6.x-MacOSX/solr/build/solr-core/test/J0/temp/solr.handler.TestReplicationHandler_1129F0CFA8D8E4AE-001/solr-instance-026/./collection1/data/index [CachedDir<<refCount=0;path=/Users/jenkins/workspace/Lucene-Solr-6.x-MacOSX/solr/build/solr-core/test/J0/temp/solr.handler.TestReplicationHandler_1129F0CFA8D8E4AE-001/solr-instance-026/./collection1/data/index;done=false>>]
   [junit4]   2> 272279 INFO  (coreCloseExecutor-736-thread-1) [    x:collection1] o.a.s.c.CachingDirectoryFactory Closing directory, CoreContainer#isShutdown=true
   [junit4]   2> 272279 INFO  (coreCloseExecutor-736-thread-1) [    x:collection1] o.a.s.c.CachingDirectoryFactory Closing directory: /Users/jenkins/workspace/Lucene-Solr-6.x-MacOSX/solr/build/solr-core/test/J0/temp/solr.handler.TestReplicationHandler_1129F0CFA8D8E4AE-001/solr-instance-026/./collection1/data/index
   [junit4]   2> 272279 INFO  (coreCloseExecutor-736-thread-1) [    x:collection1] o.a.s.c.CachingDirectoryFactory looking to close /Users/jenkins/workspace/Lucene-Solr-6.x-MacOSX/solr/build/solr-core/test/J0/temp/solr.handler.TestReplicationHandler_1129F0CFA8D8E4AE-001/solr-instance-026/./collection1/data [CachedDir<<refCount=0;path=/Users/jenkins/workspace/Lucene-Solr-6.x-MacOSX/solr/build/solr-core/test/J0/temp/solr.handler.TestReplicationHandler_1129F0CFA8D8E4AE-001/solr-instance-026/./collection1/data;done=false>>]
   [junit4]   2> 272279 INFO  (coreCloseExecutor-736-thread-1) [    x:collection1] o.a.s.c.CachingDirectoryFactory Closing directory, CoreContainer#isShutdown=true
   [junit4]   2> 272279 INFO  (coreCloseExecutor-736-thread-1) [    x:collection1] o.a.s.c.CachingDirectoryFactory Closing directory: /Users/jenkins/workspace/Lucene-Solr-6.x-MacOSX/solr/build/solr-core/test/J0/temp/solr.handler.TestReplicationHandler_1129F0CFA8D8E4AE-001/solr-instance-026/./collection1/data
   [junit4]   2> 272280 INFO  (TEST-TestReplicationHandler.doTestRepeater-seed#[1129F0CFA8D8E4AE]) [    ] o.e.j.s.h.ContextHandler Stopped o.e.j.s.ServletContextHandler@15d144b0{/solr,null,UNAVAILABLE}
   [junit4]   2> 272293 INFO  (TEST-TestReplicationHandler.doTestRepeater-seed#[1129F0CFA8D8E4AE]) [    ] o.e.j.s.ServerConnector Stopped ServerConnector@16d04025{HTTP/1.1,[http/1.1]}{127.0.0.1:0}
   [junit4]   2> 272293 INFO  (TEST-TestReplicationHandler.doTestRepeater-seed#[1129F0CFA8D8E4AE]) [    ] o.a.s.c.CoreContainer Shutting down CoreContainer instance=431641869
   [junit4]   2> 272294 INFO  (coreCloseExecutor-738-thread-1) [    x:collection1] o.a.s.c.SolrCore [collection1]  CLOSING SolrCore org.apache.solr.core.SolrCore@d8ff915
   [junit4]   2> 272294 INFO  (coreCloseExecutor-738-thread-1) [    x:collection1] o.a.s.u.DirectUpdateHandler2 closing DirectUpdateHandler2{commits=0,autocommits=0,soft autocommits=0,optimizes=0,rollbacks=0,expungeDeletes=0,docsPending=0,adds=0,deletesById=0,deletesByQuery=0,errors=0,cumulative_adds=0,cumulative_deletesById=0,cumulative_deletesByQuery=0,cumulative_errors=0}
   [junit4]   2> 272294 INFO  (coreCloseExecutor-738-thread-1) [    x:collection1] o.a.s.u.SolrCoreState Closing SolrCoreState
   [junit4]   2> 272294 INFO  (coreCloseExecutor-738-thread-1) [    x:collection1] o.a.s.u.DefaultSolrCoreState SolrCoreState ref count has reached 0 - closing IndexWriter
   [junit4]   2> 272294 INFO  (coreCloseExecutor-738-thread-1) [    x:collection1] o.a.s.u.DefaultSolrCoreState closing IndexWriter with IndexWriterCloser
   [junit4]   2> 272305 INFO  (coreCloseExecutor-738-thread-1) [    x:collection1] o.a.s.c.SolrCore [collection1] Closing main searcher on request.
   [junit4]   2> 272306 INFO  (coreCloseExecutor-738-thread-1) [    x:collection1] o.a.s.c.CachingDirectoryFactory Closing MockDirectoryFactory - 2 directories currently being tracked
   [junit4]   2> 272306 INFO  (coreCloseExecutor-738-thread-1) [    x:collection1] o.a.s.c.CachingDirectoryFactory looking to close /Users/jenkins/workspace/Lucene-Solr-6.x-MacOSX/solr/build/solr-core/test/J0/temp/solr.handler.TestReplicationHandler_1129F0CFA8D8E4AE-001/solr-instance-027/./collection1/data/index [CachedDir<<refCount=0;path=/Users/jenkins/workspace/Lucene-Solr-6.x-MacOSX/solr/build/solr-core/test/J0/temp/solr.handler.TestReplicationHandler_1129F0CFA8D8E4AE-001/solr-instance-027/./collection1/data/index;done=false>>]
   [junit4]   2> 272306 INFO  (coreCloseExecutor-738-thread-1) [    x:collection1] o.a.s.c.CachingDirectoryFactory Closing directory, CoreContainer#isShutdown=true
   [junit4]   2> 272306 INFO  (coreCloseExecutor-738-thread-1) [    x:collection1] o.a.s.c.CachingDirectoryFactory Closing directory: /Users/jenkins/workspace/Lucene-Solr-6.x-MacOSX/solr/build/solr-core/test/J0/temp/solr.handler.TestReplicationHandler_1129F0CFA8D8E4AE-001/solr-instance-027/./collection1/data/index
   [junit4]   2> 272316 INFO  (coreCloseExecutor-738-thread-1) [    x:collection1] o.a.s.c.CachingDirectoryFactory looking to close /Users/jenkins/workspace/Lucene-Solr-6.x-MacOSX/solr/build/solr-core/test/J0/temp/solr.handler.TestReplicationHandler_1129F0CFA8D8E4AE-001/solr-instance-027/./collection1/data [CachedDir<<refCount=0;path=/Users/jenkins/workspace/Lucene-Solr-6.x-MacOSX/solr/build/solr-core/test/J0/temp/solr.handler.TestReplicationHandler_1129F0CFA8D8E4AE-001/solr-instance-027/./collection1/data;done=false>>]
   [junit4]   2> 272316 INFO  (coreCloseExecutor-738-thread-1) [    x:collection1] o.a.s.c.CachingDirectoryFactory Closing directory, CoreContainer#isShutdown=true
   [junit4]   2> 272316 INFO  (coreCloseExecutor-738-thread-1) [    x:collection1] o.a.s.c.CachingDirectoryFactory Closing directory: /Users/jenkins/workspace/Lucene-Solr-6.x-MacOSX/solr/build/solr-core/test/J0/temp/solr.handler.TestReplicationHandler_1129F0CFA8D8E4AE-001/solr-instance-027/./collection1/data
   [junit4]   2> 272327 INFO  (TEST-TestReplicationHandler.doTestRepeater-seed#[1129F0CFA8D8E4AE]) [    ] o.e.j.s.h.ContextHandler Stopped o.e.j.s.ServletContextHandler@3676b532{/solr,null,UNAVAILABLE}
   [junit4]   2> 272339 INFO  (SUITE-TestReplicationHandler-seed#[1129F0CFA8D8E4AE]-worker) [    ] o.a.s.SolrTestCaseJ4 ###deleteCore
   [junit4]   2> NOTE: leaving temporary files on disk at: /Users/jenkins/workspace/Lucene-Solr-6.x-MacOSX/solr/build/solr-core/test/J0/temp/solr.handler.TestReplicationHandler_1129F0CFA8D8E4AE-001
   [junit4]   2> NOTE: test params are: codec=Asserting(Lucene60): {name=PostingsFormat(name=LuceneVarGapDocFreqInterval), id=PostingsFormat(name=LuceneVarGapDocFreqInterval), newname=PostingsFormat(name=LuceneVarGapDocFreqInterval)}, docValues:{}, maxPointsInLeafNode=16, maxMBSortInHeap=6.8582192366127375, sim=ClassicSimilarity, locale=zh, timezone=America/Panama
   [junit4]   2> NOTE: Mac OS X 10.11.4 x86_64/Oracle Corporation 1.8.0_72 (64-bit)/cpus=3,threads=1,free=78847480,total=185597952
   [junit4]   2> NOTE: All tests run in this JVM: [DirectUpdateHandlerTest, ClassificationUpdateProcessorFactoryTest, TestCollationFieldDocValues, TimeZoneUtilsTest, IndexBasedSpellCheckerTest, DOMUtilTest, TestDistributedStatsComponentCardinality, TestReplicationHandler]
   [junit4] Completed [20/587 (1!)] on J0 in 138.51s, 13 tests, 1 error <<< FAILURES!

[...truncated 1842 lines...]
BUILD FAILED
/Users/jenkins/workspace/Lucene-Solr-6.x-MacOSX/build.xml:740: The following error occurred while executing this line:
/Users/jenkins/workspace/Lucene-Solr-6.x-MacOSX/build.xml:684: The following error occurred while executing this line:
/Users/jenkins/workspace/Lucene-Solr-6.x-MacOSX/build.xml:59: The following error occurred while executing this line:
/Users/jenkins/workspace/Lucene-Solr-6.x-MacOSX/solr/build.xml:233: The following error occurred while executing this line:
/Users/jenkins/workspace/Lucene-Solr-6.x-MacOSX/solr/common-build.xml:529: The following error occurred while executing this line:
/Users/jenkins/workspace/Lucene-Solr-6.x-MacOSX/lucene/common-build.xml:1457: The following error occurred while executing this line:
/Users/jenkins/workspace/Lucene-Solr-6.x-MacOSX/lucene/common-build.xml:1014: There were test failures: 587 suites (10 ignored), 2366 tests, 1 error, 119 ignored (69 assumptions) [seed: 1129F0CFA8D8E4AE]

Total time: 83 minutes 14 seconds
Build step 'Invoke Ant' marked build as failure
Archiving artifacts
[WARNINGS] Skipping publisher since build result is FAILURE
Recording test results
Email was triggered for: Failure - Any
Sending email for trigger: Failure - Any