You are viewing a plain text version of this content. The canonical link for it is here.
Posted to builds@beam.apache.org by Apache Jenkins Server <je...@builds.apache.org> on 2023/02/16 06:29:26 UTC

Build failed in Jenkins: beam_PostCommit_XVR_PythonUsingJavaSQL_Dataflow #1503

See <https://ci-beam.apache.org/job/beam_PostCommit_XVR_PythonUsingJavaSQL_Dataflow/1503/display/redirect>

Changes:


------------------------------------------
[...truncated 821.64 KB...]
 ---> Running in 926d5bcf0ce0
absl-py==1.4.0
apache-beam @ file:///opt/apache/beam/tars/apache-beam.tar.gz
astunparse==1.6.3
attrs==22.2.0
beautifulsoup4==4.11.2
bs4==0.0.1
cachetools==4.2.4
certifi==2022.12.7
cffi==1.15.1
charset-normalizer==3.0.1
click==8.1.3
cloudpickle==2.2.1
crcmod==1.7
cryptography==39.0.1
Cython==0.29.33
deprecation==2.1.0
dill==0.3.1.1
docker==6.0.1
docopt==0.6.2
exceptiongroup==1.1.0
execnet==1.9.0
fastavro==1.7.1
fasteners==0.18
flatbuffers==23.1.21
freezegun==1.2.2
future==0.18.3
gast==0.4.0
google-api-core==2.8.2
google-api-python-client==2.78.0
google-apitools==0.5.31
google-auth==2.16.0
google-auth-httplib2==0.1.0
google-auth-oauthlib==0.4.6
google-cloud-bigquery==3.3.3
google-cloud-bigquery-storage==2.16.0
google-cloud-bigtable==1.7.3
google-cloud-core==2.3.2
google-cloud-datastore==1.15.5
google-cloud-dlp==3.9.0
google-cloud-language==1.3.2
google-cloud-profiler==3.1.0
google-cloud-pubsub==2.13.7
google-cloud-pubsublite==1.6.0
google-cloud-recommendations-ai==0.7.1
google-cloud-spanner==3.22.0
google-cloud-videointelligence==1.16.3
google-cloud-vision==3.1.2
google-crc32c==1.5.0
google-pasta==0.2.0
google-resumable-media==2.4.1
googleapis-common-protos==1.56.4
greenlet==2.0.2
grpc-google-iam-v1==0.12.4
grpcio==1.51.1
grpcio-status==1.48.2
guppy3==3.1.2
h5py==3.8.0
hdfs==2.7.0
httplib2==0.21.0
hypothesis==6.68.1
idna==3.4
iniconfig==2.0.0
joblib==1.2.0
keras==2.11.0
libclang==15.0.6.1
Markdown==3.4.1
MarkupSafe==2.1.2
mmh3==3.0.0
mock==2.0.0
nltk==3.8.1
nose==1.3.7
numpy==1.24.2
oauth2client==4.1.3
oauthlib==3.2.2
objsize==0.6.1
opt-einsum==3.3.0
orjson==3.8.6
overrides==6.5.0
packaging==21.3
pandas==1.5.3
parameterized==0.8.1
pbr==5.11.1
pip==23.0
pluggy==1.0.0
proto-plus==1.22.2
protobuf==3.19.4
psycopg2-binary==2.9.5
py==1.11.0
pyarrow==9.0.0
pyasn1==0.4.8
pyasn1-modules==0.2.8
pycparser==2.21
pydot==1.4.2
PyHamcrest==1.10.1
pymongo==3.13.0
PyMySQL==1.0.2
pyparsing==3.0.9
pytest==7.2.1
pytest-forked==1.6.0
pytest-timeout==2.1.0
pytest-xdist==2.5.0
python-dateutil==2.8.2
python-snappy==0.6.1
pytz==2022.7.1
PyYAML==6.0
regex==2022.10.31
requests==2.28.2
requests-mock==1.10.0
requests-oauthlib==1.3.1
rsa==4.9
scikit-learn==1.2.1
scipy==1.10.0
setuptools==67.3.2
six==1.16.0
sortedcontainers==2.4.0
soupsieve==2.4
SQLAlchemy==1.4.46
sqlparse==0.4.3
tenacity==5.1.5
tensorboard==2.11.2
tensorboard-data-server==0.6.1
tensorboard-plugin-wit==1.8.1
tensorflow==2.11.0
tensorflow-estimator==2.11.0
tensorflow-io-gcs-filesystem==0.30.0
termcolor==2.2.0
testcontainers==3.7.1
threadpoolctl==3.1.0
tomli==2.0.1
tqdm==4.64.1
typing_extensions==4.4.0
uritemplate==4.1.1
urllib3==1.26.14
websocket-client==1.5.1
Werkzeug==2.2.3
wheel==0.38.4
wrapt==1.14.1
zstandard==0.19.0
Removing intermediate container 926d5bcf0ce0
 ---> bfae2ddbda3c
Step 17/32 : COPY target/LICENSE /opt/apache/beam/
 ---> c729224962e2
Step 18/32 : COPY target/LICENSE.python /opt/apache/beam/
 ---> 5fd9544bb9ec
Step 19/32 : COPY target/NOTICE /opt/apache/beam/
 ---> 588b2a1209fe
Step 20/32 : COPY target/launcher/linux_amd64/boot /opt/apache/beam/
 ---> 760c75849216
Step 21/32 : ENTRYPOINT ["/opt/apache/beam/boot"]
 ---> Running in 87f4b9ae1ee5
Removing intermediate container 87f4b9ae1ee5
 ---> ec8448a0013f
Step 22/32 : FROM beam as third_party_licenses
 ---> ec8448a0013f
Step 23/32 : ARG pull_licenses
 ---> Running in 82a2eaa5d0d8
Removing intermediate container 82a2eaa5d0d8
 ---> 3a3cc2537b60
Step 24/32 : COPY target/license_scripts /tmp/license_scripts/
 ---> 4bb9e7e32f0f
Step 25/32 : COPY target/LICENSE target/go-licenses/* /opt/apache/beam/third_party_licenses/golang/
 ---> a0dd6bd45a07
Step 26/32 : RUN rm /opt/apache/beam/third_party_licenses/golang/LICENSE
 ---> Running in ae9d3325edfa
Removing intermediate container ae9d3325edfa
 ---> ffdb234e2a46
Step 27/32 : COPY target/license_scripts /tmp/license_scripts/
 ---> 2ccf70dbff01
Step 28/32 : RUN if [ "$pull_licenses" = "true" ] ; then       pip install 'pip-licenses<4.0.0' pyyaml tenacity &&       python /tmp/license_scripts/pull_licenses_py.py ;     fi
 ---> Running in d55908f3214e
Collecting pip-licenses<4.0.0
  Downloading pip_licenses-3.5.5-py3-none-any.whl (17 kB)
Requirement already satisfied: pyyaml in /usr/local/lib/python3.10/site-packages (6.0)
Requirement already satisfied: tenacity in /usr/local/lib/python3.10/site-packages (5.1.5)
Collecting PTable
  Downloading PTable-0.9.2.tar.gz (31 kB)
  Preparing metadata (setup.py): started
  Preparing metadata (setup.py): finished with status 'done'
Requirement already satisfied: six>=1.9.0 in /usr/local/lib/python3.10/site-packages (from tenacity) (1.16.0)
Building wheels for collected packages: PTable
  Building wheel for PTable (setup.py): started
  Building wheel for PTable (setup.py): finished with status 'done'
  Created wheel for PTable: filename=PTable-0.9.2-py3-none-any.whl size=22908 sha256=9dda0e3f729af8c078cd00f31594c00f5e10cdfce55cfd05b92dfbda2d7cd52c
  Stored in directory: /root/.cache/pip/wheels/bc/88/52/f2e9fc70f3a657cf256e9b01a8a42938c4c5ee69118d51ed90
Successfully built PTable
Installing collected packages: PTable, pip-licenses
Successfully installed PTable-0.9.2 pip-licenses-3.5.5
WARNING: Running pip as the 'root' user can result in broken permissions and conflicting behaviour with the system package manager. It is recommended to use a virtual environment instead: https://pip.pypa.io/warnings/venv
INFO:root:Successfully pulled licenses for 134 dependencies
Skip pulling license for  bs4
Removing intermediate container d55908f3214e
 ---> 577b1303f69d
Step 29/32 : FROM beam
 ---> ec8448a0013f
Step 30/32 : ARG pull_licenses
 ---> Running in ec8ced874381
Removing intermediate container ec8ced874381
 ---> 25bd2374a1b3
Step 31/32 : COPY --from=third_party_licenses /opt/apache/beam/third_party_licenses /opt/apache/beam/third_party_licenses
 ---> 6a0b44f5eb4b
Step 32/32 : RUN if [ "$pull_licenses" != "true" ] ; then       rm -rf /opt/apache/beam/third_party_licenses ;     fi
 ---> Running in e4e37755ce2a
Removing intermediate container e4e37755ce2a
 ---> 5b55bf774ff8
Successfully built 5b55bf774ff8
Successfully tagged apache/beam_python3.10_sdk:2.46.0.dev

> Task :runners:google-cloud-dataflow-java:buildAndPushDockerPythonContainer
WARNING: `gcloud docker` will not be supported for Docker client versions above 18.03.

As an alternative, use `gcloud auth configure-docker` to configure `docker` to
use `gcloud` as a credential helper, then use `docker` as you would for non-GCR
registries, e.g. `docker pull gcr.io/project-id/my-image`. Add
`--verbosity=error` to silence this warning: `gcloud docker
--verbosity=error -- pull gcr.io/project-id/my-image`.

See: https://cloud.google.com/container-registry/docs/support/deprecation-notices#gcloud-docker


FAILURE: Build failed with an exception.

* What went wrong:
Execution failed for task ':sdks:java:container:pullLicenses'.
> Process 'command './license_scripts/license_script.sh'' finished with non-zero exit value 1

* Try:
> Run with --stacktrace option to get the stack trace.
> Run with --info or --debug option to get more log output.

* Get more help at https://help.gradle.org

Deprecated Gradle features were used in this build, making it incompatible with Gradle 8.0.

You can use '--warning-mode all' to show the individual deprecation warnings and determine if they come from your own scripts or plugins.

See https://docs.gradle.org/7.5.1/userguide/command_line_interface.html#sec:command_line_warnings

Execution optimizations have been disabled for 1 invalid unit(s) of work during this build to ensure correctness.
Please consult deprecation warnings for more details.

BUILD FAILED in 11m 49s
160 actionable tasks: 106 executed, 48 from cache, 6 up-to-date

Publishing build scan...
https://gradle.com/s/jmqcr57bqamge

Build step 'Invoke Gradle script' changed build result to FAILURE
Build step 'Invoke Gradle script' marked build as failure

---------------------------------------------------------------------
To unsubscribe, e-mail: builds-unsubscribe@beam.apache.org
For additional commands, e-mail: builds-help@beam.apache.org


Jenkins build is back to normal : beam_PostCommit_XVR_PythonUsingJavaSQL_Dataflow #1506

Posted by Apache Jenkins Server <je...@builds.apache.org>.
See <https://ci-beam.apache.org/job/beam_PostCommit_XVR_PythonUsingJavaSQL_Dataflow/1506/display/redirect?page=changes>


---------------------------------------------------------------------
To unsubscribe, e-mail: builds-unsubscribe@beam.apache.org
For additional commands, e-mail: builds-help@beam.apache.org


Build failed in Jenkins: beam_PostCommit_XVR_PythonUsingJavaSQL_Dataflow #1505

Posted by Apache Jenkins Server <je...@builds.apache.org>.
See <https://ci-beam.apache.org/job/beam_PostCommit_XVR_PythonUsingJavaSQL_Dataflow/1505/display/redirect?page=changes>

Changes:

[noreply] Fix beam.Row.__eq__ for rows with trailing columns (#23876)

[noreply] TFMA notebook showing ExtractEvaluateAndWriteResult Tranfsorm (#25381)

[noreply] Fix whitespace check (#25514)

[noreply] Add back links removed in #24744 (#25513)


------------------------------------------
[...truncated 724.04 KB...]
keras==2.11.0
libclang==15.0.6.1
Markdown==3.4.1
MarkupSafe==2.1.2
mmh3==3.0.0
mock==2.0.0
nltk==3.8.1
nose==1.3.7
numpy==1.24.2
oauth2client==4.1.3
oauthlib==3.2.2
objsize==0.6.1
opt-einsum==3.3.0
orjson==3.8.6
overrides==6.5.0
packaging==21.3
pandas==1.5.3
parameterized==0.8.1
pbr==5.11.1
pip==23.0
pluggy==1.0.0
proto-plus==1.22.2
protobuf==3.19.4
psycopg2-binary==2.9.5
py==1.11.0
pyarrow==9.0.0
pyasn1==0.4.8
pyasn1-modules==0.2.8
pycparser==2.21
pydot==1.4.2
PyHamcrest==1.10.1
pymongo==3.13.0
PyMySQL==1.0.2
pyparsing==3.0.9
pytest==7.2.1
pytest-forked==1.6.0
pytest-timeout==2.1.0
pytest-xdist==2.5.0
python-dateutil==2.8.2
python-snappy==0.6.1
pytz==2022.7.1
PyYAML==6.0
regex==2022.10.31
requests==2.28.2
requests-mock==1.10.0
requests-oauthlib==1.3.1
rsa==4.9
scikit-learn==1.2.1
scipy==1.10.0
setuptools==67.3.2
six==1.16.0
sortedcontainers==2.4.0
soupsieve==2.4
SQLAlchemy==1.4.46
sqlparse==0.4.3
tenacity==5.1.5
tensorboard==2.11.2
tensorboard-data-server==0.6.1
tensorboard-plugin-wit==1.8.1
tensorflow==2.11.0
tensorflow-estimator==2.11.0
tensorflow-io-gcs-filesystem==0.30.0
termcolor==2.2.0
testcontainers==3.7.1
threadpoolctl==3.1.0
tomli==2.0.1
tqdm==4.64.1
typing_extensions==4.4.0
uritemplate==4.1.1
urllib3==1.26.14
websocket-client==1.5.1
Werkzeug==2.2.3
wheel==0.38.4
wrapt==1.14.1
zstandard==0.19.0
Removing intermediate container e6bf5562f9c8
 ---> 238602f01ee6
Step 17/32 : COPY target/LICENSE /opt/apache/beam/
 ---> e8d7f34cc173
Step 18/32 : COPY target/LICENSE.python /opt/apache/beam/
 ---> 5cf0bc82e09c
Step 19/32 : COPY target/NOTICE /opt/apache/beam/
 ---> 5d7bdf469125
Step 20/32 : COPY target/launcher/linux_amd64/boot /opt/apache/beam/
 ---> 28b788e6d143
Step 21/32 : ENTRYPOINT ["/opt/apache/beam/boot"]
 ---> Running in 99db902ae486
Removing intermediate container 99db902ae486
 ---> 280bc9f95633
Step 22/32 : FROM beam as third_party_licenses
 ---> 280bc9f95633
Step 23/32 : ARG pull_licenses
 ---> Running in 082e2b2bc126
Removing intermediate container 082e2b2bc126
 ---> de6956cc44e2
Step 24/32 : COPY target/license_scripts /tmp/license_scripts/
 ---> 13e36de9ba5e
Step 25/32 : COPY target/LICENSE target/go-licenses/* /opt/apache/beam/third_party_licenses/golang/
 ---> 65b74634632e
Step 26/32 : RUN rm /opt/apache/beam/third_party_licenses/golang/LICENSE
 ---> Running in 65263bf645f4
Removing intermediate container 65263bf645f4
 ---> 6a7b31972881
Step 27/32 : COPY target/license_scripts /tmp/license_scripts/
 ---> 19b73a2855ee
Step 28/32 : RUN if [ "$pull_licenses" = "true" ] ; then       pip install 'pip-licenses<4.0.0' pyyaml tenacity &&       python /tmp/license_scripts/pull_licenses_py.py ;     fi
 ---> Running in 4bbf5e3a037c
Collecting pip-licenses<4.0.0
  Downloading pip_licenses-3.5.5-py3-none-any.whl (17 kB)
Requirement already satisfied: pyyaml in /usr/local/lib/python3.10/site-packages (6.0)
Requirement already satisfied: tenacity in /usr/local/lib/python3.10/site-packages (5.1.5)
Collecting PTable
  Downloading PTable-0.9.2.tar.gz (31 kB)
  Preparing metadata (setup.py): started
  Preparing metadata (setup.py): finished with status 'done'
Requirement already satisfied: six>=1.9.0 in /usr/local/lib/python3.10/site-packages (from tenacity) (1.16.0)
Building wheels for collected packages: PTable
  Building wheel for PTable (setup.py): started
  Building wheel for PTable (setup.py): finished with status 'done'
  Created wheel for PTable: filename=PTable-0.9.2-py3-none-any.whl size=22908 sha256=736f53513f560ad03dcd8af1a30d2848b00c4c556e48f4ea796da2d678ecc75c
  Stored in directory: /root/.cache/pip/wheels/bc/88/52/f2e9fc70f3a657cf256e9b01a8a42938c4c5ee69118d51ed90
Successfully built PTable
Installing collected packages: PTable, pip-licenses
Successfully installed PTable-0.9.2 pip-licenses-3.5.5
WARNING: Running pip as the 'root' user can result in broken permissions and conflicting behaviour with the system package manager. It is recommended to use a virtual environment instead: https://pip.pypa.io/warnings/venv
Skip pulling license for  bs4
INFO:root:Successfully pulled licenses for 134 dependencies
Removing intermediate container 4bbf5e3a037c
 ---> 9b8682395989
Step 29/32 : FROM beam
 ---> 280bc9f95633
Step 30/32 : ARG pull_licenses
 ---> Running in 20c7c4cae3b3
Removing intermediate container 20c7c4cae3b3
 ---> 1ad6a888c90d
Step 31/32 : COPY --from=third_party_licenses /opt/apache/beam/third_party_licenses /opt/apache/beam/third_party_licenses
 ---> 6ffbea1fa337
Step 32/32 : RUN if [ "$pull_licenses" != "true" ] ; then       rm -rf /opt/apache/beam/third_party_licenses ;     fi
 ---> Running in 68b70a9ef929
Removing intermediate container 68b70a9ef929
 ---> 6fa5b4258ddd
Successfully built 6fa5b4258ddd
Successfully tagged apache/beam_python3.10_sdk:2.46.0.dev

> Task :runners:google-cloud-dataflow-java:buildAndPushDockerPythonContainer
WARNING: `gcloud docker` will not be supported for Docker client versions above 18.03.

As an alternative, use `gcloud auth configure-docker` to configure `docker` to
use `gcloud` as a credential helper, then use `docker` as you would for non-GCR
registries, e.g. `docker pull gcr.io/project-id/my-image`. Add
`--verbosity=error` to silence this warning: `gcloud docker
--verbosity=error -- pull gcr.io/project-id/my-image`.

See: https://cloud.google.com/container-registry/docs/support/deprecation-notices#gcloud-docker

The push refers to repository [us.gcr.io/apache-beam-testing/java-postcommit-it/python]
39e69e8aa1c7: Preparing
713a4920d203: Preparing
a843b2812fdf: Preparing
ff4a7825066e: Preparing
ef1cb89d1af0: Preparing
7fb47c4119a8: Preparing
dc76816428ad: Preparing
245e64ae06b1: Preparing
06006e24d512: Preparing
f032fd00df44: Preparing
9840dee4d907: Preparing
d35b684a21fe: Preparing
7957dcd59957: Preparing
9dfc22098680: Preparing
8243d6a3557a: Preparing
94058978c148: Preparing
1b45dbbd13b7: Preparing
17efc79ac0fe: Preparing
0b6859e9fff1: Preparing
11829b3be9c0: Preparing
245e64ae06b1: Waiting
8243d6a3557a: Waiting
d35b684a21fe: Waiting
06006e24d512: Waiting
dc8e1d8b53e9: Preparing
9d49e0bc68a4: Preparing
8e396a1aad50: Preparing
94058978c148: Waiting
9840dee4d907: Waiting
1b45dbbd13b7: Waiting
7fb47c4119a8: Waiting
17efc79ac0fe: Waiting
11829b3be9c0: Waiting
0b6859e9fff1: Waiting
9d49e0bc68a4: Waiting
dc76816428ad: Waiting
dc8e1d8b53e9: Waiting
f032fd00df44: Waiting
9dfc22098680: Waiting
a843b2812fdf: Pushed
ff4a7825066e: Pushed
39e69e8aa1c7: Pushed
245e64ae06b1: Pushed
ef1cb89d1af0: Pushed
dc76816428ad: Pushed
713a4920d203: Pushed
06006e24d512: Pushed
7957dcd59957: Pushed
9840dee4d907: Pushed
8243d6a3557a: Layer already exists
94058978c148: Layer already exists
1b45dbbd13b7: Layer already exists
17efc79ac0fe: Layer already exists
0b6859e9fff1: Layer already exists
11829b3be9c0: Layer already exists
dc8e1d8b53e9: Layer already exists
9d49e0bc68a4: Layer already exists
8e396a1aad50: Layer already exists
9dfc22098680: Pushed
7fb47c4119a8: Pushed
f032fd00df44: Pushed
d35b684a21fe: Pushed
20230216181742: digest: sha256:6390d8aafdf04e452f8952f007c525986b7b100c43a9577cecfb1f48c495b1ec size: 5156

FAILURE: Build failed with an exception.

* What went wrong:
Execution failed for task ':sdks:java:container:pullLicenses'.
> Process 'command './license_scripts/license_script.sh'' finished with non-zero exit value 1

* Try:
> Run with --stacktrace option to get the stack trace.
> Run with --info or --debug option to get more log output.

* Get more help at https://help.gradle.org

Deprecated Gradle features were used in this build, making it incompatible with Gradle 8.0.

You can use '--warning-mode all' to show the individual deprecation warnings and determine if they come from your own scripts or plugins.

See https://docs.gradle.org/7.5.1/userguide/command_line_interface.html#sec:command_line_warnings

Execution optimizations have been disabled for 1 invalid unit(s) of work during this build to ensure correctness.
Please consult deprecation warnings for more details.

BUILD FAILED in 11m 20s
160 actionable tasks: 106 executed, 48 from cache, 6 up-to-date

Publishing build scan...
https://gradle.com/s/zsffeovujsbtw

Build step 'Invoke Gradle script' changed build result to FAILURE
Build step 'Invoke Gradle script' marked build as failure

---------------------------------------------------------------------
To unsubscribe, e-mail: builds-unsubscribe@beam.apache.org
For additional commands, e-mail: builds-help@beam.apache.org


Build failed in Jenkins: beam_PostCommit_XVR_PythonUsingJavaSQL_Dataflow #1504

Posted by Apache Jenkins Server <je...@builds.apache.org>.
See <https://ci-beam.apache.org/job/beam_PostCommit_XVR_PythonUsingJavaSQL_Dataflow/1504/display/redirect>

Changes:


------------------------------------------
[...truncated 820.95 KB...]
 ---> Running in c91959f9bad8
absl-py==1.4.0
apache-beam @ file:///opt/apache/beam/tars/apache-beam.tar.gz
astunparse==1.6.3
attrs==22.2.0
beautifulsoup4==4.11.2
bs4==0.0.1
cachetools==4.2.4
certifi==2022.12.7
cffi==1.15.1
charset-normalizer==3.0.1
click==8.1.3
cloudpickle==2.2.1
crcmod==1.7
cryptography==39.0.1
Cython==0.29.33
deprecation==2.1.0
dill==0.3.1.1
docker==6.0.1
docopt==0.6.2
exceptiongroup==1.1.0
execnet==1.9.0
fastavro==1.7.1
fasteners==0.18
flatbuffers==23.1.21
freezegun==1.2.2
future==0.18.3
gast==0.4.0
google-api-core==2.8.2
google-api-python-client==2.78.0
google-apitools==0.5.31
google-auth==2.16.0
google-auth-httplib2==0.1.0
google-auth-oauthlib==0.4.6
google-cloud-bigquery==3.3.3
google-cloud-bigquery-storage==2.16.0
google-cloud-bigtable==1.7.3
google-cloud-core==2.3.2
google-cloud-datastore==1.15.5
google-cloud-dlp==3.9.0
google-cloud-language==1.3.2
google-cloud-profiler==3.1.0
google-cloud-pubsub==2.13.7
google-cloud-pubsublite==1.6.0
google-cloud-recommendations-ai==0.7.1
google-cloud-spanner==3.22.0
google-cloud-videointelligence==1.16.3
google-cloud-vision==3.1.2
google-crc32c==1.5.0
google-pasta==0.2.0
google-resumable-media==2.4.1
googleapis-common-protos==1.56.4
greenlet==2.0.2
grpc-google-iam-v1==0.12.4
grpcio==1.51.1
grpcio-status==1.48.2
guppy3==3.1.2
h5py==3.8.0
hdfs==2.7.0
httplib2==0.21.0
hypothesis==6.68.1
idna==3.4
iniconfig==2.0.0
joblib==1.2.0
keras==2.11.0
libclang==15.0.6.1
Markdown==3.4.1
MarkupSafe==2.1.2
mmh3==3.0.0
mock==2.0.0
nltk==3.8.1
nose==1.3.7
numpy==1.24.2
oauth2client==4.1.3
oauthlib==3.2.2
objsize==0.6.1
opt-einsum==3.3.0
orjson==3.8.6
overrides==6.5.0
packaging==21.3
pandas==1.5.3
parameterized==0.8.1
pbr==5.11.1
pip==23.0
pluggy==1.0.0
proto-plus==1.22.2
protobuf==3.19.4
psycopg2-binary==2.9.5
py==1.11.0
pyarrow==9.0.0
pyasn1==0.4.8
pyasn1-modules==0.2.8
pycparser==2.21
pydot==1.4.2
PyHamcrest==1.10.1
pymongo==3.13.0
PyMySQL==1.0.2
pyparsing==3.0.9
pytest==7.2.1
pytest-forked==1.6.0
pytest-timeout==2.1.0
pytest-xdist==2.5.0
python-dateutil==2.8.2
python-snappy==0.6.1
pytz==2022.7.1
PyYAML==6.0
regex==2022.10.31
requests==2.28.2
requests-mock==1.10.0
requests-oauthlib==1.3.1
rsa==4.9
scikit-learn==1.2.1
scipy==1.10.0
setuptools==67.3.2
six==1.16.0
sortedcontainers==2.4.0
soupsieve==2.4
SQLAlchemy==1.4.46
sqlparse==0.4.3
tenacity==5.1.5
tensorboard==2.11.2
tensorboard-data-server==0.6.1
tensorboard-plugin-wit==1.8.1
tensorflow==2.11.0
tensorflow-estimator==2.11.0
tensorflow-io-gcs-filesystem==0.30.0
termcolor==2.2.0
testcontainers==3.7.1
threadpoolctl==3.1.0
tomli==2.0.1
tqdm==4.64.1
typing_extensions==4.4.0
uritemplate==4.1.1
urllib3==1.26.14
websocket-client==1.5.1
Werkzeug==2.2.3
wheel==0.38.4
wrapt==1.14.1
zstandard==0.19.0
Removing intermediate container c91959f9bad8
 ---> c7c2fcf6d00c
Step 17/32 : COPY target/LICENSE /opt/apache/beam/
 ---> 3932250fdf76
Step 18/32 : COPY target/LICENSE.python /opt/apache/beam/
 ---> 6d7a1a588f20
Step 19/32 : COPY target/NOTICE /opt/apache/beam/
 ---> fe2561ceffc4
Step 20/32 : COPY target/launcher/linux_amd64/boot /opt/apache/beam/
 ---> 66430fe1a3a6
Step 21/32 : ENTRYPOINT ["/opt/apache/beam/boot"]
 ---> Running in f5a81cd68edb
Removing intermediate container f5a81cd68edb
 ---> b19c056b7f85
Step 22/32 : FROM beam as third_party_licenses
 ---> b19c056b7f85
Step 23/32 : ARG pull_licenses
 ---> Running in 0e435197fa3e
Removing intermediate container 0e435197fa3e
 ---> 339727f8ffdc
Step 24/32 : COPY target/license_scripts /tmp/license_scripts/
 ---> a33e917f99f8
Step 25/32 : COPY target/LICENSE target/go-licenses/* /opt/apache/beam/third_party_licenses/golang/
 ---> 5000b6c5c392
Step 26/32 : RUN rm /opt/apache/beam/third_party_licenses/golang/LICENSE
 ---> Running in 3b7e097a24e7
Removing intermediate container 3b7e097a24e7
 ---> 5c032db46cb7
Step 27/32 : COPY target/license_scripts /tmp/license_scripts/
 ---> bdbea098ae22
Step 28/32 : RUN if [ "$pull_licenses" = "true" ] ; then       pip install 'pip-licenses<4.0.0' pyyaml tenacity &&       python /tmp/license_scripts/pull_licenses_py.py ;     fi
 ---> Running in dbdb7a0811c7
Collecting pip-licenses<4.0.0
  Downloading pip_licenses-3.5.5-py3-none-any.whl (17 kB)
Requirement already satisfied: pyyaml in /usr/local/lib/python3.10/site-packages (6.0)
Requirement already satisfied: tenacity in /usr/local/lib/python3.10/site-packages (5.1.5)
Collecting PTable
  Downloading PTable-0.9.2.tar.gz (31 kB)
  Preparing metadata (setup.py): started
  Preparing metadata (setup.py): finished with status 'done'
Requirement already satisfied: six>=1.9.0 in /usr/local/lib/python3.10/site-packages (from tenacity) (1.16.0)
Building wheels for collected packages: PTable
  Building wheel for PTable (setup.py): started
  Building wheel for PTable (setup.py): finished with status 'done'
  Created wheel for PTable: filename=PTable-0.9.2-py3-none-any.whl size=22908 sha256=9c515e05483ce45fa4c0370bf50b65f6969b315571ad4110323c2952a0f92cc1
  Stored in directory: /root/.cache/pip/wheels/bc/88/52/f2e9fc70f3a657cf256e9b01a8a42938c4c5ee69118d51ed90
Successfully built PTable
Installing collected packages: PTable, pip-licenses
Successfully installed PTable-0.9.2 pip-licenses-3.5.5
WARNING: Running pip as the 'root' user can result in broken permissions and conflicting behaviour with the system package manager. It is recommended to use a virtual environment instead: https://pip.pypa.io/warnings/venv
Skip pulling license for  bs4
INFO:root:Successfully pulled licenses for 134 dependencies
Removing intermediate container dbdb7a0811c7
 ---> 4fcaafd1149c
Step 29/32 : FROM beam
 ---> b19c056b7f85
Step 30/32 : ARG pull_licenses
 ---> Running in d2909d14b064
Removing intermediate container d2909d14b064
 ---> 6b135ca9d908
Step 31/32 : COPY --from=third_party_licenses /opt/apache/beam/third_party_licenses /opt/apache/beam/third_party_licenses
 ---> b41b6f0dc75d
Step 32/32 : RUN if [ "$pull_licenses" != "true" ] ; then       rm -rf /opt/apache/beam/third_party_licenses ;     fi
 ---> Running in 7dd692f57b8a
Removing intermediate container 7dd692f57b8a
 ---> 0721842b6fb0
Successfully built 0721842b6fb0
Successfully tagged apache/beam_python3.10_sdk:2.46.0.dev

> Task :runners:google-cloud-dataflow-java:buildAndPushDockerPythonContainer
WARNING: `gcloud docker` will not be supported for Docker client versions above 18.03.

As an alternative, use `gcloud auth configure-docker` to configure `docker` to
use `gcloud` as a credential helper, then use `docker` as you would for non-GCR
registries, e.g. `docker pull gcr.io/project-id/my-image`. Add
`--verbosity=error` to silence this warning: `gcloud docker
--verbosity=error -- pull gcr.io/project-id/my-image`.

See: https://cloud.google.com/container-registry/docs/support/deprecation-notices#gcloud-docker


FAILURE: Build failed with an exception.

* What went wrong:
Execution failed for task ':sdks:java:container:pullLicenses'.
> Process 'command './license_scripts/license_script.sh'' finished with non-zero exit value 1

* Try:
> Run with --stacktrace option to get the stack trace.
> Run with --info or --debug option to get more log output.

* Get more help at https://help.gradle.org

Deprecated Gradle features were used in this build, making it incompatible with Gradle 8.0.

You can use '--warning-mode all' to show the individual deprecation warnings and determine if they come from your own scripts or plugins.

See https://docs.gradle.org/7.5.1/userguide/command_line_interface.html#sec:command_line_warnings

Execution optimizations have been disabled for 1 invalid unit(s) of work during this build to ensure correctness.
Please consult deprecation warnings for more details.

BUILD FAILED in 11m 6s
160 actionable tasks: 106 executed, 48 from cache, 6 up-to-date

Publishing build scan...
https://gradle.com/s/pmqneixxg7vvc

Build step 'Invoke Gradle script' changed build result to FAILURE
Build step 'Invoke Gradle script' marked build as failure

---------------------------------------------------------------------
To unsubscribe, e-mail: builds-unsubscribe@beam.apache.org
For additional commands, e-mail: builds-help@beam.apache.org