You are viewing a plain text version of this content. The canonical link for it is here.
Posted to builds@beam.apache.org by Apache Jenkins Server <je...@builds.apache.org> on 2022/07/21 07:17:26 UTC

Build failed in Jenkins: beam_PerformanceTests_InfluxDbIO_IT #2119

See <https://ci-beam.apache.org/job/beam_PerformanceTests_InfluxDbIO_IT/2119/display/redirect>

Changes:


------------------------------------------
[...truncated 148.53 KB...]

> Task :sdks:java:core:compileTestJava FROM-CACHE
Custom actions are attached to task ':sdks:java:core:compileTestJava'.
Build cache key for task ':sdks:java:core:compileTestJava' is d2714c300de3e2252d37c94381022b9e
Task ':sdks:java:core:compileTestJava' is not up-to-date because:
  No history is available.
Loaded cache entry for task ':sdks:java:core:compileTestJava' with cache key d2714c300de3e2252d37c94381022b9e
:sdks:java:core:compileTestJava (Thread[Execution worker for ':',5,main]) completed. Took 0.751 secs.
:sdks:java:core:testClasses (Thread[Execution worker for ':',5,main]) started.

> Task :sdks:java:core:testClasses
Skipping task ':sdks:java:core:testClasses' as it has no actions.
:sdks:java:core:testClasses (Thread[Execution worker for ':',5,main]) completed. Took 0.0 secs.
:sdks:java:core:shadowTestJar (Thread[Execution worker for ':',5,main]) started.

> Task :sdks:java:extensions:google-cloud-platform-core:compileJava FROM-CACHE
Custom actions are attached to task ':sdks:java:extensions:google-cloud-platform-core:compileJava'.
Build cache key for task ':sdks:java:extensions:google-cloud-platform-core:compileJava' is 0a87bb976dec01adf9b27625f0fd560e
Task ':sdks:java:extensions:google-cloud-platform-core:compileJava' is not up-to-date because:
  No history is available.
Loaded cache entry for task ':sdks:java:extensions:google-cloud-platform-core:compileJava' with cache key 0a87bb976dec01adf9b27625f0fd560e
:sdks:java:extensions:google-cloud-platform-core:compileJava (Thread[Execution worker for ':' Thread 7,5,main]) completed. Took 0.081 secs.
:sdks:java:extensions:google-cloud-platform-core:classes (Thread[Execution worker for ':' Thread 7,5,main]) started.

> Task :sdks:java:extensions:google-cloud-platform-core:classes UP-TO-DATE
Skipping task ':sdks:java:extensions:google-cloud-platform-core:classes' as it has no actions.
:sdks:java:extensions:google-cloud-platform-core:classes (Thread[Execution worker for ':' Thread 7,5,main]) completed. Took 0.0 secs.
:sdks:java:extensions:google-cloud-platform-core:jar (Thread[Execution worker for ':' Thread 7,5,main]) started.

> Task :sdks:java:extensions:google-cloud-platform-core:jar
Caching disabled for task ':sdks:java:extensions:google-cloud-platform-core:jar' because:
  Not worth caching
Task ':sdks:java:extensions:google-cloud-platform-core:jar' is not up-to-date because:
  No history is available.
file or directory '<https://ci-beam.apache.org/job/beam_PerformanceTests_InfluxDbIO_IT/ws/src/sdks/java/extensions/google-cloud-platform-core/build/resources/main',> not found
:sdks:java:extensions:google-cloud-platform-core:jar (Thread[Execution worker for ':' Thread 7,5,main]) completed. Took 0.019 secs.
:sdks:java:harness:compileJava (Thread[Execution worker for ':' Thread 7,5,main]) started.

> Task :sdks:java:core:shadowTestJar FROM-CACHE
Build cache key for task ':sdks:java:core:shadowTestJar' is 41f0887cf8de534a3f5f7254199293d2
Task ':sdks:java:core:shadowTestJar' is not up-to-date because:
  No history is available.
Loaded cache entry for task ':sdks:java:core:shadowTestJar' with cache key 41f0887cf8de534a3f5f7254199293d2
:sdks:java:core:shadowTestJar (Thread[Execution worker for ':',5,main]) completed. Took 0.101 secs.
:runners:core-java:compileTestJava (Thread[Execution worker for ':',5,main]) started.

> Task :sdks:java:harness:compileJava FROM-CACHE
Custom actions are attached to task ':sdks:java:harness:compileJava'.
Build cache key for task ':sdks:java:harness:compileJava' is 06f187d39245c4d3202cd2a35955e536
Task ':sdks:java:harness:compileJava' is not up-to-date because:
  No history is available.
Loaded cache entry for task ':sdks:java:harness:compileJava' with cache key 06f187d39245c4d3202cd2a35955e536
:sdks:java:harness:compileJava (Thread[Execution worker for ':' Thread 7,5,main]) completed. Took 0.073 secs.
:sdks:java:harness:classes (Thread[Execution worker for ':' Thread 7,5,main]) started.

> Task :sdks:java:harness:classes UP-TO-DATE
Skipping task ':sdks:java:harness:classes' as it has no actions.
:sdks:java:harness:classes (Thread[Execution worker for ':' Thread 7,5,main]) completed. Took 0.0 secs.
:sdks:java:harness:jar (Thread[Execution worker for ':' Thread 7,5,main]) started.

> Task :sdks:java:harness:jar
Caching disabled for task ':sdks:java:harness:jar' because:
  Not worth caching
Task ':sdks:java:harness:jar' is not up-to-date because:
  No history is available.
file or directory '<https://ci-beam.apache.org/job/beam_PerformanceTests_InfluxDbIO_IT/ws/src/sdks/java/harness/build/resources/main',> not found
:sdks:java:harness:jar (Thread[Execution worker for ':' Thread 7,5,main]) completed. Took 0.06 secs.
:runners:java-fn-execution:compileJava (Thread[Execution worker for ':' Thread 7,5,main]) started.

> Task :runners:java-fn-execution:compileJava FROM-CACHE
Custom actions are attached to task ':runners:java-fn-execution:compileJava'.
Build cache key for task ':runners:java-fn-execution:compileJava' is 995be34f00bcec635f0dbe3c335e676d
Task ':runners:java-fn-execution:compileJava' is not up-to-date because:
  No history is available.
Loaded cache entry for task ':runners:java-fn-execution:compileJava' with cache key 995be34f00bcec635f0dbe3c335e676d
:runners:java-fn-execution:compileJava (Thread[Execution worker for ':' Thread 7,5,main]) completed. Took 0.091 secs.
:runners:java-fn-execution:classes (Thread[Execution worker for ':' Thread 7,5,main]) started.

> Task :runners:java-fn-execution:classes UP-TO-DATE
Skipping task ':runners:java-fn-execution:classes' as it has no actions.
:runners:java-fn-execution:classes (Thread[Execution worker for ':' Thread 7,5,main]) completed. Took 0.0 secs.
:runners:java-fn-execution:jar (Thread[Execution worker for ':' Thread 7,5,main]) started.

> Task :runners:java-fn-execution:jar
Caching disabled for task ':runners:java-fn-execution:jar' because:
  Not worth caching
Task ':runners:java-fn-execution:jar' is not up-to-date because:
  No history is available.
file or directory '<https://ci-beam.apache.org/job/beam_PerformanceTests_InfluxDbIO_IT/ws/src/runners/java-fn-execution/build/resources/main',> not found
:runners:java-fn-execution:jar (Thread[Execution worker for ':' Thread 7,5,main]) completed. Took 0.043 secs.
:runners:direct-java:compileJava (Thread[Execution worker for ':' Thread 7,5,main]) started.

> Task :runners:core-java:compileTestJava FROM-CACHE
Custom actions are attached to task ':runners:core-java:compileTestJava'.
Build cache key for task ':runners:core-java:compileTestJava' is 03fc4ed48c7a8cf1cf247481a4be629e
Task ':runners:core-java:compileTestJava' is not up-to-date because:
  No history is available.
Loaded cache entry for task ':runners:core-java:compileTestJava' with cache key 03fc4ed48c7a8cf1cf247481a4be629e
:runners:core-java:compileTestJava (Thread[Execution worker for ':',5,main]) completed. Took 0.323 secs.
:runners:core-java:testClasses (Thread[Execution worker for ':',5,main]) started.

> Task :runners:core-java:testClasses UP-TO-DATE
Skipping task ':runners:core-java:testClasses' as it has no actions.
:runners:core-java:testClasses (Thread[Execution worker for ':',5,main]) completed. Took 0.0 secs.
:runners:core-java:testJar (Thread[Execution worker for ':',5,main]) started.

> Task :runners:core-java:testJar
Caching disabled for task ':runners:core-java:testJar' because:
  Not worth caching
Task ':runners:core-java:testJar' is not up-to-date because:
  No history is available.
file or directory '<https://ci-beam.apache.org/job/beam_PerformanceTests_InfluxDbIO_IT/ws/src/runners/core-java/build/resources/test',> not found
:runners:core-java:testJar (Thread[Execution worker for ':',5,main]) completed. Took 0.036 secs.

> Task :runners:direct-java:compileJava FROM-CACHE
Custom actions are attached to task ':runners:direct-java:compileJava'.
Build cache key for task ':runners:direct-java:compileJava' is e49e87b05b387f27bdbe7cc3e5146e38
Task ':runners:direct-java:compileJava' is not up-to-date because:
  No history is available.
Loaded cache entry for task ':runners:direct-java:compileJava' with cache key e49e87b05b387f27bdbe7cc3e5146e38
:runners:direct-java:compileJava (Thread[Execution worker for ':' Thread 7,5,main]) completed. Took 0.101 secs.
:runners:direct-java:classes (Thread[Execution worker for ':' Thread 7,5,main]) started.

> Task :runners:direct-java:classes UP-TO-DATE
Skipping task ':runners:direct-java:classes' as it has no actions.
:runners:direct-java:classes (Thread[Execution worker for ':' Thread 7,5,main]) completed. Took 0.0 secs.
:runners:direct-java:shadowJar (Thread[Execution worker for ':' Thread 7,5,main]) started.

> Task :runners:direct-java:shadowJar FROM-CACHE
Custom actions are attached to task ':runners:direct-java:shadowJar'.
Build cache key for task ':runners:direct-java:shadowJar' is 40ae49a65201aa9a603114d9f8cf5ce3
Task ':runners:direct-java:shadowJar' is not up-to-date because:
  No history is available.
Loaded cache entry for task ':runners:direct-java:shadowJar' with cache key 40ae49a65201aa9a603114d9f8cf5ce3
:runners:direct-java:shadowJar (Thread[Execution worker for ':' Thread 7,5,main]) completed. Took 0.299 secs.
:runners:direct-java:compileTestJava (Thread[Execution worker for ':' Thread 7,5,main]) started.

> Task :runners:direct-java:compileTestJava FROM-CACHE
Custom actions are attached to task ':runners:direct-java:compileTestJava'.
Build cache key for task ':runners:direct-java:compileTestJava' is 42b2f5de5ff07403e5db6ab0f8cc8a84
Task ':runners:direct-java:compileTestJava' is not up-to-date because:
  No history is available.
Loaded cache entry for task ':runners:direct-java:compileTestJava' with cache key 42b2f5de5ff07403e5db6ab0f8cc8a84
:runners:direct-java:compileTestJava (Thread[Execution worker for ':' Thread 7,5,main]) completed. Took 0.111 secs.
:runners:direct-java:testClasses (Thread[Execution worker for ':' Thread 7,5,main]) started.

> Task :runners:direct-java:testClasses UP-TO-DATE
Skipping task ':runners:direct-java:testClasses' as it has no actions.
:runners:direct-java:testClasses (Thread[Execution worker for ':' Thread 7,5,main]) completed. Took 0.0 secs.
:runners:direct-java:shadowTestJar (Thread[Execution worker for ':' Thread 7,5,main]) started.

> Task :runners:direct-java:shadowTestJar FROM-CACHE
Build cache key for task ':runners:direct-java:shadowTestJar' is 266ea8b0a356d8e700f365d86bedfc30
Task ':runners:direct-java:shadowTestJar' is not up-to-date because:
  No history is available.
Loaded cache entry for task ':runners:direct-java:shadowTestJar' with cache key 266ea8b0a356d8e700f365d86bedfc30
:runners:direct-java:shadowTestJar (Thread[Execution worker for ':' Thread 7,5,main]) completed. Took 0.199 secs.
:sdks:java:io:influxdb:integrationTest (Thread[Execution worker for ':' Thread 7,5,main]) started.
producer locations for task group 0 (Thread[Execution worker for ':' Thread 3,5,main]) started.
producer locations for task group 0 (Thread[Execution worker for ':' Thread 3,5,main]) completed. Took 0.0 secs.
Gradle Test Executor 248 started executing tests.

> Task :sdks:java:io:influxdb:integrationTest
Custom actions are attached to task ':sdks:java:io:influxdb:integrationTest'.
Build cache key for task ':sdks:java:io:influxdb:integrationTest' is cd1f8c4be56c9a8d849bc24655d3cd51
Task ':sdks:java:io:influxdb:integrationTest' is not up-to-date because:
  Task.upToDateWhen is false.
Starting process 'Gradle Test Executor 248'. Working directory: <https://ci-beam.apache.org/job/beam_PerformanceTests_InfluxDbIO_IT/ws/src/sdks/java/io/influxdb> Command: /usr/lib/jvm/java-8-openjdk-amd64/bin/java -DbeamTestPipelineOptions=["--influxDBURL=http://34.69.59.144:8086","--influxDBUserName=superadmin","--influxDBPassword=supersecretpassword","--databaseName=db1"] -Djava.security.manager=worker.org.gradle.process.internal.worker.child.BootstrapSecurityManager -Dorg.gradle.internal.worker.tmpdir=<https://ci-beam.apache.org/job/beam_PerformanceTests_InfluxDbIO_IT/ws/src/sdks/java/io/influxdb/build/tmp/integrationTest/work> -Dorg.gradle.native=false -Xmx2g -Dfile.encoding=UTF-8 -Duser.country=US -Duser.language=en -Duser.variant -ea -cp /home/jenkins/.gradle/caches/7.4/workerMain/gradle-worker.jar worker.org.gradle.process.internal.worker.GradleWorkerMain 'Gradle Test Executor 248'
Successfully started process 'Gradle Test Executor 248'

org.apache.beam.sdk.io.influxdb.InfluxDbIOIT > testWriteAndReadWithMultipleMetric FAILED
    org.influxdb.InfluxDBIOException: java.net.SocketTimeoutException: connect timed out
        at org.influxdb.impl.InfluxDBImpl.execute(InfluxDBImpl.java:836)
        at org.influxdb.impl.InfluxDBImpl.executeQuery(InfluxDBImpl.java:819)
        at org.influxdb.impl.InfluxDBImpl.query(InfluxDBImpl.java:554)
        at org.apache.beam.sdk.io.influxdb.InfluxDbIOIT.initTest(InfluxDbIOIT.java:99)

        Caused by:
        java.net.SocketTimeoutException: connect timed out
            at java.net.PlainSocketImpl.socketConnect(Native Method)
            at java.net.AbstractPlainSocketImpl.doConnect(AbstractPlainSocketImpl.java:350)
            at java.net.AbstractPlainSocketImpl.connectToAddress(AbstractPlainSocketImpl.java:206)
            at java.net.AbstractPlainSocketImpl.connect(AbstractPlainSocketImpl.java:188)
            at java.net.SocksSocketImpl.connect(SocksSocketImpl.java:392)
            at java.net.Socket.connect(Socket.java:607)
            at okhttp3.internal.platform.Platform.connectSocket(Platform.kt:119)
            at okhttp3.internal.connection.RealConnection.connectSocket(RealConnection.kt:283)
            at okhttp3.internal.connection.RealConnection.connect(RealConnection.kt:195)
            at okhttp3.internal.connection.ExchangeFinder.findConnection(ExchangeFinder.kt:249)
            at okhttp3.internal.connection.ExchangeFinder.findHealthyConnection(ExchangeFinder.kt:108)
            at okhttp3.internal.connection.ExchangeFinder.find(ExchangeFinder.kt:76)
            at okhttp3.internal.connection.RealCall.initExchange$okhttp(RealCall.kt:245)
            at okhttp3.internal.connection.ConnectInterceptor.intercept(ConnectInterceptor.kt:32)
            at okhttp3.internal.http.RealInterceptorChain.proceed(RealInterceptorChain.kt:100)
            at okhttp3.internal.cache.CacheInterceptor.intercept(CacheInterceptor.kt:82)
            at okhttp3.internal.http.RealInterceptorChain.proceed(RealInterceptorChain.kt:100)
            at okhttp3.internal.http.BridgeInterceptor.intercept(BridgeInterceptor.kt:83)
            at okhttp3.internal.http.RealInterceptorChain.proceed(RealInterceptorChain.kt:100)
            at okhttp3.internal.http.RetryAndFollowUpInterceptor.intercept(RetryAndFollowUpInterceptor.kt:76)
            at okhttp3.internal.http.RealInterceptorChain.proceed(RealInterceptorChain.kt:100)
            at org.influxdb.impl.BasicAuthInterceptor.intercept(BasicAuthInterceptor.java:22)
            at okhttp3.internal.http.RealInterceptorChain.proceed(RealInterceptorChain.kt:100)
            at org.influxdb.impl.GzipRequestInterceptor.intercept(GzipRequestInterceptor.java:42)
            at okhttp3.internal.http.RealInterceptorChain.proceed(RealInterceptorChain.kt:100)
            at okhttp3.logging.HttpLoggingInterceptor.intercept(HttpLoggingInterceptor.kt:152)
            at okhttp3.internal.http.RealInterceptorChain.proceed(RealInterceptorChain.kt:100)
            at okhttp3.internal.connection.RealCall.getResponseWithInterceptorChain$okhttp(RealCall.kt:197)
            at okhttp3.internal.connection.RealCall.execute(RealCall.kt:148)
            at retrofit2.OkHttpCall.execute(OkHttpCall.java:190)
            at org.influxdb.impl.InfluxDBImpl.execute(InfluxDBImpl.java:824)
            ... 3 more

Gradle Test Executor 248 finished executing tests.

> Task :sdks:java:io:influxdb:integrationTest FAILED

6 tests completed, 1 failed
Finished generating test XML results (0.0 secs) into: <https://ci-beam.apache.org/job/beam_PerformanceTests_InfluxDbIO_IT/ws/src/sdks/java/io/influxdb/build/test-results/integrationTest>
Generating HTML test report...
Finished generating test html results (0.002 secs) into: <https://ci-beam.apache.org/job/beam_PerformanceTests_InfluxDbIO_IT/ws/src/sdks/java/io/influxdb/build/reports/tests/integrationTest>
:sdks:java:io:influxdb:integrationTest (Thread[Execution worker for ':' Thread 7,5,main]) completed. Took 17.488 secs.

FAILURE: Build failed with an exception.

* What went wrong:
Execution failed for task ':sdks:java:io:influxdb:integrationTest'.
> There were failing tests. See the report at: file://<https://ci-beam.apache.org/job/beam_PerformanceTests_InfluxDbIO_IT/ws/src/sdks/java/io/influxdb/build/reports/tests/integrationTest/index.html>

* Try:
> Run with --stacktrace option to get the stack trace.
> Run with --debug option to get more log output.
> Run with --scan to get full insights.

* Get more help at https://help.gradle.org

Deprecated Gradle features were used in this build, making it incompatible with Gradle 8.0.

You can use '--warning-mode all' to show the individual deprecation warnings and determine if they come from your own scripts or plugins.

See https://docs.gradle.org/7.4/userguide/command_line_interface.html#sec:command_line_warnings

BUILD FAILED in 25s
77 actionable tasks: 42 executed, 33 from cache, 2 up-to-date

Publishing build scan...
https://gradle.com/s/fkadvxl3cxh6y

Build step 'Invoke Gradle script' changed build result to FAILURE
Build step 'Invoke Gradle script' marked build as failure

---------------------------------------------------------------------
To unsubscribe, e-mail: builds-unsubscribe@beam.apache.org
For additional commands, e-mail: builds-help@beam.apache.org


Jenkins build is back to normal : beam_PerformanceTests_InfluxDbIO_IT #2121

Posted by Apache Jenkins Server <je...@builds.apache.org>.
See <https://ci-beam.apache.org/job/beam_PerformanceTests_InfluxDbIO_IT/2121/display/redirect?page=changes>


---------------------------------------------------------------------
To unsubscribe, e-mail: builds-unsubscribe@beam.apache.org
For additional commands, e-mail: builds-help@beam.apache.org


Build failed in Jenkins: beam_PerformanceTests_InfluxDbIO_IT #2120

Posted by Apache Jenkins Server <je...@builds.apache.org>.
See <https://ci-beam.apache.org/job/beam_PerformanceTests_InfluxDbIO_IT/2120/display/redirect>

Changes:


------------------------------------------
[...truncated 146.97 KB...]

> Task :sdks:java:core:compileTestJava FROM-CACHE
Custom actions are attached to task ':sdks:java:core:compileTestJava'.
Build cache key for task ':sdks:java:core:compileTestJava' is d2714c300de3e2252d37c94381022b9e
Task ':sdks:java:core:compileTestJava' is not up-to-date because:
  No history is available.
Loaded cache entry for task ':sdks:java:core:compileTestJava' with cache key d2714c300de3e2252d37c94381022b9e
:sdks:java:core:compileTestJava (Thread[Execution worker for ':' Thread 3,5,main]) completed. Took 0.797 secs.
:sdks:java:core:testClasses (Thread[Execution worker for ':' Thread 3,5,main]) started.

> Task :sdks:java:core:testClasses
Skipping task ':sdks:java:core:testClasses' as it has no actions.
:sdks:java:core:testClasses (Thread[Execution worker for ':' Thread 3,5,main]) completed. Took 0.0 secs.
:sdks:java:core:shadowTestJar (Thread[Execution worker for ':' Thread 7,5,main]) started.

> Task :sdks:java:extensions:google-cloud-platform-core:compileJava FROM-CACHE
Custom actions are attached to task ':sdks:java:extensions:google-cloud-platform-core:compileJava'.
Build cache key for task ':sdks:java:extensions:google-cloud-platform-core:compileJava' is 0a87bb976dec01adf9b27625f0fd560e
Task ':sdks:java:extensions:google-cloud-platform-core:compileJava' is not up-to-date because:
  No history is available.
Loaded cache entry for task ':sdks:java:extensions:google-cloud-platform-core:compileJava' with cache key 0a87bb976dec01adf9b27625f0fd560e
:sdks:java:extensions:google-cloud-platform-core:compileJava (Thread[Execution worker for ':' Thread 6,5,main]) completed. Took 0.087 secs.
:sdks:java:extensions:google-cloud-platform-core:classes (Thread[Execution worker for ':' Thread 6,5,main]) started.

> Task :sdks:java:extensions:google-cloud-platform-core:classes UP-TO-DATE
Skipping task ':sdks:java:extensions:google-cloud-platform-core:classes' as it has no actions.
:sdks:java:extensions:google-cloud-platform-core:classes (Thread[Execution worker for ':' Thread 6,5,main]) completed. Took 0.0 secs.
:sdks:java:extensions:google-cloud-platform-core:jar (Thread[Execution worker for ':' Thread 6,5,main]) started.

> Task :sdks:java:extensions:google-cloud-platform-core:jar
Caching disabled for task ':sdks:java:extensions:google-cloud-platform-core:jar' because:
  Not worth caching
Task ':sdks:java:extensions:google-cloud-platform-core:jar' is not up-to-date because:
  No history is available.
file or directory '<https://ci-beam.apache.org/job/beam_PerformanceTests_InfluxDbIO_IT/ws/src/sdks/java/extensions/google-cloud-platform-core/build/resources/main',> not found
:sdks:java:extensions:google-cloud-platform-core:jar (Thread[Execution worker for ':' Thread 6,5,main]) completed. Took 0.019 secs.
:sdks:java:harness:compileJava (Thread[Execution worker for ':' Thread 6,5,main]) started.

> Task :sdks:java:core:shadowTestJar FROM-CACHE
Build cache key for task ':sdks:java:core:shadowTestJar' is 41f0887cf8de534a3f5f7254199293d2
Task ':sdks:java:core:shadowTestJar' is not up-to-date because:
  No history is available.
Loaded cache entry for task ':sdks:java:core:shadowTestJar' with cache key 41f0887cf8de534a3f5f7254199293d2
:sdks:java:core:shadowTestJar (Thread[Execution worker for ':' Thread 7,5,main]) completed. Took 0.1 secs.
:runners:core-java:compileTestJava (Thread[Execution worker for ':' Thread 7,5,main]) started.

> Task :sdks:java:harness:compileJava FROM-CACHE
Custom actions are attached to task ':sdks:java:harness:compileJava'.
Build cache key for task ':sdks:java:harness:compileJava' is 06f187d39245c4d3202cd2a35955e536
Task ':sdks:java:harness:compileJava' is not up-to-date because:
  No history is available.
Loaded cache entry for task ':sdks:java:harness:compileJava' with cache key 06f187d39245c4d3202cd2a35955e536
:sdks:java:harness:compileJava (Thread[Execution worker for ':' Thread 6,5,main]) completed. Took 0.079 secs.
:sdks:java:harness:classes (Thread[Execution worker for ':' Thread 6,5,main]) started.

> Task :sdks:java:harness:classes UP-TO-DATE
Skipping task ':sdks:java:harness:classes' as it has no actions.
:sdks:java:harness:classes (Thread[Execution worker for ':' Thread 6,5,main]) completed. Took 0.0 secs.
:sdks:java:harness:jar (Thread[Execution worker for ':' Thread 6,5,main]) started.

> Task :sdks:java:harness:jar
Caching disabled for task ':sdks:java:harness:jar' because:
  Not worth caching
Task ':sdks:java:harness:jar' is not up-to-date because:
  No history is available.
file or directory '<https://ci-beam.apache.org/job/beam_PerformanceTests_InfluxDbIO_IT/ws/src/sdks/java/harness/build/resources/main',> not found
:sdks:java:harness:jar (Thread[Execution worker for ':' Thread 6,5,main]) completed. Took 0.059 secs.
:runners:java-fn-execution:compileJava (Thread[Execution worker for ':' Thread 6,5,main]) started.

> Task :runners:java-fn-execution:compileJava FROM-CACHE
Custom actions are attached to task ':runners:java-fn-execution:compileJava'.
Build cache key for task ':runners:java-fn-execution:compileJava' is 995be34f00bcec635f0dbe3c335e676d
Task ':runners:java-fn-execution:compileJava' is not up-to-date because:
  No history is available.
Loaded cache entry for task ':runners:java-fn-execution:compileJava' with cache key 995be34f00bcec635f0dbe3c335e676d
:runners:java-fn-execution:compileJava (Thread[Execution worker for ':' Thread 6,5,main]) completed. Took 0.208 secs.
:runners:java-fn-execution:classes (Thread[Execution worker for ':' Thread 6,5,main]) started.

> Task :runners:java-fn-execution:classes UP-TO-DATE
Skipping task ':runners:java-fn-execution:classes' as it has no actions.
:runners:java-fn-execution:classes (Thread[Execution worker for ':' Thread 6,5,main]) completed. Took 0.0 secs.
:runners:java-fn-execution:jar (Thread[Execution worker for ':' Thread 2,5,main]) started.

> Task :runners:java-fn-execution:jar
Caching disabled for task ':runners:java-fn-execution:jar' because:
  Not worth caching
Task ':runners:java-fn-execution:jar' is not up-to-date because:
  No history is available.
file or directory '<https://ci-beam.apache.org/job/beam_PerformanceTests_InfluxDbIO_IT/ws/src/runners/java-fn-execution/build/resources/main',> not found
:runners:java-fn-execution:jar (Thread[Execution worker for ':' Thread 2,5,main]) completed. Took 0.042 secs.
:runners:direct-java:compileJava (Thread[Execution worker for ':' Thread 2,5,main]) started.

> Task :runners:direct-java:compileJava FROM-CACHE
Custom actions are attached to task ':runners:direct-java:compileJava'.
Build cache key for task ':runners:direct-java:compileJava' is e49e87b05b387f27bdbe7cc3e5146e38
Task ':runners:direct-java:compileJava' is not up-to-date because:
  No history is available.
Loaded cache entry for task ':runners:direct-java:compileJava' with cache key e49e87b05b387f27bdbe7cc3e5146e38
:runners:direct-java:compileJava (Thread[Execution worker for ':' Thread 2,5,main]) completed. Took 0.085 secs.
:runners:direct-java:classes (Thread[Execution worker for ':' Thread 2,5,main]) started.

> Task :runners:direct-java:classes UP-TO-DATE
Skipping task ':runners:direct-java:classes' as it has no actions.
:runners:direct-java:classes (Thread[Execution worker for ':' Thread 2,5,main]) completed. Took 0.0 secs.
:runners:direct-java:shadowJar (Thread[Execution worker for ':' Thread 3,5,main]) started.

> Task :runners:core-java:compileTestJava FROM-CACHE
Custom actions are attached to task ':runners:core-java:compileTestJava'.
Build cache key for task ':runners:core-java:compileTestJava' is 03fc4ed48c7a8cf1cf247481a4be629e
Task ':runners:core-java:compileTestJava' is not up-to-date because:
  No history is available.
Loaded cache entry for task ':runners:core-java:compileTestJava' with cache key 03fc4ed48c7a8cf1cf247481a4be629e
:runners:core-java:compileTestJava (Thread[Execution worker for ':' Thread 7,5,main]) completed. Took 0.477 secs.
:runners:core-java:testClasses (Thread[Execution worker for ':' Thread 7,5,main]) started.

> Task :runners:core-java:testClasses UP-TO-DATE
Skipping task ':runners:core-java:testClasses' as it has no actions.
:runners:core-java:testClasses (Thread[Execution worker for ':' Thread 7,5,main]) completed. Took 0.0 secs.
:runners:core-java:testJar (Thread[Execution worker for ':' Thread 7,5,main]) started.

> Task :runners:core-java:testJar
Caching disabled for task ':runners:core-java:testJar' because:
  Not worth caching
Task ':runners:core-java:testJar' is not up-to-date because:
  No history is available.
file or directory '<https://ci-beam.apache.org/job/beam_PerformanceTests_InfluxDbIO_IT/ws/src/runners/core-java/build/resources/test',> not found
:runners:core-java:testJar (Thread[Execution worker for ':' Thread 7,5,main]) completed. Took 0.038 secs.

> Task :runners:direct-java:shadowJar FROM-CACHE
Custom actions are attached to task ':runners:direct-java:shadowJar'.
Build cache key for task ':runners:direct-java:shadowJar' is 40ae49a65201aa9a603114d9f8cf5ce3
Task ':runners:direct-java:shadowJar' is not up-to-date because:
  No history is available.
Loaded cache entry for task ':runners:direct-java:shadowJar' with cache key 40ae49a65201aa9a603114d9f8cf5ce3
:runners:direct-java:shadowJar (Thread[Execution worker for ':' Thread 3,5,main]) completed. Took 0.3 secs.
:runners:direct-java:compileTestJava (Thread[Execution worker for ':' Thread 3,5,main]) started.

> Task :runners:direct-java:compileTestJava FROM-CACHE
Custom actions are attached to task ':runners:direct-java:compileTestJava'.
Build cache key for task ':runners:direct-java:compileTestJava' is 42b2f5de5ff07403e5db6ab0f8cc8a84
Task ':runners:direct-java:compileTestJava' is not up-to-date because:
  No history is available.
Loaded cache entry for task ':runners:direct-java:compileTestJava' with cache key 42b2f5de5ff07403e5db6ab0f8cc8a84
:runners:direct-java:compileTestJava (Thread[Execution worker for ':' Thread 3,5,main]) completed. Took 0.091 secs.
:runners:direct-java:testClasses (Thread[Execution worker for ':' Thread 3,5,main]) started.

> Task :runners:direct-java:testClasses UP-TO-DATE
Skipping task ':runners:direct-java:testClasses' as it has no actions.
:runners:direct-java:testClasses (Thread[Execution worker for ':' Thread 3,5,main]) completed. Took 0.0 secs.
:runners:direct-java:shadowTestJar (Thread[included builds,5,main]) started.

> Task :runners:direct-java:shadowTestJar FROM-CACHE
Build cache key for task ':runners:direct-java:shadowTestJar' is 266ea8b0a356d8e700f365d86bedfc30
Task ':runners:direct-java:shadowTestJar' is not up-to-date because:
  No history is available.
Loaded cache entry for task ':runners:direct-java:shadowTestJar' with cache key 266ea8b0a356d8e700f365d86bedfc30
:runners:direct-java:shadowTestJar (Thread[included builds,5,main]) completed. Took 0.204 secs.
:sdks:java:io:influxdb:integrationTest (Thread[included builds,5,main]) started.
producer locations for task group 0 (Thread[Execution worker for ':',5,main]) started.
producer locations for task group 0 (Thread[Execution worker for ':',5,main]) completed. Took 0.0 secs.
Gradle Test Executor 267 started executing tests.

> Task :sdks:java:io:influxdb:integrationTest
Custom actions are attached to task ':sdks:java:io:influxdb:integrationTest'.
Build cache key for task ':sdks:java:io:influxdb:integrationTest' is cd1f8c4be56c9a8d849bc24655d3cd51
Task ':sdks:java:io:influxdb:integrationTest' is not up-to-date because:
  Task.upToDateWhen is false.
Starting process 'Gradle Test Executor 267'. Working directory: <https://ci-beam.apache.org/job/beam_PerformanceTests_InfluxDbIO_IT/ws/src/sdks/java/io/influxdb> Command: /usr/lib/jvm/java-8-openjdk-amd64/bin/java -DbeamTestPipelineOptions=["--influxDBURL=http://34.172.11.44:8086","--influxDBUserName=superadmin","--influxDBPassword=supersecretpassword","--databaseName=db1"] -Djava.security.manager=worker.org.gradle.process.internal.worker.child.BootstrapSecurityManager -Dorg.gradle.internal.worker.tmpdir=<https://ci-beam.apache.org/job/beam_PerformanceTests_InfluxDbIO_IT/ws/src/sdks/java/io/influxdb/build/tmp/integrationTest/work> -Dorg.gradle.native=false -Xmx2g -Dfile.encoding=UTF-8 -Duser.country=US -Duser.language=en -Duser.variant -ea -cp /home/jenkins/.gradle/caches/7.4/workerMain/gradle-worker.jar worker.org.gradle.process.internal.worker.GradleWorkerMain 'Gradle Test Executor 267'
Successfully started process 'Gradle Test Executor 267'

org.apache.beam.sdk.io.influxdb.InfluxDbIOIT > testWriteAndReadWithMultipleMetric FAILED
    org.influxdb.InfluxDBIOException: java.net.SocketTimeoutException: connect timed out
        at org.influxdb.impl.InfluxDBImpl.execute(InfluxDBImpl.java:836)
        at org.influxdb.impl.InfluxDBImpl.executeQuery(InfluxDBImpl.java:819)
        at org.influxdb.impl.InfluxDBImpl.query(InfluxDBImpl.java:554)
        at org.apache.beam.sdk.io.influxdb.InfluxDbIOIT.initTest(InfluxDbIOIT.java:99)

        Caused by:
        java.net.SocketTimeoutException: connect timed out
            at java.net.PlainSocketImpl.socketConnect(Native Method)
            at java.net.AbstractPlainSocketImpl.doConnect(AbstractPlainSocketImpl.java:350)
            at java.net.AbstractPlainSocketImpl.connectToAddress(AbstractPlainSocketImpl.java:206)
            at java.net.AbstractPlainSocketImpl.connect(AbstractPlainSocketImpl.java:188)
            at java.net.SocksSocketImpl.connect(SocksSocketImpl.java:392)
            at java.net.Socket.connect(Socket.java:607)
            at okhttp3.internal.platform.Platform.connectSocket(Platform.kt:119)
            at okhttp3.internal.connection.RealConnection.connectSocket(RealConnection.kt:283)
            at okhttp3.internal.connection.RealConnection.connect(RealConnection.kt:195)
            at okhttp3.internal.connection.ExchangeFinder.findConnection(ExchangeFinder.kt:249)
            at okhttp3.internal.connection.ExchangeFinder.findHealthyConnection(ExchangeFinder.kt:108)
            at okhttp3.internal.connection.ExchangeFinder.find(ExchangeFinder.kt:76)
            at okhttp3.internal.connection.RealCall.initExchange$okhttp(RealCall.kt:245)
            at okhttp3.internal.connection.ConnectInterceptor.intercept(ConnectInterceptor.kt:32)
            at okhttp3.internal.http.RealInterceptorChain.proceed(RealInterceptorChain.kt:100)
            at okhttp3.internal.cache.CacheInterceptor.intercept(CacheInterceptor.kt:82)
            at okhttp3.internal.http.RealInterceptorChain.proceed(RealInterceptorChain.kt:100)
            at okhttp3.internal.http.BridgeInterceptor.intercept(BridgeInterceptor.kt:83)
            at okhttp3.internal.http.RealInterceptorChain.proceed(RealInterceptorChain.kt:100)
            at okhttp3.internal.http.RetryAndFollowUpInterceptor.intercept(RetryAndFollowUpInterceptor.kt:76)
            at okhttp3.internal.http.RealInterceptorChain.proceed(RealInterceptorChain.kt:100)
            at org.influxdb.impl.BasicAuthInterceptor.intercept(BasicAuthInterceptor.java:22)
            at okhttp3.internal.http.RealInterceptorChain.proceed(RealInterceptorChain.kt:100)
            at org.influxdb.impl.GzipRequestInterceptor.intercept(GzipRequestInterceptor.java:42)
            at okhttp3.internal.http.RealInterceptorChain.proceed(RealInterceptorChain.kt:100)
            at okhttp3.logging.HttpLoggingInterceptor.intercept(HttpLoggingInterceptor.kt:152)
            at okhttp3.internal.http.RealInterceptorChain.proceed(RealInterceptorChain.kt:100)
            at okhttp3.internal.connection.RealCall.getResponseWithInterceptorChain$okhttp(RealCall.kt:197)
            at okhttp3.internal.connection.RealCall.execute(RealCall.kt:148)
            at retrofit2.OkHttpCall.execute(OkHttpCall.java:190)
            at org.influxdb.impl.InfluxDBImpl.execute(InfluxDBImpl.java:824)
            ... 3 more

Gradle Test Executor 267 finished executing tests.

> Task :sdks:java:io:influxdb:integrationTest FAILED

6 tests completed, 1 failed
Finished generating test XML results (0.001 secs) into: <https://ci-beam.apache.org/job/beam_PerformanceTests_InfluxDbIO_IT/ws/src/sdks/java/io/influxdb/build/test-results/integrationTest>
Generating HTML test report...
Finished generating test html results (0.001 secs) into: <https://ci-beam.apache.org/job/beam_PerformanceTests_InfluxDbIO_IT/ws/src/sdks/java/io/influxdb/build/reports/tests/integrationTest>
:sdks:java:io:influxdb:integrationTest (Thread[included builds,5,main]) completed. Took 23.968 secs.

FAILURE: Build failed with an exception.

* What went wrong:
Execution failed for task ':sdks:java:io:influxdb:integrationTest'.
> There were failing tests. See the report at: file://<https://ci-beam.apache.org/job/beam_PerformanceTests_InfluxDbIO_IT/ws/src/sdks/java/io/influxdb/build/reports/tests/integrationTest/index.html>

* Try:
> Run with --stacktrace option to get the stack trace.
> Run with --debug option to get more log output.
> Run with --scan to get full insights.

* Get more help at https://help.gradle.org

Deprecated Gradle features were used in this build, making it incompatible with Gradle 8.0.

You can use '--warning-mode all' to show the individual deprecation warnings and determine if they come from your own scripts or plugins.

See https://docs.gradle.org/7.4/userguide/command_line_interface.html#sec:command_line_warnings

BUILD FAILED in 32s
77 actionable tasks: 42 executed, 33 from cache, 2 up-to-date

Publishing build scan...
https://gradle.com/s/pqefd2rmgl3ks

Build step 'Invoke Gradle script' changed build result to FAILURE
Build step 'Invoke Gradle script' marked build as failure

---------------------------------------------------------------------
To unsubscribe, e-mail: builds-unsubscribe@beam.apache.org
For additional commands, e-mail: builds-help@beam.apache.org